{"text_format":"1","workbook":"xlsx","n_sheets":16,"sheets":["Riskk","Login","Main","UTMC001","UTMC002","UTMC005","UTMC006","UTMC007","UTMC008","UTMC009","PvTable","InFundGrp","InMstHst","Mapping","DataUTMC8","DataUTMC9"],"not_rendered":{"charts":0,"images":1,"macros":1,"external_links":1,"defined_names":210,"comments":0,"pivot_tables":5},"unopened":[],"bounds":{"document_bytes":16777216,"sheet_cells":100000,"rows_first":2000,"rows_last":500,"rows_between":2000,"halvings":0,"cell_chars":16384,"cell_head_chars":4096},"cells_cut":0,"cells_raw":0,"read":"whole","date_system":"1900"}

{"sheet":"Riskk","index":0,"n_rows":6,"n_cols":11,"rows_kept":6,"cut":false,"hidden":true,"merged":[]}
["LSL","UPSW",null,null,null,null,null,{"$f":"COUNT(H3:H26)","v":0},false]
["LSL","Userid",null,null,null,null,null,"Main/sub","Caption","On Action","NewGroup"]
[3,"UserLevel"]
["2010-09-09T15:20:33","LoginTime"]
[null,"LogoutTime"]
["MYR","Global Ccy"]

{"sheet":"Login","index":1,"n_rows":24,"n_cols":11,"rows_kept":24,"cut":false,"hidden":false,"merged":[[23,10,23,12],[9,2,9,11]]}
[]
[]
[]
[]
[]
[]
[]
[]
[]
[null,null,"UTMC EXPORT FILE"]
[]
[]
[]
[]
[]
[]
[]
[]
[]
[]
{"$rows_left_out":5}
{"sheet":"Main","index":2,"n_rows":24,"n_cols":11,"rows_kept":24,"cut":false,"hidden":true,"merged":[[2,0,2,7],[9,1,10,1],[9,2,10,2]]}
[null,null,null,null,null,null,null,null,null,null,"DatePart1"]
[null,null,null,null,null,null,null,null,null,null,1]
["UTMC EXPORE FILE"]
[]
[]
[null,null,null,null,null,"Asset Class","Map Asset Class",null,null,"Asset Class Code","Asset Class Name"]
[null,"Report Date","2020-08-31",null,null,"BND","BO",null,null,"EQ","Equities"]
[null,"Fund Group Code","epf",null,null,"O-BND","BO",null,null,"BO","Bonds"]
[null,"EPF IPD Code","IPD014",null,null,"CSH","MM",null,null,"MM","Money Markets"]
[null,"IPD Name","TA Investment Management Bhd",null,null,"O-CSH","MM",null,null,"CA","Cash/Receivable/Payable"]
[null,null,null,null,null,"EQT","EQ",null,null,"FU","Funds"]
[null,"Prepared By (Name)","Jason",null,null,"O-EQT","EQ",null,null,"AL","Alternatives"]
[null,"Prepared By (Designation)","Associate",null,null,"TBI","CA",null,null,"DE","Derivatives"]
[null,"Prepared By (Date)","2020-09-07",null,null,"CIS","MM"]
[null,"Verified By (Name)","Terry",null,null,"DCI"]
[null,"Verified By (Designation)","Manager",null,null,"DEV","DE"]
[null,"Verified By (Date)","2020-09-07",null,null,"FRX"]
[null,"Start From","2010-05-31"]
[null,"Yearly",false]
[null,null,null,null,null,"OTC"]
{"$rows_left_out":5}
{"sheet":"UTMC001","index":3,"n_rows":1,"n_cols":2,"rows_kept":1,"cut":false,"hidden":true,"merged":[]}
["IPD014","TA Investment Management Bhd"]

{"sheet":"UTMC002","index":4,"n_rows":7,"n_cols":10,"rows_kept":7,"cut":false,"hidden":true,"merged":[]}
["IPD014","UTMC001",1,2,"Jason","Associate","2020-09-07","Terry","Manager","2020-09-07"]
["IPD014","UTMC002",7,10,"Jason","Associate","2020-09-07","Terry","Manager","2020-09-07"]
["IPD014","UTMC005",40,5,"Jason","Associate","2020-09-07","Terry","Manager","2020-09-07"]
["IPD014","UTMC006",118,5,"Jason","Associate","2020-09-07","Terry","Manager","2020-09-07"]
["IPD014","UTMC007",13,5,"Jason","Associate","2020-09-07","Terry","Manager","2020-09-07"]
["IPD014","UTMC008",1,6,"Jason","Associate","2020-09-07","Terry","Manager","2020-09-07"]
["IPD014","UTMC009",1,5,"Jason","Associate","2020-09-07","Terry","Manager","2020-09-07"]

{"sheet":"UTMC005","index":5,"n_rows":40,"n_cols":5,"rows_kept":40,"cut":false,"hidden":true,"merged":[]}
["IPD014",1,"2020-08-31","EQ",87.87]
["IPD014",1,"2020-08-31","MM",8.0299999999999994]
["IPD014",1,"2020-08-31","CA",1.82]
["IPD014",1,"2020-08-31","FU",2.2799999999999998]
["IPD014",2,"2020-08-31","EQ",89.6]
["IPD014",2,"2020-08-31","MM",3.98]
["IPD014",2,"2020-08-31","CA",4.67]
["IPD014",2,"2020-08-31","FU",1.75]
["IPD014",3,"2020-08-31","EQ",91.47]
["IPD014",3,"2020-08-31","MM",5.5]
["IPD014",3,"2020-08-31","CA",3.03]
["IPD014",4,"2020-08-31","EQ",56.09]
["IPD014",4,"2020-08-31","MM",43.65]
["IPD014",4,"2020-08-31","CA",0.26]
["IPD014",5,"2020-08-31","EQ",92.24]
["IPD014",5,"2020-08-31","MM",1.85]
["IPD014",5,"2020-08-31","CA",0.87]
["IPD014",5,"2020-08-31","FU",2.89]
["IPD014",5,"2020-08-31","DE",2.15]
["IPD014",7,"2020-08-31","EQ",84.34]
{"$rows_left_out":21}
{"sheet":"UTMC006","index":6,"n_rows":118,"n_cols":5,"rows_kept":118,"cut":false,"hidden":true,"merged":[]}
["IPD014",1,"2020-08-31",null,0]
["IPD014",1,"2020-08-31",null,0]
["IPD014",1,"2020-08-31",null,0]
["IPD014",1,"2020-08-31",null,0]
["IPD014",1,"2020-08-31",null,0]
["IPD014",1,"2020-08-31",null,0]
["IPD014",1,"2020-08-31",null,0]
["IPD014",1,"2020-08-31",null,0]
["IPD014",1,"2020-08-31",null,0]
["IPD014",1,"2020-08-31",null,0]
["IPD014",1,"2020-08-31",null,0]
["IPD014",1,"2020-08-31",null,0]
["IPD014",1,"2020-08-31",null,0]
["IPD014",1,"2020-08-31",null,0]
["IPD014",1,"2020-08-31",null,0]
["IPD014",1,"2020-08-31",null,0]
["IPD014",1,"2020-08-31",null,0]
["IPD014",2,"2020-08-31",null,0]
["IPD014",2,"2020-08-31",null,0]
["IPD014",2,"2020-08-31",null,0]
{"$rows_left_out":99}
{"sheet":"UTMC007","index":7,"n_rows":13,"n_cols":5,"rows_kept":13,"cut":false,"hidden":true,"merged":[]}
["IPD014",1,"2020-08-31","C",100]
["IPD014",2,"2020-08-31","C",100]
["IPD014",3,"2020-08-31","S",100]
["IPD014",4,"2020-08-31","C",100]
["IPD014",5,"2020-08-31","C",100]
["IPD014",7,"2020-08-31","S",100]
["IPD014",9,"2020-08-31","S",100]
["IPD014",11,"2020-08-31","C",100]
["IPD014",12,"2020-08-31","S",100]
["IPD014",13,"2020-08-31","C",100]
["IPD014",14,"2020-08-31","C",100]
["IPD014",15,"2020-08-31","S",100]
["IPD014",28,"2020-08-31","C",100]

{"sheet":"UTMC008","index":8,"n_rows":1,"n_cols":5,"rows_kept":1,"cut":false,"hidden":true,"merged":[]}
["IPD014",1,"2020-08-31","AU","AU"]

{"sheet":"UTMC009","index":9,"n_rows":1,"n_cols":4,"rows_kept":1,"cut":false,"hidden":true,"merged":[]}
["IPD014",1,"2020-08-31","AUD"]

{"sheet":"PvTable","index":10,"n_rows":124,"n_cols":27,"rows_kept":124,"cut":false,"hidden":true,"merged":[]}
["UTMC005",null,null,null,null,"UTMC006",null,null,null,null,"UTMC007",null,null,null,null,"UTMC008",null,null,null,null,null,null,null,"UTMC009"]
[]
[]
["Sum of MarketValueFC",null,null,null,null,"Sum of MarketValueFC",null,null,null,null,"Sum of MarketValueFC",null,null,null,null,null,null,null,"Data",null,null,null,null,null,null,"Data"]
["MapFundCode","MapAssetClass","NAV","Total",null,"MapFundCode","SectorCode","Fund2Total","Total",null,"MapFundCode","EPFType","NAV","Total",null,"MapFundCode","qCountryID","ListedCountry","Sum of Total","Sum of amount",null,null,null,"MapFundCode","qCurrencyCode","Sum of Total","Sum of Amount"]
[1,"EQ",24962678.760000002,21935063.790000003,null,1,0,24507503.960000005,2543743.4699999997,null,1,"C",24962678.760000002,24962678.760000005,null,1,"AU","AU",null,1537556.67,null,null,null,1,"AUD",null,1641083.777892]
[null,"MM",24962678.760000002,2003393.4700000002,null,null,31,24507503.960000005,569046.69999999995,null,2,"C",15990892.609999999,15990892.610000001,null,null,"HK","HK",null,1726991.3399999999,null,null,null,null,"HKD",null,2195451.3886859999]
[null,"CA",24962678.760000002,455174.80000000028,null,null,4,24507503.960000005,1639879.88,null,3,"S",55935751.590000004,55935751.590000004,null,null,"MY","MY",null,20059998.830000002,null,null,null,null,"MYR",null,19804158.510000002]
[null,"FU",24962678.760000002,569046.69999999995,null,null,16,24507503.960000005,5720669.0299999993,null,4,"C",4443557.84,4443557.8399999989,null,null,"SG","SG",null,902704.92,null,null,null,null,"SGD",null,34773.798972000004]
[2,"EQ",15990892.609999999,14327192.099999998,null,null,6,24507503.960000005,474300,null,5,"C",6341697.6600000001,6341697.6600000011,null,null,"TH","TH",null,735427,null,null,null,null,"THB",null,735427]
[null,"MM",15990892.609999999,635965.62,null,null,21,24507503.960000005,132000,null,7,"S",26198127.359999999,26198127.360000003,null,2,"AU","AU",null,257924.90000000002,null,null,null,null,"USD",null,950453.23947000003]
[null,"CA",15990892.609999999,747517.50000000023,null,null,40,24507503.960000005,1207631.1499999999,null,9,"S",20296296,20296296.000000004,null,null,"HK","HK",null,1072094.57,null,null,null,2,"AUD",null,441372.87083600007]
[null,"FU",15990892.609999999,280217.39,null,null,15,24507503.960000005,254400,null,11,"C",1624227.35,1624227.3499999999,null,null,"MY","MY",null,13716310.24,null,null,null,null,"GBP",null,1074.1448519999994]
[3,"EQ",55935751.590000004,51166642.039999999,null,null,43,24507503.960000005,1768898.1400000001,null,12,"S",10046983.25,10046983.250000002,null,null,"SG","SG",null,503306.7,null,null,null,null,"HKD",null,1382108.7598230001]
[null,"MM",55935751.590000004,3076525.7,null,null,8,24507503.960000005,891000,null,13,"C",29722319.989999998,29722319.989999995,null,null,"TH","TH",null,441256.2,null,null,null,null,"MYR",null,12761766.220000001]
[null,"CA",55935751.590000004,1692583.8500000003,null,null,1,24507503.960000005,515700,null,14,"C",51665977,51665977,null,3,"AU","AU",null,992709.9,null,null,null,null,"SGD",null,27570.947321]
[4,"EQ",4443557.84,2492574.2999999998,null,null,5,24507503.960000005,2075435.1,null,15,"S",9917375.8399999999,9917375.8399999999,null,null,"HK","HK",null,1100947.58,null,null,null,null,"THB",null,441256.2]
[null,"MM",4443557.84,1939768.1500000001,null,null,9,24507503.960000005,3526747,null,28,"C",1172933.3600000001,1172933.3600000001,null,null,"MY","MY",null,53842094.110000007,null,null,null,null,"USD",null,521690.42473999999]
[null,"CA",4443557.84,11215.389999999996,null,null,2,24507503.960000005,1408542,null,"Grand Total",null,null,258318818.61000004,null,4,"HK","HK",null,236947.04,null,null,null,3,"AUD",null,1010649.12858]
[5,"EQ",6341697.6600000001,5849308.3500000006,null,null,42,24507503.960000005,662874.03,null,null,null,null,null,null,null,"MY","MY",null,4206610.8,null,null,null,null,"HKD",null,2028541.7522640002]
{"$rows_left_out":105}
{"sheet":"InFundGrp","index":11,"n_rows":14,"n_cols":1,"rows_kept":14,"cut":false,"hidden":true,"merged":[]}
["qFundCode"]
["TAADIF"]
["TACF"]
["TADF"]
["TADO"]
["TAEURO"]
["TAGAAF"]
["TAGF"]
["TAIB"]
["TAICP"]
["TAIF"]
["TAINC"]
["TASCAP"]
["TRFIF"]

{"sheet":"InMstHst","index":12,"n_rows":567,"n_cols":17,"rows_kept":567,"cut":false,"hidden":true,"merged":[]}
["MarketValueFC","NAV","PercNAV","qFundCode","FundName","qStockCode","qProductType","SectorCode","qAssetClass","EPFType","CountryCode","ListedCountryCode","CurrencyCode","FundTotal","Fund2Total","MapAssetClass","MapFundCode"]
[481250,26198127.359999999,1.8369633576741267,"TADO","TA Dana Optimix","1900-01-10","EQT",0,"EQT","S","MY","MY","MYR",26198127.359999999,24631490.600000001,"EQ",{"$f":"IFERROR(VLOOKUP(D:D,Mapping!B:C,2,0),D:D)","v":7}]
[96250,6341697.6600000001,1.5177323984883884,"TASF","TA Small Cap Fund","1900-01-10","EQT",0,"EQT","C","MY","MY","MYR",6341697.6600000011,6285785.5900000008,"EQ",{"$f":"IFERROR(VLOOKUP(D:D,Mapping!B:C,2,0),D:D)","v":5}]
[386400,15990892.609999999,2.4163754295889803,"TACF","TA Comet Fund","1900-03-22","EQT",4,"EQT","C","MY","MY","MYR",15990892.610000003,15243375.109999998,"EQ",{"$f":"IFERROR(VLOOKUP(D:D,Mapping!B:C,2,0),D:D)","v":2}]
[478240,24962678.760000002,1.9158200311671998,"TAGF","TA Growth Fund","1900-03-22","EQT",4,"EQT","C","MY","MY","MYR",24962678.760000002,24507503.960000005,"EQ",{"$f":"IFERROR(VLOOKUP(D:D,Mapping!B:C,2,0),D:D)","v":1}]
[426720,6341697.6600000001,6.7287976008619745,"TASF","TA Small Cap Fund","1900-03-22","EQT",4,"EQT","C","MY","MY","MYR",6341697.6600000011,6285785.5900000008,"EQ",{"$f":"IFERROR(VLOOKUP(D:D,Mapping!B:C,2,0),D:D)","v":5}]
[237000,9917375.8399999999,2.3897450678848124,"TADF","TA Dana Fokus","1900-03-24","EQT",0,"EQT","S","MY","MY","MYR",9917375.8399999999,9921584.2899999991,"EQ",{"$f":"IFERROR(VLOOKUP(D:D,Mapping!B:C,2,0),D:D)","v":15}]
[280875,15990892.609999999,1.7564685527582942,"TACF","TA Comet Fund","1900-04-07","EQT",4,"EQT","C","MY","MY","MYR",15990892.610000003,15243375.109999998,"EQ",{"$f":"IFERROR(VLOOKUP(D:D,Mapping!B:C,2,0),D:D)","v":2}]
[422625,26198127.359999999,1.6131878213756421,"TADO","TA Dana Optimix","1900-04-07","EQT",4,"EQT","S","MY","MY","MYR",26198127.359999999,24631490.600000001,"EQ",{"$f":"IFERROR(VLOOKUP(D:D,Mapping!B:C,2,0),D:D)","v":7}]
[136500,6341697.6600000001,2.1524204924017143,"TASF","TA Small Cap Fund","1900-04-07","EQT",4,"EQT","C","MY","MY","MYR",6341697.6600000011,6285785.5900000008,"EQ",{"$f":"IFERROR(VLOOKUP(D:D,Mapping!B:C,2,0),D:D)","v":5}]
[137500,6341697.6600000001,2.1681891406976974,"TASF","TA Small Cap Fund","1900-04-10","EQT",4,"EQT","C","MY","MY","MYR",6341697.6600000011,6285785.5900000008,"EQ",{"$f":"IFERROR(VLOOKUP(D:D,Mapping!B:C,2,0),D:D)","v":5}]
[133000,15990892.609999999,0.83172342685127942,"TACF","TA Comet Fund","1900-05-07","EQT",4,"EQT","C","MY","MY","MYR",15990892.610000003,15243375.109999998,"EQ",{"$f":"IFERROR(VLOOKUP(D:D,Mapping!B:C,2,0),D:D)","v":2}]
[760000,9917375.8399999999,7.6633175172677532,"TADF","TA Dana Fokus","1900-05-07","EQT",4,"EQT","S","MY","MY","MYR",9917375.8399999999,9921584.2899999991,"EQ",{"$f":"IFERROR(VLOOKUP(D:D,Mapping!B:C,2,0),D:D)","v":15}]
[414200,26198127.359999999,1.5810290342828535,"TADO","TA Dana Optimix","1900-05-07","EQT",4,"EQT","S","MY","MY","MYR",26198127.359999999,24631490.600000001,"EQ",{"$f":"IFERROR(VLOOKUP(D:D,Mapping!B:C,2,0),D:D)","v":7}]
[771400,55935751.590000004,1.379082211416836,"TAIF","TA Islamic Fund","1900-05-07","EQT",4,"EQT","S","MY","MY","MYR",55935751.589999996,54243167.740000002,"EQ",{"$f":"IFERROR(VLOOKUP(D:D,Mapping!B:C,2,0),D:D)","v":3}]
[171000,6341697.6600000001,2.6964388586131367,"TASF","TA Small Cap Fund","1900-05-07","EQT",4,"EQT","C","MY","MY","MYR",6341697.6600000011,6285785.5900000008,"EQ",{"$f":"IFERROR(VLOOKUP(D:D,Mapping!B:C,2,0),D:D)","v":5}]
[298000,9917375.8399999999,3.0048271317707771,"TADF","TA Dana Fokus","1900-05-17","EQT",4,"EQT","S","MY","MY","MYR",9917375.8399999999,9921584.2899999991,"EQ",{"$f":"IFERROR(VLOOKUP(D:D,Mapping!B:C,2,0),D:D)","v":15}]
[300980,26198127.359999999,1.1488607405563815,"TADO","TA Dana Optimix","1900-05-17","EQT",4,"EQT","S","MY","MY","MYR",26198127.359999999,24631490.600000001,"EQ",{"$f":"IFERROR(VLOOKUP(D:D,Mapping!B:C,2,0),D:D)","v":7}]
[655600,55935751.590000004,1.1720589808204274,"TAIF","TA Islamic Fund","1900-05-17","EQT",4,"EQT","S","MY","MY","MYR",55935751.589999996,54243167.740000002,"EQ",{"$f":"IFERROR(VLOOKUP(D:D,Mapping!B:C,2,0),D:D)","v":3}]
[1497177.36,15990892.609999999,9.3626878531079072,"TACF","TA Comet Fund","1900-05-25","EQT",4,"EQT","C","MY","MY","MYR",15990892.610000003,15243375.109999998,"EQ",{"$f":"IFERROR(VLOOKUP(D:D,Mapping!B:C,2,0),D:D)","v":2}]
{"$rows_left_out":548}
{"sheet":"Mapping","index":13,"n_rows":16,"n_cols":3,"rows_kept":16,"cut":false,"hidden":true,"merged":[]}
["FUND NAME","FUNDCODE","MAP FUNDCODE"]
["TA Comet Fund","TACF",2]
["TA Dana Fokus","TADF",15]
["TA Dana OptiMix","TADO",7]
["TA High Growth Fund","TAHGF",6]
["TA Islamic Fund","TAIF",3]
["TA Small Cap Fund","TASF",5]
["TA Growth Fund","TAGF",1]
["TA Income Fund","TIF",4]
["TA CashPLUS Fund","TACP",8]
["TA Islamic CashPLUS Fund","TAICP",9]
["TA Asia Pacific Islamic Balanced Fund","TAIB",12]
["TA Global Asset Allocator Fund","TAGAAF",11]
["TA European Equity Fund","TAEURO",13]
["TA Asian Dividend Income Fund","TADIF",14]
["TA Total Return Fixed Income Fund","TRFIF",28]

{"sheet":"DataUTMC8","index":14,"n_rows":42,"n_cols":6,"rows_kept":42,"cut":false,"hidden":true,"merged":[]}
["FundPrefixMap","ListedCountry","qCountryID","amount","total","MapFundCode"]
["TACF","AU","AU",257924.90000000002,null,{"$f":"IFERROR(VLOOKUP(A:A,Mapping!B:C,2,0),A:A)","v":2}]
["TACF","HK","HK",1072094.57,null,{"$f":"IFERROR(VLOOKUP(A:A,Mapping!B:C,2,0),A:A)","v":2}]
["TACF","MY","MY",13716310.24,null,{"$f":"IFERROR(VLOOKUP(A:A,Mapping!B:C,2,0),A:A)","v":2}]
["TACF","SG","SG",503306.7,null,{"$f":"IFERROR(VLOOKUP(A:A,Mapping!B:C,2,0),A:A)","v":2}]
["TACF","TH","TH",441256.2,null,{"$f":"IFERROR(VLOOKUP(A:A,Mapping!B:C,2,0),A:A)","v":2}]
["TADF","MY","MY",9917375.8399999999,null,{"$f":"IFERROR(VLOOKUP(A:A,Mapping!B:C,2,0),A:A)","v":15}]
["TADIF","LU","LU",50574895.890000001,null,{"$f":"IFERROR(VLOOKUP(A:A,Mapping!B:C,2,0),A:A)","v":14}]
["TADIF","MY","MY",1091081.1099999999,null,{"$f":"IFERROR(VLOOKUP(A:A,Mapping!B:C,2,0),A:A)","v":14}]
["TADO","AU","AU",609045.06000000006,null,{"$f":"IFERROR(VLOOKUP(A:A,Mapping!B:C,2,0),A:A)","v":7}]
["TADO","HK","HK",505840.78,null,{"$f":"IFERROR(VLOOKUP(A:A,Mapping!B:C,2,0),A:A)","v":7}]
["TADO","MY","MY",25083241.520000003,null,{"$f":"IFERROR(VLOOKUP(A:A,Mapping!B:C,2,0),A:A)","v":7}]
["TAEURO","LU","LU",28466385.759999998,null,{"$f":"IFERROR(VLOOKUP(A:A,Mapping!B:C,2,0),A:A)","v":13}]
["TAEURO","MY","MY",1255934.2299999997,null,{"$f":"IFERROR(VLOOKUP(A:A,Mapping!B:C,2,0),A:A)","v":13}]
["TAGAAF","CH","CH",69666.259999999995,null,{"$f":"IFERROR(VLOOKUP(A:A,Mapping!B:C,2,0),A:A)","v":11}]
["TAGAAF","GB","GB",1324745.74,null,{"$f":"IFERROR(VLOOKUP(A:A,Mapping!B:C,2,0),A:A)","v":11}]
["TAGAAF","MY","MY",85621.53,null,{"$f":"IFERROR(VLOOKUP(A:A,Mapping!B:C,2,0),A:A)","v":11}]
["TAGAAF","SG","SG",773.89,null,{"$f":"IFERROR(VLOOKUP(A:A,Mapping!B:C,2,0),A:A)","v":11}]
["TAGAAF","US","US",143419.93,null,{"$f":"IFERROR(VLOOKUP(A:A,Mapping!B:C,2,0),A:A)","v":11}]
["TAGF","AU","AU",1537556.67,null,{"$f":"IFERROR(VLOOKUP(A:A,Mapping!B:C,2,0),A:A)","v":1}]
{"$rows_left_out":23}
{"sheet":"DataUTMC9","index":15,"n_rows":58,"n_cols":5,"rows_kept":58,"cut":false,"hidden":true,"merged":[]}
["FundPrefixMap","qCurrencyCode","amount","total","MapFundCode"]
["TACF","AUD",441372.87083600007,null,{"$f":"IFERROR(VLOOKUP(A:A,Mapping!B:C,2,0),A:A)","v":2}]
["TACF","GBP",1074.1448519999994,null,{"$f":"IFERROR(VLOOKUP(A:A,Mapping!B:C,2,0),A:A)","v":2}]
["TACF","HKD",1382108.7598230001,null,{"$f":"IFERROR(VLOOKUP(A:A,Mapping!B:C,2,0),A:A)","v":2}]
["TACF","MYR",12761766.220000001,null,{"$f":"IFERROR(VLOOKUP(A:A,Mapping!B:C,2,0),A:A)","v":2}]
["TACF","SGD",27570.947321,null,{"$f":"IFERROR(VLOOKUP(A:A,Mapping!B:C,2,0),A:A)","v":2}]
["TACF","THB",441256.2,null,{"$f":"IFERROR(VLOOKUP(A:A,Mapping!B:C,2,0),A:A)","v":2}]
["TACF","USD",521690.42473999999,null,{"$f":"IFERROR(VLOOKUP(A:A,Mapping!B:C,2,0),A:A)","v":2}]
["TADF","MYR",9925792.7400000002,null,{"$f":"IFERROR(VLOOKUP(A:A,Mapping!B:C,2,0),A:A)","v":15}]
["TADIF","MYR",834296.73,null,{"$f":"IFERROR(VLOOKUP(A:A,Mapping!B:C,2,0),A:A)","v":14}]
["TADIF","USD",52500273.73184,null,{"$f":"IFERROR(VLOOKUP(A:A,Mapping!B:C,2,0),A:A)","v":14}]
["TADO","AUD",631118.20098600001,null,{"$f":"IFERROR(VLOOKUP(A:A,Mapping!B:C,2,0),A:A)","v":7}]
["TADO","HKD",906938.54159400007,null,{"$f":"IFERROR(VLOOKUP(A:A,Mapping!B:C,2,0),A:A)","v":7}]
["TADO","KRW",858.44642949999991,null,{"$f":"IFERROR(VLOOKUP(A:A,Mapping!B:C,2,0),A:A)","v":7}]
["TADO","MYR",22801324.449999999,null,{"$f":"IFERROR(VLOOKUP(A:A,Mapping!B:C,2,0),A:A)","v":7}]
["TADO","THB",406629.62255999999,null,{"$f":"IFERROR(VLOOKUP(A:A,Mapping!B:C,2,0),A:A)","v":7}]
["TADO","USD",20697.478510000004,null,{"$f":"IFERROR(VLOOKUP(A:A,Mapping!B:C,2,0),A:A)","v":7}]
["TAEURO","EUR",17821928.062384002,null,{"$f":"IFERROR(VLOOKUP(A:A,Mapping!B:C,2,0),A:A)","v":13}]
["TAEURO","MYR",2292278.25,null,{"$f":"IFERROR(VLOOKUP(A:A,Mapping!B:C,2,0),A:A)","v":13}]
["TAEURO","SGD",1650927.3716,null,{"$f":"IFERROR(VLOOKUP(A:A,Mapping!B:C,2,0),A:A)","v":13}]
{"$rows_left_out":38}