{"text_format":"1","workbook":"xlsx","n_sheets":8,"sheets":["Riskk","Login","Main","Fund","Sch8","Sheet1","Sch9","Sch11"],"not_rendered":{"charts":0,"images":9,"macros":1,"external_links":0,"defined_names":58,"comments":1,"pivot_tables":0},"unopened":[],"bounds":{"document_bytes":16777216,"sheet_cells":100000,"rows_first":2000,"rows_last":500,"rows_between":2000,"halvings":0,"cell_chars":16384,"cell_head_chars":4096},"cells_cut":0,"cells_raw":0,"read":"whole","date_system":"1900"}

{"sheet":"Riskk","index":0,"n_rows":3,"n_cols":24,"rows_kept":3,"cut":false,"hidden":true,"merged":[]}
[null,null,null,null,null,null,null,{"$f":"COUNT(H3:H20)","v":"00:00:00"},false]
[null,null,null,null,null,null,null,"Main/sub","Caption","On Action","NewGroup",null,"CITI raw",null,null,null,null,null,null,null,null,null,"Bizdate","2018-04-27"]
[null,null,null,null,null,null,null,null,null,null,null,null,{"$f":"\"Select 'New',\"","v":"Select 'New',"}]

{"sheet":"Login","index":1,"n_rows":18,"n_cols":10,"rows_kept":18,"cut":false,"hidden":false,"merged":[]}
[]
[null,"Riskk   .  Com"]
[null,"Sdn Bhd (CN 388306K)"]
[null,null,null,null,null,null,null,"Box 389, Lot 7.16, Wisma Central, Jln Ampang, 50450 Kuala Lumpur"]
[]
[]
[]
[]
["00:00:00","Toss Report"]
[]
[]
[]
[]
[]
[]
{"$rows_left_out":4}
{"sheet":"Main","index":2,"n_rows":32,"n_cols":15,"rows_kept":32,"cut":false,"hidden":true,"merged":[]}
[]
[null,"SYARIKAT TAKAFUL MALAYSIA BERHAD"]
[null,"Toss Report",null,null,"* Please sheet(s) to print"]
[]
["Step 1: Please Select Filter:",null,null,null,"Schedule","Print Sheet","Export Sheet","Sheet Name"]
["Report Detail",null,null,null,"Schedule 8","YES","YES","Sch8"]
["Company  :","SYARIKAT TAKAFUL MALAYSIA BERHAD",null,null,"Schedule 9","YES","YES","Sch9"]
["Fund  :","General",null,null,"Schedule 11","YES","YES","Sch11"]
["Start Of Year  :",{"$f":"EOMONTH(EOM,-MONTH(EOM))+1","v":"2018-01-01"}]
["End of Last Month  :",{"$f":"EOMONTH(EOM,-1)","v":"2018-01-31"}]
["Report As At  :","2018-02-28"]
["Submission  :","M02",null,null,null,null,null,null,null,null,null,null,null,"Total"]
[]
["Step 2: Refresh Data"]
[]
{"$rows_left_out":18}
{"sheet":"Fund","index":3,"n_rows":29,"n_cols":7,"rows_kept":29,"cut":false,"hidden":true,"merged":[]}
[]
["qFundGrpCode","FundGrpName",null,null,null,null,"Submission"]
["ALLFUNDS","ALLFUNDS",null,null,null,null,"M01"]
["ANWQF-FI","ANWQF-FI",null,null,null,null,"M02"]
["DRISK-FI","DRISK-FI",null,null,null,null,"M03"]
["FS","FAMILY SHAREHOLDERS",null,null,null,null,"M04"]
["GEN-EQ","GEN-EQ",null,null,null,null,"M05"]
["General","General",null,null,null,null,"M06"]
["GEN-FI","GEN-FI",null,null,null,null,"M07"]
["GFTA-EQ","GFTA-EQ",null,null,null,null,"M08"]
["GFTA-FI","GFTA-FI",null,null,null,null,"M09"]
["ILFUND","Investment Linked Fund",null,null,null,null,"M10"]
["INTERNAL","INTERNAL VALUATION REPORTS",null,null,null,null,"M11"]
["ISTIQRAR","ISTIQRAR",null,null,null,null,"M12"]
["ITTIZAN","ITTIZAN",null,null,null,null,"FYE"]
{"$rows_left_out":15}
{"sheet":"Sch8","index":4,"n_rows":1000,"n_cols":51,"rows_kept":1000,"cut":false,"hidden":true,"merged":[]}
[]
["                                                              Schedule 8  - Balance Sheets - Particulars of Islamic Debt/Equity",null,null,null,null,null,"qProductType ~ BND,EQT"]
[null,null,null,null,null,null,"qAccType <> REIT and UT"]
[]
[null,null,null,null,null,null,null,null,null,null,null,null,null,null,null,null,null,null,null,null,null,null,null,null,null,null,null,null,null,null,null,null,null,null,null,null,null,null,null,null,null,null,null,null,null,null,null,null,null,{"$f":" IF(AT10<>\"\",\"<item />;\",\"<item type=\" & \"\"\"\" & G10 & \"\"\"\" & \" type1=\" & \"\"\"\" & G10 & \"\"\"\" & \">\" &H10&\"</item>;\" ) & IF(AT10=\"\",IF(H10=\"N/A\",\"<item>\"&H10&\"</item>;<item>Non-rated</item>\",\"<item>\"&H10&\"</item>;<item>\"&I10&\"</item>;\"), \"<item />;<item />;\")  & IF(AT10<>\"\",\"<item />;\",\"<item>\"&J10&\"</item>;\") & IF(AT10=\"\",\"<item>\"&K10&\"</item>;\",IF(AT10=\"\",\"<item>\"&K10&\"</item>;\",\"<item />;\"))","v":"<item type=\"Name of Company\" type1=\"Name of Company\">Rating Agency</item>;<item>Rating Agency</item>;<item>Rating</item>;<item>Units</item>;<item>Investment yield</item>;"},{"$f":" IF(AT10<>\"\",\"<item />;\",IF(AT10<>\"\",\"<item />;\",\"<item>\"&TEXT(L10,\"ddmmyyyy\")&\"</item>;\")&IF(AT10<>\"\",\"<item />;\",IF(AT10<>\"\",\"<item />;\",\"<item>\"&M10&\"</item>;\"))&\"<item>\"&N10&\"</item>;<item>\"&O10&\"</item>;\"&IF(AT10=\"\",\"<item>\"&Q10&\"</item>;\", IF(AT10<>\"\",\"<item>\"&S10&\"</item>;\",\"<item />;\"))&\"<item>\"&T10&\"</item>;\"&IF(AT10<>\"\",\"<item>\"&U10&\"</item>;<item>\"&V10&\"</item>;\",\"<item />;<item />;\"))","v":"<item>Maturity</item>;<item>Nom Value</item>;<item>Cost</item>;<item>MV</item>;<item>Net Book Val</item>;<item>Business</item>;<item />;<item />;"}]
[]
[]
[]
["fsrSchLinkTo",null,null,null,null,null,null,null,null,null,null,null,null,null,null,"BookValue","Cost - ECL(+Diminution)","Diminution*-1",null,null,null,null,null,null,null,null,null,null,null,null,null,null,null,null,null,null,null,null,null,null,null,null,null,null,0,null,"COUNT","Header","Item"]
["fsrSchLinkTo","Type of Investment","Category","Sub-Category","Sector","KLSE Stock Code","Name of Company","Rating Agency","Rating","Units","Investment yield","Maturity","Nom Value","Cost","MV","Amortised/Accreted","Net Book Val","Amount In Default","Arrears Position (month)","Business","TypeInvt","Category","SubCategory","Sector","Check Stock Code",null,null,null,null,null,null,null,null,null,null,null,null,null,null,null,null,null,null,null,{"$f":"AS9+AU10","v":0},null,{"$f":"IF(AV10=\"\",0,1)","v":0},{"$f":"IF(A10=A9,\"\",\"<schedule schInd=\"&\"\"\"\"&AS10&\"\"\"\"&\" fsrSchCode=\"&\"\"\"\"&Sch8NoMY&\"\"\"\"& \" fsrSchLinkTo=\"&\"\"\"\"&A10&\"\"\"\"&\" fsrSchBusClass=\"&\"\"\"\"\"\"&\" fsrSchType=\"&\"\"\"\"&\"multi\"&\"\"\"\" & \">\")","v":""},{"$f":"\"<item type1=\" & \"\"\"\" & IF(T10=\"Within Malaysia\",\"m\",\"w\") & \"\"\"\" & \">\"&T10&\"</item>;<item type1=\" & \"\"\"\" & U10 & \"\"\"\" & \">\"&B10&\"</item>;<item type1=\" & \"\"\"\" & V10 & \"\"\"\" &\">\"&C10&\"</item>;<item type1=\" & \"\"\"\" & W10 & \"\"\"\" & \">\"&D10&\"</item>;<item type1=\" & \"\"\"\" & X10 & \"\"\"\" & \">\" &E10& \"</item>;<item>\"&F10&\"</item>;\"","v":"<item type1=\"w\">Business</item>;<item type1=\"TypeInvt\">Type of Investment</item>;<item type1=\"Category\">Category</item>;<item type1=\"SubCategory\">Sub-Category</item>;<item type1=\"Sector\">Sector</item>;<item>KLSE Stock Code</item>;"},{"$f":"\"<item>\"&G10&\"</item>;<item>\"&H10&\"</item>;<item>\"&I10&\"</item>;<item>\"&TEXT(J10,\"0\")&\"</item>;<item>\"&TEXT(K10,\"0.00\")&\"</item>;\"","v":"<item>Name of Company</item>;<item>Rating Agency</item>;<item>Rating</item>;<item>Units</item>;<item>Investment yield</item>;"},{"$f":"\"<item>\"&TEXT(L10,\"dd/mm/yyyy\")&\"</item>;<item>\"&TEXT(M10,\"0\")&\"</item>;<item>\"&TEXT(N10,\"0\")&\"</item>;<item>\"&TEXT(O10,\"0\")&\"</item>;<item>\"&IF(C10=\"Non-amortised/Non-accreted\",\"\",TEXT(P10,\"0\"))&\"</item>;<item>\"&TEXT(Q10,\"0\")&\"</item>;<item>\"&TEXT(R10,\"0\")&\"</item>;<item>\"&S10&\"</item>;\"","v":"<item>Maturity</item>;<item>Nom Value</item>;<item>Cost</item>;<item>MV</item>;<item>Amortised/Accreted</item>;<item>Net Book Val</item>;<item>Amount In Default</item>;<item>Arrears Position (month)</item>;"}]
[1,"Islamic Bonds","Non-amortised/Non-accreted","Unquoted Unsecured",null,null,"Malaysian Government Investment Issue","RAM","X",5000000,3.90984189,"2019-08-13",5000000,5000000,5033500,5000000,5000000,0,null,"Within Malaysia",{"$f":"IF(A11=\"\",\"\",VLOOKUP(B11,Sheet1!$A$2:$B$6,2,FALSE))","v":"B"},{"$f":"IF(A11=\"\",\"\",U11&VLOOKUP(C11,Sheet1!$A$19:$B$28,2,FALSE))","v":"B2"},{"$f":"IF(D11=\"\",\"\",U11&VLOOKUP(D11,Sheet1!$A$10:$C$13,3,FALSE))","v":"B14"},{"$f":"IF(E11=\"\",\"\",VLOOKUP(E11,Sheet1!$E$3:$F$18,2,FALSE))","v":""},{"$f":"IF(A11=\"\",\"\",IF(F11=\"\",FALSE,TRUE))","v":false},null,null,null,null,null,null,null,null,null,null,null,null,null,null,null,null,null,null,null,1,null,1,"<schedule schInd=\"1\" fsrSchCode=\"FT3_Sch8\" fsrSchLinkTo=\"1\" fsrSchBusClass=\"\" fsrSchType=\"multi\">","<item type1=\"m\">Within Malaysia</item>;<item type1=\"B\">Islamic Bonds</item>;<item type1=\"B2\">Non-amortised/Non-accreted</item>;<item type1=\"B14\">Unquoted Unsecured</item>;<item type1=\"\"></item>;<item></item>;","<item>Malaysian Government Investment Issue</item>;<item>RAM</item>;<item>X</item>;<item>5000000</item>;<item>3.91</item>;","<item>13/08/2019</item>;<item>5000000</item>;<item>5000000</item>;<item>5033500</item>;<item></item>;<item>5000000</item>;<item>0</item>;<item></item>;"]
[2,"Islamic Bonds","Non-amortised/Non-accreted","Unquoted Unsecured",null,null,"Malaysian Government Investment Issue","RAM","X",5000000,3.90984189,"2019-08-13",5000000,5000000,5033500,5000000,5000000,0,null,"Within Malaysia",{"$f":"IF(A12=\"\",\"\",VLOOKUP(B12,Sheet1!$A$2:$B$6,2,FALSE))","v":"B"},{"$f":"IF(A12=\"\",\"\",U12&VLOOKUP(C12,Sheet1!$A$19:$B$28,2,FALSE))","v":"B2"},{"$f":"IF(D12=\"\",\"\",U12&VLOOKUP(D12,Sheet1!$A$10:$C$13,3,FALSE))","v":"B14"},{"$f":"IF(E12=\"\",\"\",VLOOKUP(E12,Sheet1!$E$3:$F$18,2,FALSE))","v":""},{"$f":"IF(A12=\"\",\"\",IF(F12=\"\",FALSE,TRUE))","v":false},null,null,null,null,null,null,null,null,null,null,null,null,null,null,null,null,null,null,null,2,null,1,"<schedule schInd=\"2\" fsrSchCode=\"FT3_Sch8\" fsrSchLinkTo=\"2\" fsrSchBusClass=\"\" fsrSchType=\"multi\">","<item type1=\"m\">Within Malaysia</item>;<item type1=\"B\">Islamic Bonds</item>;<item type1=\"B2\">Non-amortised/Non-accreted</item>;<item type1=\"B14\">Unquoted Unsecured</item>;<item type1=\"\"></item>;<item></item>;","<item>Malaysian Government Investment Issue</item>;<item>RAM</item>;<item>X</item>;<item>5000000</item>;<item>3.91</item>;","<item>13/08/2019</item>;<item>5000000</item>;<item>5000000</item>;<item>5033500</item>;<item></item>;<item>5000000</item>;<item>0</item>;<item></item>;"]
[3,"Islamic Bonds","Non-amortised/Non-accreted","Unquoted Secured",null,null,"DanaInfra Nasional Berhad","RAM","X",5000000,5.2244545000000002,"2042-11-14",5000000,5000000,5014100,5000000,5000000,0,null,"Within Malaysia",{"$f":"IF(A13=\"\",\"\",VLOOKUP(B13,Sheet1!$A$2:$B$6,2,FALSE))","v":"B"},{"$f":"IF(A13=\"\",\"\",U13&VLOOKUP(C13,Sheet1!$A$19:$B$28,2,FALSE))","v":"B2"},{"$f":"IF(D13=\"\",\"\",U13&VLOOKUP(D13,Sheet1!$A$10:$C$13,3,FALSE))","v":"B13"},{"$f":"IF(E13=\"\",\"\",VLOOKUP(E13,Sheet1!$E$3:$F$18,2,FALSE))","v":""},false,null,null,null,null,null,null,null,null,null,null,null,null,null,null,null,null,null,null,null,3,null,1,"<schedule schInd=\"3\" fsrSchCode=\"FT3_Sch8\" fsrSchLinkTo=\"3\" fsrSchBusClass=\"\" fsrSchType=\"multi\">","<item type1=\"m\">Within Malaysia</item>;<item type1=\"B\">Islamic Bonds</item>;<item type1=\"B2\">Non-amortised/Non-accreted</item>;<item type1=\"B13\">Unquoted Secured</item>;<item type1=\"\"></item>;<item></item>;","<item>DanaInfra Nasional Berhad</item>;<item>RAM</item>;<item>X</item>;<item>5000000</item>;<item>5.22</item>;","<item>14/11/2042</item>;<item>5000000</item>;<item>5000000</item>;<item>5014100</item>;<item></item>;<item>5000000</item>;<item>0</item>;<item></item>;"]
[4,"Islamic Bonds","Non-amortised/Non-accreted","Unquoted Secured",null,null,"DanaInfra Nasional Berhad","RAM","X",5000000,5.2244545000000002,"2042-11-14",5000000,5000000,5014100,5000000,5000000,0,null,"Within Malaysia",{"$f":"IF(A14=\"\",\"\",VLOOKUP(B14,Sheet1!$A$2:$B$6,2,FALSE))","v":"B"},{"$f":"IF(A14=\"\",\"\",U14&VLOOKUP(C14,Sheet1!$A$19:$B$28,2,FALSE))","v":"B2"},{"$f":"IF(D14=\"\",\"\",U14&VLOOKUP(D14,Sheet1!$A$10:$C$13,3,FALSE))","v":"B13"},{"$f":"IF(E14=\"\",\"\",VLOOKUP(E14,Sheet1!$E$3:$F$18,2,FALSE))","v":""},false,null,null,null,null,null,null,null,null,null,null,null,null,null,null,null,null,null,null,null,4,null,1,"<schedule schInd=\"4\" fsrSchCode=\"FT3_Sch8\" fsrSchLinkTo=\"4\" fsrSchBusClass=\"\" fsrSchType=\"multi\">","<item type1=\"m\">Within Malaysia</item>;<item type1=\"B\">Islamic Bonds</item>;<item type1=\"B2\">Non-amortised/Non-accreted</item>;<item type1=\"B13\">Unquoted Secured</item>;<item type1=\"\"></item>;<item></item>;","<item>DanaInfra Nasional Berhad</item>;<item>RAM</item>;<item>X</item>;<item>5000000</item>;<item>5.22</item>;","<item>14/11/2042</item>;<item>5000000</item>;<item>5000000</item>;<item>5014100</item>;<item></item>;<item>5000000</item>;<item>0</item>;<item></item>;"]
[5,"Islamic Bonds","Amortised/Accreted","Unquoted Unsecured",null,null,"Senai Desaru Expressway Berhad","MARC","BBB-",643640,6.5073649199999997,"2047-12-31",643640,499915.19,604217.05000000005,623552.48,499915.19,0,null,"Within Malaysia",{"$f":"IF(A15=\"\",\"\",VLOOKUP(B15,Sheet1!$A$2:$B$6,2,FALSE))","v":"B"},{"$f":"IF(A15=\"\",\"\",U15&VLOOKUP(C15,Sheet1!$A$19:$B$28,2,FALSE))","v":"B1"},{"$f":"IF(D15=\"\",\"\",U15&VLOOKUP(D15,Sheet1!$A$10:$C$13,3,FALSE))","v":"B14"},{"$f":"IF(E15=\"\",\"\",VLOOKUP(E15,Sheet1!$E$3:$F$18,2,FALSE))","v":""},false,null,null,null,null,null,null,null,null,null,null,null,null,null,null,null,null,null,null,null,5,null,1,"<schedule schInd=\"5\" fsrSchCode=\"FT3_Sch8\" fsrSchLinkTo=\"5\" fsrSchBusClass=\"\" fsrSchType=\"multi\">","<item type1=\"m\">Within Malaysia</item>;<item type1=\"B\">Islamic Bonds</item>;<item type1=\"B1\">Amortised/Accreted</item>;<item type1=\"B14\">Unquoted Unsecured</item>;<item type1=\"\"></item>;<item></item>;","<item>Senai Desaru Expressway Berhad</item>;<item>MARC</item>;<item>BBB-</item>;<item>643640</item>;<item>6.51</item>;","<item>31/12/2047</item>;<item>643640</item>;<item>499915</item>;<item>604217</item>;<item>623552</item>;<item>499915</item>;<item>0</item>;<item></item>;"]
{"$rows_left_out":986}
{"sheet":"Sheet1","index":5,"n_rows":28,"n_cols":6,"rows_kept":28,"cut":false,"hidden":true,"merged":[]}
["Instrument",null,null,null,"Sector"]
["Islamic Cagamas Papers","A"]
["Islamic Bonds","B",null,null,"Consumer Products","01"]
["Warrants/TSRs","C",null,null,"Industrial Products","02"]
["Convertible Loan Stocks","D",null,null,"Construction","03"]
["Syariah-approved Shares","E",null,null,"Trading/Services","04"]
[null,null,null,null,"Technology","05"]
["Sub-Category",null,null,null,"Infrastructure Project Company","07"]
[null,null,null,null,"Finance","10"]
["Quoted Secured","Islamic BondsQuoted Secured",11,null,"Hotels","15"]
["Quoted Unsecured","Islamic BondsQuoted Unsecured",12,null,"Properties","20"]
["Unquoted Secured","Islamic BondsUnquoted Secured",13,null,"Plantations","25"]
["Unquoted Unsecured","Islamic BondsUnquoted Unsecured",14,null,"Mining","30"]
["Quoted","Convertible Loan StocksQuoted",11,null,"Trusts","50"]
["Unquoted Secured","Convertible Loan StocksUnquoted Secured",12,null,"Close-End Fund","55"]
{"$rows_left_out":14}
{"sheet":"Sch9","index":6,"n_rows":19,"n_cols":49,"rows_kept":19,"cut":false,"hidden":true,"merged":[]}
[]
["                                      Schedule 9  - Balance Sheet - Particulars of Other Investments",null,null,null,"qProductType ~ BND,EQT"]
[null,null,null,null,"qAccType ~ REIT,UT"]
[]
[]
[]
[]
[]
["fsrSchLinkTo",null,null,null,null,null,null,null,null,null,null,null,null,null,null,null,null,null,null,null,null,null,null,null,null,null,null,null,null,null,null,null,null,null,null,null,null,null,null,null,null,null,null,null,0,null,"COUNT","Header","Item"]
["fsrSchLinkTo","Description","Name of Company","No. of Units","Investment Yield","Maturity Date","Nominal Value","Cost","Market Value","Net Book Value",null,null,null,null,null,null,null,null,null,null,null,null,null,null,null,null,null,null,null,null,null,null,null,null,null,null,null,null,null,null,null,null,null,null,{"$f":"AS9+AU10","v":0},null,{"$f":"IF(AV10=\"\",0,1)","v":0},{"$f":"IF(A10=A9,\"\",\"<schedule schInd=\"&\"\"\"\"&AS10&\"\"\"\"&\" fsrSchCode=\"&\"\"\"\"&Sch9NoMY&\"\"\"\"& \" fsrSchLinkTo=\"&\"\"\"\"&A10&\"\"\"\"&\" fsrSchBusClass=\"&\"\"\"\"\"\"&\" fsrSchType=\"&\"\"\"\"&\"multi\"&\"\"\"\" & \">\")","v":""},{"$f":"\"<item>\" & B10&\"</item>;<item>\" & C10&\"</item>;<item>\" & D10&\"</item>;<item>\" &E10&\"</item>;<item>\"&TEXT(F10,\"ddmmyyyy\")&\"</item>;<item>\"&G10&\"</item>;<item>\"&H10&\"</item>;<item>\"&I10&\"</item>;<item>\"&J10&\"</item>\"","v":"<item>Description</item>;<item>Name of Company</item>;<item>No. of Units</item>;<item>Investment Yield</item>;<item>Maturity Date</item>;<item>Nominal Value</item>;<item>Cost</item>;<item>Market Value</item>;<item>Net Book Value</item>"}]
[1,"INSTITUTIONAL TRUST ACCOUNT","AMANAH RAYA INSTITUTIONAL TRUST ACCOUNT",5439088.5999999996,100,"2021-07-12",5439088.5999999996,5439088.5999999996,5483793.4299999997,5483793.4299999997,null,null,null,null,null,null,null,null,null,null,null,null,null,null,null,null,null,null,null,null,null,null,null,null,null,null,null,null,null,null,null,null,null,null,1,null,1,"<schedule schInd=\"1\" fsrSchCode=\"FT3_Sch9\" fsrSchLinkTo=\"1\" fsrSchBusClass=\"\" fsrSchType=\"multi\">","<item>INSTITUTIONAL TRUST ACCOUNT</item>;<item>AMANAH RAYA INSTITUTIONAL TRUST ACCOUNT</item>;<item>5439088.6</item>;<item>100</item>;<item>12072021</item>;<item>5439088.6</item>;<item>5439088.6</item>;<item>5483793.43</item>;<item>5483793.43</item>"]
[2,"INSTITUTIONAL TRUST ACCOUNT","AMANAH RAYA INSTITUTIONAL TRUST ACCOUNT",4180387.63,100,"2022-01-17",4180387.63,4180387.63,4214747.5599999996,4214747.5599999996,null,null,null,null,null,null,null,null,null,null,null,null,null,null,null,null,null,null,null,null,null,null,null,null,null,null,null,null,null,null,null,null,null,null,2,null,1,"<schedule schInd=\"2\" fsrSchCode=\"FT3_Sch9\" fsrSchLinkTo=\"2\" fsrSchBusClass=\"\" fsrSchType=\"multi\">","<item>INSTITUTIONAL TRUST ACCOUNT</item>;<item>AMANAH RAYA INSTITUTIONAL TRUST ACCOUNT</item>;<item>4180387.63</item>;<item>100</item>;<item>17012022</item>;<item>4180387.63</item>;<item>4180387.63</item>;<item>4214747.56</item>;<item>4214747.56</item>"]
[3,"INSTITUTIONAL TRUST ACCOUNT","AMANAH RAYA INSTITUTIONAL TRUST ACCOUNT",7793494.5599999996,100,"2020-07-21",7793494.5599999996,7793494.5599999996,7857550.6699999999,7857550.6699999999,null,null,null,null,null,null,null,null,null,null,null,null,null,null,null,null,null,null,null,null,null,null,null,null,null,null,null,null,null,null,null,null,null,null,3,null,1,"<schedule schInd=\"3\" fsrSchCode=\"FT3_Sch9\" fsrSchLinkTo=\"3\" fsrSchBusClass=\"\" fsrSchType=\"multi\">","<item>INSTITUTIONAL TRUST ACCOUNT</item>;<item>AMANAH RAYA INSTITUTIONAL TRUST ACCOUNT</item>;<item>7793494.56</item>;<item>100</item>;<item>21072020</item>;<item>7793494.56</item>;<item>7793494.56</item>;<item>7857550.67</item>;<item>7857550.67</item>"]
[4,"INSTITUTIONAL TRUST ACCOUNT","AMANAH RAYA INSTITUTIONAL TRUST ACCOUNT",15586989.09,100,"2020-07-21",15586989.09,15586989.09,15715101.32,15715101.32,null,null,null,null,null,null,null,null,null,null,null,null,null,null,null,null,null,null,null,null,null,null,null,null,null,null,null,null,null,null,null,null,null,null,4,null,1,"<schedule schInd=\"4\" fsrSchCode=\"FT3_Sch9\" fsrSchLinkTo=\"4\" fsrSchBusClass=\"\" fsrSchType=\"multi\">","<item>INSTITUTIONAL TRUST ACCOUNT</item>;<item>AMANAH RAYA INSTITUTIONAL TRUST ACCOUNT</item>;<item>15586989.09</item>;<item>100</item>;<item>21072020</item>;<item>15586989.09</item>;<item>15586989.09</item>;<item>15715101.32</item>;<item>15715101.32</item>"]
[5,"INSTITUTIONAL TRUST ACCOUNT","AMANAH RAYA INSTITUTIONAL TRUST ACCOUNT",1323260.8799999999,100,"2022-02-22",1323260.8799999999,1323260.8799999999,1333621.58,1333621.58,null,null,null,null,null,null,null,null,null,null,null,null,null,null,null,null,null,null,null,null,null,null,null,null,null,null,null,null,null,null,null,null,null,null,5,null,1,"<schedule schInd=\"5\" fsrSchCode=\"FT3_Sch9\" fsrSchLinkTo=\"5\" fsrSchBusClass=\"\" fsrSchType=\"multi\">","<item>INSTITUTIONAL TRUST ACCOUNT</item>;<item>AMANAH RAYA INSTITUTIONAL TRUST ACCOUNT</item>;<item>1323260.88</item>;<item>100</item>;<item>22022022</item>;<item>1323260.88</item>;<item>1323260.88</item>;<item>1333621.58</item>;<item>1333621.58</item>"]
{"$rows_left_out":5}
{"sheet":"Sch11","index":7,"n_rows":24,"n_cols":49,"rows_kept":24,"cut":false,"hidden":true,"merged":[]}
[]
[null,null,null,null,null,null,null,null,null,null,null,null,null,null,null,null,null,null,null,null,null,null,null,null,null,null,null,null,null,null,null,null,null,null,null,null,null,null,null,null,null,null,null,null,null,null,"CSH"]
["Schedule 11 - Balance Sheet - Particulars of Investment Accounts/Islamic Money Market",null,null,null,null,null,null,null,null,null,null,null,null,null,null,null,null,null,null,null,null,null,null,null,null,null,null,null,null,null,null,null,null,null,null,null,null,null,null,null,null,null,null,null,null,null,"qProductType ~ CSH"]
[null,null,null,null,null,null,null,null,null,null,null,null,null,null,null,null,null,null,null,null,null,null,null,null,null,null,null,null,null,null,null,null,null,null,null,null,null,null,null,null,null,null,null,null,null,null,"qStockCode not like CUR,CAP"]
[null,null,null,null,null,null,null,null,null,null,null,null,null,null,null,null,null,null,null,null,null,null,null,null,null,null,null,null,null,null,null,null,null,null,null,null,null,null,null,null,null,null,null,null,null,null,"BND"]
[null,null,null,null,null,null,null,null,null,null,null,null,null,null,null,null,null,null,null,null,null,null,null,null,null,null,null,null,null,null,null,null,null,null,null,null,null,null,null,null,null,null,null,null,null,null,"qStockCode like ZZ"]
[]
[]
["fsrSchLinkTo",null,null,null,null,null,null,null,null,null,null,null,null,null,null,null,null,null,null,null,null,null,null,null,null,null,null,null,null,null,null,null,null,null,null,null,null,null,null,null,null,null,null,null,0,null,"COUNT","Header","Item"]
["fsrSchLinkTo","Name of  bank/FI","Nature of  Deposit","Amount",null,null,null,null,null,null,null,null,null,null,null,null,null,null,null,null,null,null,null,null,null,null,null,null,null,null,null,null,null,null,null,null,null,null,null,null,null,null,null,null,{"$f":"AS9+AU10","v":0},null,{"$f":"IF(AV10=\"\",0,1)","v":0},{"$f":"IF(A10=A9,\"\",\"<schedule schInd=\"&\"\"\"\"&AS10&\"\"\"\"&\" fsrSchCode=\"&\"\"\"\"&Sch11NoMY&\"\"\"\"& \" fsrSchLinkTo=\"&\"\"\"\"&A10&\"\"\"\"&\" fsrSchBusClass=\"&\"\"\"\"\"\"&\" fsrSchType=\"&\"\"\"\"&\"multi\"&\"\"\"\" & \">\")","v":""},{"$f":"\"<item>\" & B10&\"</item>;<item>\" &C10&\"</item>;<item>\" & D10&\"</item>\"","v":"<item>Name of  bank/FI</item>;<item>Nature of  Deposit</item>;<item>Amount</item>"}]
[1,"AFFIN ISLAMIC BANK BERHAD","CM",14200000,null,null,null,null,null,null,null,null,null,null,null,null,null,null,null,null,null,null,null,null,null,null,null,null,null,null,null,null,null,null,null,null,null,null,null,null,null,null,null,null,1,null,1,"<schedule schInd=\"1\" fsrSchCode=\"FT3_Sch11\" fsrSchLinkTo=\"1\" fsrSchBusClass=\"\" fsrSchType=\"multi\">","<item>AFFIN ISLAMIC BANK BERHAD</item>;<item>CM</item>;<item>14200000</item>"]
[2,"AL RAJHI BANK","CM",10007000,null,null,null,null,null,null,null,null,null,null,null,null,null,null,null,null,null,null,null,null,null,null,null,null,null,null,null,null,null,null,null,null,null,null,null,null,null,null,null,null,2,null,1,"<schedule schInd=\"2\" fsrSchCode=\"FT3_Sch11\" fsrSchLinkTo=\"2\" fsrSchBusClass=\"\" fsrSchType=\"multi\">","<item>AL RAJHI BANK</item>;<item>CM</item>;<item>10007000</item>"]
[3,"BANK ISLAM MALAYSIA BERHAD","CM",238000,null,null,null,null,null,null,null,null,null,null,null,null,null,null,null,null,null,null,null,null,null,null,null,null,null,null,null,null,null,null,null,null,null,null,null,null,null,null,null,null,3,null,1,"<schedule schInd=\"3\" fsrSchCode=\"FT3_Sch11\" fsrSchLinkTo=\"3\" fsrSchBusClass=\"\" fsrSchType=\"multi\">","<item>BANK ISLAM MALAYSIA BERHAD</item>;<item>CM</item>;<item>238000</item>"]
[4,"BANK KERJASAMA RAKYAT MALAYSIA BERHAD","CM",22910000,null,null,null,null,null,null,null,null,null,null,null,null,null,null,null,null,null,null,null,null,null,null,null,null,null,null,null,null,null,null,null,null,null,null,null,null,null,null,null,null,4,null,1,"<schedule schInd=\"4\" fsrSchCode=\"FT3_Sch11\" fsrSchLinkTo=\"4\" fsrSchBusClass=\"\" fsrSchType=\"multi\">","<item>BANK KERJASAMA RAKYAT MALAYSIA BERHAD</item>;<item>CM</item>;<item>22910000</item>"]
[5,"BANK PERSATUAN MALAYSIA BERHAD","CM",2650000,null,null,null,null,null,null,null,null,null,null,null,null,null,null,null,null,null,null,null,null,null,null,null,null,null,null,null,null,null,null,null,null,null,null,null,null,null,null,null,null,5,null,1,"<schedule schInd=\"5\" fsrSchCode=\"FT3_Sch11\" fsrSchLinkTo=\"5\" fsrSchBusClass=\"\" fsrSchType=\"multi\">","<item>BANK PERSATUAN MALAYSIA BERHAD</item>;<item>CM</item>;<item>2650000</item>"]
{"$rows_left_out":9}