{"text_format":"1","workbook":"xlsx","n_sheets":10,"sheets":["Brokerage Fees by Brokers team","Main","InFund","InNav","InInput1","InInput2","Input1","Input2","Input3","Reference"],"not_rendered":{"charts":0,"images":0,"macros":1,"external_links":0,"defined_names":23,"comments":0,"pivot_tables":0},"unopened":[],"bounds":{"document_bytes":16777216,"sheet_cells":100000,"rows_first":2000,"rows_last":500,"rows_between":2000,"halvings":0,"cell_chars":16384,"cell_head_chars":4096},"cells_cut":0,"cells_raw":0,"read":"whole","date_system":"1900"}

{"sheet":"Brokerage Fees by Brokers team","index":0,"n_rows":58,"n_cols":16,"rows_kept":58,"cut":false,"hidden":true,"merged":[[49,0,49,1]]}
[{"$f":"\"Summary of Brokerage Fee for \" & YEAR(ValueDate) & \" by Team\"","v":"Summary of Brokerage Fee for 2018 by Team"}]
[]
["Broker","Team","2016-01-01","2016-02-01","2016-03-01","2016-04-01","2016-05-01","2016-06-01","2016-07-01","2016-08-01","2016-09-01","2016-10-01","2016-11-01","2016-12-01","YTD 2016","%"]
[]
["Affin Hwang Investment Bank Berhad","Abdul Hadzi Marzuki",null,null,null,null,null,null,null,0,0,0,0,0,{"$f":"SUM(C5:N5)","v":0},{"$f":"O5/$O$50*100","v":{"$error":"#DIV/0!"}}]
["Affin Hwang Investment Bank Berhad","Khairul Suffian Khalid",null,null,null,null,null,null,null,0,0,0,0,0,{"$f":"SUM(C6:N6)","v":0}]
[]
["Alliance Investment Bank Berhad","Syedi Bin Aripen ",null,null,null,null,null,null,null,0,0,0,0,0,{"$f":"SUM(C8:N8)","v":0},{"$f":"O8/$O$50*100","v":{"$error":"#DIV/0!"}}]
[]
["AmInvestment Bank Bhd",null,null,null,null,null,null,null,null,0,0,0,0,0,{"$f":"SUM(C10:N10)","v":0},{"$f":"O10/$O$50*100","v":{"$error":"#DIV/0!"}}]
["AmInvestment Bank Bhd",null,null,null,null,null,null,null,null,0,0,0,0,0,{"$f":"SUM(C11:N11)","v":0},{"$f":"O11/$O$50*100","v":{"$error":"#DIV/0!"}}]
[]
["BIMB Securities Bhd",null,null,null,null,null,null,null,null,0,0,0,0,0,{"$f":"SUM(C13:N13)","v":0},{"$f":"O13/$O$50*100","v":{"$error":"#DIV/0!"}}]
[]
["CIMB Investment Bank Bhd",null,null,null,null,null,null,null,null,0,0,0,0,0,{"$f":"SUM(C15:N15)","v":0},{"$f":"O15/$O$50*100","v":{"$error":"#DIV/0!"}}]
{"$rows_left_out":44}
{"sheet":"Main","index":1,"n_rows":23,"n_cols":11,"rows_kept":23,"cut":false,"hidden":false,"merged":[]}
[]
[null,"SUNLIFE","LIAM Report"]
[]
[null,null,null,null,null,"* Please sheet(s) to print"]
[null,"* Step 1 : Connect to Server",null,null,null,"Sheet","YES/NO",null,"Conventional",0,{"$f":"VLOOKUP(C14,I5:J6,2,FALSE)","v":0}]
[null,null,null,null,null,"Input1","YES",null,"Non-Conventional",1]
[null,null,null,null,null,"Input2","YES"]
[null,null,null,null,null,"Input3","YES"]
[]
[]
[null," * Step 2 : Change Only If Necessary"]
[]
[null,"Company :","SUN LIFE MALAYSIA ASSURANCE BERHAD"]
[null,"Conventional/Non-Conventional :","Conventional"]
[null,"Value Date :","2018-01-30"]
{"$rows_left_out":9}
{"sheet":"InFund","index":2,"n_rows":50,"n_cols":7,"rows_kept":50,"cut":false,"hidden":true,"merged":[]}
[]
["qFundCode","FundName","qFundType","Islamic","FinanceYrStart","FinanceYrEnd","FundSize"]
["BALA","Sun Life Malaysia Balanced Aggressive Fund",3,0,"2008-10-20","2012-12-31",{"$f":"IF(A3=\"\",\"\",VLOOKUP(A3,InNav!B:E,4,FALSE))","v":1}]
["BALM","Sun Life Malaysia Balanced Moderate Fund",3,0,"2008-10-20","2012-12-31",{"$f":"IF(A4=\"\",\"\",VLOOKUP(A4,InNav!B:E,4,FALSE))","v":1}]
["BALS","Sun Life Malaysia Balanced Stable Fund",3,0,"2008-10-20","2012-12-31",{"$f":"IF(A5=\"\",\"\",VLOOKUP(A5,InNav!B:E,4,FALSE))","v":0}]
["CACF","Sun Life Malaysia Conservative Fund",2,0,"2008-10-20","2012-12-31",{"$f":"IF(A6=\"\",\"\",VLOOKUP(A6,InNav!B:E,4,FALSE))","v":1}]
["CAGF","Sun Life Malaysia Growth Fund",1,0,"2008-10-20","2012-12-31",{"$f":"IF(A7=\"\",\"\",VLOOKUP(A7,InNav!B:E,4,FALSE))","v":1}]
["SLDI","SUN LIFE MALAYSIA ASIA PACIFIC DYNAMIC INCOME FUND",1,0,"2015-02-16","2015-12-31",{"$f":"IF(A8=\"\",\"\",VLOOKUP(A8,InNav!B:E,4,FALSE))","v":1}]
["SLMEI","Sun Life Malaysia Equity Income Fund",1,0,"2014-05-09","2014-12-31",{"$f":"IF(A9=\"\",\"\",VLOOKUP(A9,InNav!B:E,4,FALSE))","v":0}]
["SLMGT","Sun Life Malaysia Global Titans Fund",1,0,"2014-05-09","2014-12-31",{"$f":"IF(A10=\"\",\"\",VLOOKUP(A10,InNav!B:E,4,FALSE))","v":1}]
["SLMHSA","Sun Life M'sia Select Asia(ex Japan) Quantum Fund",1,0,"2014-05-09","2014-12-31",{"$f":"IF(A11=\"\",\"\",VLOOKUP(A11,InNav!B:E,4,FALSE))","v":1}]
["SLPI","SUN LIFE MALAYSIA ASIA PACIFIC EQUITY FUND",1,0,"2015-02-16","2015-12-31",{"$f":"IF(A12=\"\",\"\",VLOOKUP(A12,InNav!B:E,4,FALSE))","v":0}]
["SLSB","SUN LIFE MALAYSIA SELECT BOND FUND",1,0,"2018-01-08","2018-12-31",{"$f":"IF(A13=\"\",\"\",VLOOKUP(A13,InNav!B:E,4,FALSE))","v":0}]
["SLWE","SUN LIFE MALAYSIA WORLD EQUITY FUND",1,0,"2015-02-16","2015-12-31",{"$f":"IF(A14=\"\",\"\",VLOOKUP(A14,InNav!B:E,4,FALSE))","v":0}]
[null,null,null,null,null,null,{"$f":"IF(A15=\"\",\"\",VLOOKUP(A15,InNav!B:E,4,FALSE))","v":""}]
{"$rows_left_out":36}
{"sheet":"InNav","index":3,"n_rows":14,"n_cols":5,"rows_kept":14,"cut":false,"hidden":true,"merged":[]}
[]
["FundName","qFundCode","qValDate","NAV","FundSize"]
["SUN LIFE MALAYSIA SELECT BOND FUND","SLSB","2018-01-30",14237.22,0]
["Sun Life Malaysia Balanced Stable Fund","BALS","2018-01-30",2698177.99,0]
["SUN LIFE MALAYSIA ASIA PACIFIC EQUITY FUND","SLPI","2018-01-30",3670894.35,0]
["SUN LIFE MALAYSIA WORLD EQUITY FUND","SLWE","2018-01-30",3786962.79,0]
["Sun Life Malaysia Equity Income Fund","SLMEI","2018-01-30",4898229.62,0]
["Sun Life Malaysia Balanced Aggressive Fund","BALA","2018-01-30",7352433.3200000003,1]
["Sun Life Malaysia Balanced Moderate Fund","BALM","2018-01-30",9758352.3800000008,1]
["Sun Life M'sia Select Asia(ex Japan) Quantum Fund","SLMHSA","2018-01-30",20930866.350000001,1]
["Sun Life Malaysia Global Titans Fund","SLMGT","2018-01-30",27485828.57,1]
["Sun Life Malaysia Conservative Fund","CACF","2018-01-30",39788715.359999999,1]
["Sun Life Malaysia Growth Fund","CAGF","2018-01-30",56912404.490000002,1]
["SUN LIFE MALAYSIA ASIA PACIFIC DYNAMIC INCOME FUND","SLDI","2018-01-30",105841556.38,1]

{"sheet":"InInput1","index":4,"n_rows":14,"n_cols":10,"rows_kept":14,"cut":false,"hidden":true,"merged":[]}
[]
["FundName","qFundCode","qValDate","BuyPrice","we",null,"FundName","qFundCode","Max","Min"]
["Sun Life Malaysia Balanced Aggressive Fund","BALA","2008-10-28",0.99180000000000001,1,null,"Sun Life Malaysia Balanced Aggressive Fund","BALA",2.1273,1.8292999999999999]
["Sun Life Malaysia Balanced Moderate Fund","BALM","2008-10-28",0.99180000000000001,1,null,"Sun Life Malaysia Balanced Moderate Fund","BALM",1.7739,1.5851999999999999]
["Sun Life Malaysia Balanced Stable Fund","BALS","2008-10-28",0.99180000000000001,1,null,"Sun Life Malaysia Balanced Stable Fund","BALS",1.4778,1.3734999999999999]
["Sun Life Malaysia Conservative Fund","CACF","2008-10-28",1,1,null,"Sun Life Malaysia Conservative Fund","CACF",1.296,1.2464]
["Sun Life Malaysia Growth Fund","CAGF","2008-10-28",1,1,null,"Sun Life Malaysia Growth Fund","CAGF",2.7711000000000001,2.2597]
["SUN LIFE MALAYSIA ASIA PACIFIC DYNAMIC INCOME FUND","SLDI","2015-02-13",1,1,null,"SUN LIFE MALAYSIA ASIA PACIFIC DYNAMIC INCOME FUND","SLDI",1.4080999999999999,1.1086]
["Sun Life Malaysia Equity Income Fund","SLMEI","2014-05-19",1,1,null,"Sun Life Malaysia Equity Income Fund","SLMEI",1.4335,1.1262000000000001]
["Sun Life Malaysia Global Titans Fund","SLMGT","2014-05-19",1,1,null,"Sun Life Malaysia Global Titans Fund","SLMGT",1.5838000000000001,1.4272]
["Sun Life M'sia Select Asia(ex Japan) Quantum Fund","SLMHSA","2014-05-19",1,1,null,"Sun Life M'sia Select Asia(ex Japan) Quantum Fund","SLMHSA",1.4325000000000001,1.2524]
["SUN LIFE MALAYSIA ASIA PACIFIC EQUITY FUND","SLPI","2015-02-13",1,1,null,"SUN LIFE MALAYSIA ASIA PACIFIC EQUITY FUND","SLPI",1.3403,1.0721000000000001]
["SUN LIFE MALAYSIA SELECT BOND FUND","SLSB","2018-01-05",1,1,null,"SUN LIFE MALAYSIA SELECT BOND FUND","SLSB",1,0.99809999999999999]
["SUN LIFE MALAYSIA WORLD EQUITY FUND","SLWE","2015-02-13",1,1,null,"SUN LIFE MALAYSIA WORLD EQUITY FUND","SLWE",1.1783999999999999,1.0789]

{"sheet":"InInput2","index":5,"n_rows":11097,"n_cols":9,"rows_kept":11097,"cut":false,"hidden":true,"merged":[]}
[]
["Helper","M","FundName","qFundCode","qValDate","BuyPrice","qFundType","NAV","re"]
["Sun Life Malaysia Balanced Aggressive Fund31-01-2013","Sun Life Malaysia Balanced Aggressive Fund20131","Sun Life Malaysia Balanced Aggressive Fund","BALA","2013-01-31",1.6875,3,6737212.3799999999,1]
["Sun Life Malaysia Balanced Aggressive Fund28-02-2013","Sun Life Malaysia Balanced Aggressive Fund20132","Sun Life Malaysia Balanced Aggressive Fund","BALA","2013-02-28",1.7007000000000001,3,6805883.4500000002,1]
["Sun Life Malaysia Balanced Aggressive Fund29-03-2013","Sun Life Malaysia Balanced Aggressive Fund20133","Sun Life Malaysia Balanced Aggressive Fund","BALA","2013-03-29",1.7255,3,6841404.6600000001,1]
["Sun Life Malaysia Balanced Aggressive Fund30-04-2013","Sun Life Malaysia Balanced Aggressive Fund20134","Sun Life Malaysia Balanced Aggressive Fund","BALA","2013-04-30",1.7625999999999999,3,6952316.0499999998,1]
["Sun Life Malaysia Balanced Aggressive Fund31-05-2013","Sun Life Malaysia Balanced Aggressive Fund20135","Sun Life Malaysia Balanced Aggressive Fund","BALA","2013-05-31",1.8536999999999999,3,7252219.0700000003,1]
["Sun Life Malaysia Balanced Aggressive Fund28-06-2013","Sun Life Malaysia Balanced Aggressive Fund20136","Sun Life Malaysia Balanced Aggressive Fund","BALA","2013-06-28",1.8233999999999999,3,7093770.0700000003,1]
["Sun Life Malaysia Balanced Aggressive Fund31-07-2013","Sun Life Malaysia Balanced Aggressive Fund20137","Sun Life Malaysia Balanced Aggressive Fund","BALA","2013-07-31",1.8334999999999999,3,7072212.7599999998,1]
["Sun Life Malaysia Balanced Aggressive Fund30-08-2013","Sun Life Malaysia Balanced Aggressive Fund20138","Sun Life Malaysia Balanced Aggressive Fund","BALA","2013-08-30",1.8002,3,6986082.4699999997,1]
["Sun Life Malaysia Balanced Aggressive Fund30-09-2013","Sun Life Malaysia Balanced Aggressive Fund20139","Sun Life Malaysia Balanced Aggressive Fund","BALA","2013-09-30",1.8365,3,7133106.5099999998,1]
["Sun Life Malaysia Balanced Aggressive Fund31-10-2013","Sun Life Malaysia Balanced Aggressive Fund201310","Sun Life Malaysia Balanced Aggressive Fund","BALA","2013-10-31",1.8708,3,7264632.0700000003,1]
["Sun Life Malaysia Balanced Aggressive Fund29-11-2013","Sun Life Malaysia Balanced Aggressive Fund201311","Sun Life Malaysia Balanced Aggressive Fund","BALA","2013-11-29",1.8785000000000001,3,7304412.3099999996,1]
["Sun Life Malaysia Balanced Aggressive Fund31-12-2013","Sun Life Malaysia Balanced Aggressive Fund201312","Sun Life Malaysia Balanced Aggressive Fund","BALA","2013-12-31",1.9400999999999999,3,7522741.6299999999,1]
["Sun Life Malaysia Balanced Aggressive Fund30-01-2014","Sun Life Malaysia Balanced Aggressive Fund20141","Sun Life Malaysia Balanced Aggressive Fund","BALA","2014-01-30",1.9024000000000001,3,7390141.9100000001,1]
{"$rows_left_out":11083}
{"sheet":"Input1","index":6,"n_rows":61,"n_cols":7,"rows_kept":61,"cut":false,"hidden":false,"merged":[]}
[{"$f":"\"Performance of Invesment Linked Fund \" & (TEXT(Main!C14,\"\"))","v":"Performance of Invesment Linked Fund Conventional"}]
[]
[null,"Fund Size Above RM 5 Million"]
["Monthly",{"$f":"TEXT(ValueDate,\"MMM\") & TEXT(ValueDate,\"YYYY\")","v":"Jan2018"}]
[]
[{"$f":"\"Name of Company: \" & (TEXT(CompanyName,\"\"))","v":"Name of Company: SUN LIFE MALAYSIA ASSURANCE BERHAD"}]
[]
[null,"Name","Categories","Launch Date","Net Asset Value","Highest Net Asset","Lowest Net Asset"]
[null,"of ","of",null,"per unit at Launch","Value per unit","Value per unit"]
[null,"Funds","fund (numerical)",null,"Date","within last 1 year","within last 1 year"]
[]
[null,"Sun Life Malaysia Balanced Aggressive Fund",{"$f":"IF(B12=\"\",\"\",VLOOKUP(B12,InFund!B:C,2,FALSE))","v":3},{"$f":"IF(B12=\"\",\"\",VLOOKUP(B12,InInput1!A:C,3,FALSE))","v":"2008-10-28"},{"$f":"IF(B12=\"\",\"\",TEXT(VLOOKUP(B12,InInput1!A:D,4,FALSE),\"0.000\"))","v":"0.992"},{"$f":"IF(B12=\"\",\"\",TEXT(VLOOKUP(B12,InInput1!G:J,3,FALSE),\"0.000\"))","v":"2.127"},{"$f":"IF(B12=\"\",\"\",TEXT(VLOOKUP(B12,InInput1!G:J,4,FALSE),\"0.000\"))","v":"1.829"}]
[null,"Sun Life Malaysia Balanced Moderate Fund",{"$f":"IF(B13=\"\",\"\",VLOOKUP(B13,InFund!B:C,2,FALSE))","v":3},{"$f":"IF(B13=\"\",\"\",VLOOKUP(B13,InInput1!A:C,3,FALSE))","v":"2008-10-28"},{"$f":"IF(B13=\"\",\"\",TEXT(VLOOKUP(B13,InInput1!A:D,4,FALSE),\"0.000\"))","v":"0.992"},{"$f":"IF(B13=\"\",\"\",TEXT(VLOOKUP(B13,InInput1!G:J,3,FALSE),\"0.000\"))","v":"1.774"},{"$f":"IF(B13=\"\",\"\",TEXT(VLOOKUP(B13,InInput1!G:J,4,FALSE),\"0.000\"))","v":"1.585"}]
[null,"Sun Life M'sia Select Asia(ex Japan) Quantum Fund",{"$f":"IF(B14=\"\",\"\",VLOOKUP(B14,InFund!B:C,2,FALSE))","v":1},{"$f":"IF(B14=\"\",\"\",VLOOKUP(B14,InInput1!A:C,3,FALSE))","v":"2014-05-19"},{"$f":"IF(B14=\"\",\"\",TEXT(VLOOKUP(B14,InInput1!A:D,4,FALSE),\"0.000\"))","v":"1.000"},{"$f":"IF(B14=\"\",\"\",TEXT(VLOOKUP(B14,InInput1!G:J,3,FALSE),\"0.000\"))","v":"1.433"},{"$f":"IF(B14=\"\",\"\",TEXT(VLOOKUP(B14,InInput1!G:J,4,FALSE),\"0.000\"))","v":"1.252"}]
[null,"Sun Life Malaysia Global Titans Fund",{"$f":"IF(B15=\"\",\"\",VLOOKUP(B15,InFund!B:C,2,FALSE))","v":1},{"$f":"IF(B15=\"\",\"\",VLOOKUP(B15,InInput1!A:C,3,FALSE))","v":"2014-05-19"},{"$f":"IF(B15=\"\",\"\",TEXT(VLOOKUP(B15,InInput1!A:D,4,FALSE),\"0.000\"))","v":"1.000"},{"$f":"IF(B15=\"\",\"\",TEXT(VLOOKUP(B15,InInput1!G:J,3,FALSE),\"0.000\"))","v":"1.584"},{"$f":"IF(B15=\"\",\"\",TEXT(VLOOKUP(B15,InInput1!G:J,4,FALSE),\"0.000\"))","v":"1.427"}]
{"$rows_left_out":47}
{"sheet":"Input2","index":7,"n_rows":59,"n_cols":11,"rows_kept":59,"cut":false,"hidden":false,"merged":[]}
[{"$f":"\"Performance of Invesment Linked Fund \" & (TEXT(Main!C14,\"\"))","v":"Performance of Invesment Linked Fund Conventional"}]
[]
[null,"Fund Size Above RM 5 Million"]
["Monthly",{"$f":"TEXT(ValueDate,\"MMM\") & TEXT(ValueDate,\"YYYY\")","v":"Jan2018"}]
[]
[{"$f":"\"Name of Company: \" & (TEXT(CompanyName,\"\"))","v":"Name of Company: SUN LIFE MALAYSIA ASSURANCE BERHAD"}]
[]
[null,"Name ","Categories ","At ",null," Adjusted Net Asset Value per Unit ( Rm) "]
[null,"of ","of Funds ","Valuation ","1 month ","3 months ","6 months ","1 year","2 years ","3 years ","5 years "]
[null,"funds ","(numerical)","date "]
[]
[null,"Sun Life Malaysia Balanced Aggressive Fund",{"$f":"IF(B12=\"\",\"\",VLOOKUP(B12,InFund!B:C,2,FALSE))","v":3},{"$f":"IF(B12=\"\",\"\",TEXT(VLOOKUP(B12&TEXT(ValueDate,\"DD-MM-YYYY\"),InInput2!A:F,6,FALSE),\"0.000\"))","v":"2.119"},{"$f":"IFERROR(IF(B12=\"\",\"\",TEXT(VLOOKUP(B12&YEAR(EOMONTH(ValueDate,-1))&MONTH(EOMONTH(ValueDate,-1)),InInput2!B:F,5,FALSE),\"0.000\")),\"-\")","v":"2.076"},{"$f":"IFERROR(IF(B12=\"\",\"\",TEXT(VLOOKUP(B12&YEAR(EOMONTH(ValueDate,-3))&MONTH(EOMONTH(ValueDate,-3)),InInput2!B:F,5,FALSE),\"0.000\")),\"-\")","v":"2.031"},{"$f":"IFERROR(IF(B12=\"\",\"\",TEXT(VLOOKUP(B12&YEAR(EOMONTH(ValueDate,-6))&MONTH(EOMONTH(ValueDate,-6)),InInput2!B:F,5,FALSE),\"0.000\")),\"-\")","v":"1.984"},{"$f":"IFERROR(IF(B12=\"\",\"\",TEXT(VLOOKUP(B12&YEAR(EOMONTH(ValueDate,-12))&MONTH(EOMONTH(ValueDate,-12)),InInput2!B:F,5,FALSE),\"0.000\")),\"-\")","v":"1.829"},{"$f":"IFERROR(IF(B12=\"\",\"\",TEXT(VLOOKUP(B12&YEAR(EOMONTH(ValueDate,-24))&MONTH(EOMONTH(ValueDate,-24)),InInput2!B:F,5,FALSE),\"0.000\")),\"-\")","v":"1.810"},{"$f":"IFERROR(IF(B12=\"\",\"\",TEXT(VLOOKUP(B12&YEAR(EOMONTH(ValueDate,-36))&MONTH(EOMONTH(ValueDate,-36)),InInput2!B:F,5,FALSE),\"0.000\")),\"-\")","v":"1.906"},{"$f":"IFERROR(IF(B12=\"\",\"\",TEXT(VLOOKUP(B12&YEAR(EOMONTH(ValueDate,-60))&MONTH(EOMONTH(ValueDate,-60)),InInput2!B:F,5,FALSE),\"0.000\")),\"-\")","v":"1.688"}]
[null,"Sun Life Malaysia Balanced Moderate Fund",{"$f":"IF(B13=\"\",\"\",VLOOKUP(B13,InFund!B:C,2,FALSE))","v":3},{"$f":"IF(B13=\"\",\"\",TEXT(VLOOKUP(B13&TEXT(ValueDate,\"DD-MM-YYYY\"),InInput2!A:F,6,FALSE),\"0.000\"))","v":"1.769"},{"$f":"IFERROR(IF(B13=\"\",\"\",TEXT(VLOOKUP(B13&YEAR(EOMONTH(ValueDate,-1))&MONTH(EOMONTH(ValueDate,-1)),InInput2!B:F,5,FALSE),\"0.000\")),\"-\")","v":"1.744"},{"$f":"IFERROR(IF(B13=\"\",\"\",TEXT(VLOOKUP(B13&YEAR(EOMONTH(ValueDate,-3))&MONTH(EOMONTH(ValueDate,-3)),InInput2!B:F,5,FALSE),\"0.000\")),\"-\")","v":"1.716"},{"$f":"IFERROR(IF(B13=\"\",\"\",TEXT(VLOOKUP(B13&YEAR(EOMONTH(ValueDate,-6))&MONTH(EOMONTH(ValueDate,-6)),InInput2!B:F,5,FALSE),\"0.000\")),\"-\")","v":"1.685"},{"$f":"IFERROR(IF(B13=\"\",\"\",TEXT(VLOOKUP(B13&YEAR(EOMONTH(ValueDate,-12))&MONTH(EOMONTH(ValueDate,-12)),InInput2!B:F,5,FALSE),\"0.000\")),\"-\")","v":"1.585"},{"$f":"IFERROR(IF(B13=\"\",\"\",TEXT(VLOOKUP(B13&YEAR(EOMONTH(ValueDate,-24))&MONTH(EOMONTH(ValueDate,-24)),InInput2!B:F,5,FALSE),\"0.000\")),\"-\")","v":"1.559"},{"$f":"IFERROR(IF(B13=\"\",\"\",TEXT(VLOOKUP(B13&YEAR(EOMONTH(ValueDate,-36))&MONTH(EOMONTH(ValueDate,-36)),InInput2!B:F,5,FALSE),\"0.000\")),\"-\")","v":"1.597"},{"$f":"IFERROR(IF(B13=\"\",\"\",TEXT(VLOOKUP(B13&YEAR(EOMONTH(ValueDate,-60))&MONTH(EOMONTH(ValueDate,-60)),InInput2!B:F,5,FALSE),\"0.000\")),\"-\")","v":"1.456"}]
[null,"Sun Life M'sia Select Asia(ex Japan) Quantum Fund",{"$f":"IF(B14=\"\",\"\",VLOOKUP(B14,InFund!B:C,2,FALSE))","v":1},{"$f":"IF(B14=\"\",\"\",TEXT(VLOOKUP(B14&TEXT(ValueDate,\"DD-MM-YYYY\"),InInput2!A:F,6,FALSE),\"0.000\"))","v":"1.355"},{"$f":"IFERROR(IF(B14=\"\",\"\",TEXT(VLOOKUP(B14&YEAR(EOMONTH(ValueDate,-1))&MONTH(EOMONTH(ValueDate,-1)),InInput2!B:F,5,FALSE),\"0.000\")),\"-\")","v":"1.326"},{"$f":"IFERROR(IF(B14=\"\",\"\",TEXT(VLOOKUP(B14&YEAR(EOMONTH(ValueDate,-3))&MONTH(EOMONTH(ValueDate,-3)),InInput2!B:F,5,FALSE),\"0.000\")),\"-\")","v":"1.380"},{"$f":"IFERROR(IF(B14=\"\",\"\",TEXT(VLOOKUP(B14&YEAR(EOMONTH(ValueDate,-6))&MONTH(EOMONTH(ValueDate,-6)),InInput2!B:F,5,FALSE),\"0.000\")),\"-\")","v":"1.389"},{"$f":"IFERROR(IF(B14=\"\",\"\",TEXT(VLOOKUP(B14&YEAR(EOMONTH(ValueDate,-12))&MONTH(EOMONTH(ValueDate,-12)),InInput2!B:F,5,FALSE),\"0.000\")),\"-\")","v":"1.252"},{"$f":"IFERROR(IF(B14=\"\",\"\",TEXT(VLOOKUP(B14&YEAR(EOMONTH(ValueDate,-24))&MONTH(EOMONTH(ValueDate,-24)),InInput2!B:F,5,FALSE),\"0.000\")),\"-\")","v":"1.008"},{"$f":"IFERROR(IF(B14=\"\",\"\",TEXT(VLOOKUP(B14&YEAR(EOMONTH(ValueDate,-36))&MONTH(EOMONTH(ValueDate,-36)),InInput2!B:F,5,FALSE),\"0.000\")),\"-\")","v":"1.027"},{"$f":"IFERROR(IF(B14=\"\",\"\",TEXT(VLOOKUP(B14&YEAR(EOMONTH(ValueDate,-60))&MONTH(EOMONTH(ValueDate,-60)),InInput2!B:F,5,FALSE),\"0.000\")),\"-\")","v":"-"}]
[null,"Sun Life Malaysia Global Titans Fund",{"$f":"IF(B15=\"\",\"\",VLOOKUP(B15,InFund!B:C,2,FALSE))","v":1},{"$f":"IF(B15=\"\",\"\",TEXT(VLOOKUP(B15&TEXT(ValueDate,\"DD-MM-YYYY\"),InInput2!A:F,6,FALSE),\"0.000\"))","v":"1.566"},{"$f":"IFERROR(IF(B15=\"\",\"\",TEXT(VLOOKUP(B15&YEAR(EOMONTH(ValueDate,-1))&MONTH(EOMONTH(ValueDate,-1)),InInput2!B:F,5,FALSE),\"0.000\")),\"-\")","v":"1.540"},{"$f":"IFERROR(IF(B15=\"\",\"\",TEXT(VLOOKUP(B15&YEAR(EOMONTH(ValueDate,-3))&MONTH(EOMONTH(ValueDate,-3)),InInput2!B:F,5,FALSE),\"0.000\")),\"-\")","v":"1.570"},{"$f":"IFERROR(IF(B15=\"\",\"\",TEXT(VLOOKUP(B15&YEAR(EOMONTH(ValueDate,-6))&MONTH(EOMONTH(ValueDate,-6)),InInput2!B:F,5,FALSE),\"0.000\")),\"-\")","v":"1.520"},{"$f":"IFERROR(IF(B15=\"\",\"\",TEXT(VLOOKUP(B15&YEAR(EOMONTH(ValueDate,-12))&MONTH(EOMONTH(ValueDate,-12)),InInput2!B:F,5,FALSE),\"0.000\")),\"-\")","v":"1.427"},{"$f":"IFERROR(IF(B15=\"\",\"\",TEXT(VLOOKUP(B15&YEAR(EOMONTH(ValueDate,-24))&MONTH(EOMONTH(ValueDate,-24)),InInput2!B:F,5,FALSE),\"0.000\")),\"-\")","v":"1.217"},{"$f":"IFERROR(IF(B15=\"\",\"\",TEXT(VLOOKUP(B15&YEAR(EOMONTH(ValueDate,-36))&MONTH(EOMONTH(ValueDate,-36)),InInput2!B:F,5,FALSE),\"0.000\")),\"-\")","v":"1.126"},{"$f":"IFERROR(IF(B15=\"\",\"\",TEXT(VLOOKUP(B15&YEAR(EOMONTH(ValueDate,-60))&MONTH(EOMONTH(ValueDate,-60)),InInput2!B:F,5,FALSE),\"0.000\")),\"-\")","v":"-"}]
{"$rows_left_out":45}
{"sheet":"Input3","index":8,"n_rows":59,"n_cols":10,"rows_kept":59,"cut":false,"hidden":false,"merged":[[7,3,7,5],[7,6,7,9],[37,3,37,5],[37,6,37,9]]}
[{"$f":"\"Performance of Invesment Linked Fund \" & (TEXT(Main!C14,\"\"))","v":"Performance of Invesment Linked Fund Conventional"}]
[]
[null,"Fund Size Above RM 5 Million"]
["Monthly",{"$f":"TEXT(ValueDate,\"MMM\") & TEXT(ValueDate,\"YYYY\")","v":"Jan2018"}]
[]
[{"$f":"\"Name of Company: \" & (TEXT(CompanyName,\"\"))","v":"Name of Company: SUN LIFE MALAYSIA ASSURANCE BERHAD"}]
[]
[null,"Name ","Categories ","Unit Splits ",null,null,"Dividends  Distribution Per Unit "]
[null,"of ","of Funds ","Ratio of ","Net asset value ","Net asset value ","Date of ","Value of ","Net asset value ","Net asset value "]
[null,"funds ","(numerical)","Unit Splits ","per unit before ","per unit after ","Distribution ","Gross Dividends ","per unit before ","per unit after "]
[null,null,null,null,"split(s) ","split(s) ",null,null,"distributions  ","distributions  "]
[]
[null,"Sun Life Malaysia Balanced Aggressive Fund",{"$f":"IF(B13=\"\",\"\",VLOOKUP(B13,InFund!B:C,2,FALSE))","v":3},"N/A","N/A","N/A",null,"N/A","N/A","N/A"]
[null,"Sun Life Malaysia Balanced Moderate Fund",{"$f":"IF(B14=\"\",\"\",VLOOKUP(B14,InFund!B:C,2,FALSE))","v":3},"N/A","N/A","N/A",null,"N/A","N/A","N/A"]
[null,"Sun Life M'sia Select Asia(ex Japan) Quantum Fund",{"$f":"IF(B15=\"\",\"\",VLOOKUP(B15,InFund!B:C,2,FALSE))","v":1},"N/A","N/A","N/A",null,"N/A","N/A","N/A"]
{"$rows_left_out":45}
{"sheet":"Reference","index":9,"n_rows":5,"n_cols":4,"rows_kept":5,"cut":false,"hidden":true,"merged":[]}
["Fund Code",null,"Font Name","Font Size"]
["KHAZANAH",null,"Calibri",24]
["KWAP"]
["MEQESG"]
["YAMIR-VCAM"]