{"text_format":"1","workbook":"xlsx","n_sheets":14,"sheets":["Map","SunAccount Transfer File","MapPage","Main","Transfertext","TransfertextRev","InTB","InTBRev","Header","InCurrency","DailyTrialBalance","Map (3)","Mapping","Investment"],"not_rendered":{"charts":0,"images":1,"macros":1,"external_links":1,"defined_names":41,"comments":1,"pivot_tables":0},"unopened":[],"bounds":{"document_bytes":16777216,"sheet_cells":100000,"rows_first":2000,"rows_last":500,"rows_between":2000,"halvings":0,"cell_chars":16384,"cell_head_chars":4096},"cells_cut":0,"cells_raw":0,"read":"whole","date_system":"1900"}

{"sheet":"Map","index":0,"n_rows":90,"n_cols":19,"rows_kept":90,"cut":false,"hidden":true,"merged":[]}
["Please fill in the Sun GL Account code for thetable below"]
[null,null,"Local",null,null,null,null,null,null,"Foreign"]
[null,null,"Local Corporate Bonds","Local MGS","Local Deposit","Money Market","Unquoted Shares","Local Listed Shares","REITS","Foreign Corporate Bonds","Foreign MGS","Foreign Deposit","Foreign Listed Shares","NID","UNIT TRUST (Hwang Enhanced Cash Fund)","UNIT TRUST (Amcash Plus)","UNIT TRUST (CIMB  P.- Bond Fund)","UNIT TRUST (Nomura i-cash fund)"]
[null,"Cost",53202,53101,52001,52003,53302,53301,53501,53202,53101,52001,53301,52002,53401,53403,53404,53405]
["DivTaxed","Pre Acq Coupon",21260,null,null,null,null,null,null,21260]
["ProvUnGnL","Unrealised Gain (p/l)",null,null,null,null,null,25210,null,null,null,null,25210]
{"$rows_left_out":85}
{"sheet":"SunAccount Transfer File","index":1,"n_rows":64,"n_cols":6,"rows_kept":64,"cut":false,"hidden":true,"merged":[]}
["Accounting Transaction"]
[]
["Item","Start Position","Length","Reply","Comments"]
["Account Code",1,10,"FOLLOW 5 DIGIT AS PER \"MAP\" SHEET","10 characters","Note your MAP only give 5 digit, Leave trailing space ?"]
["Filler",11,5,null,"Spaces","Leave Blank"]
["Accounting Period",16,7,null,"yyyyppp (year number, period number)","ok"]
{"$rows_left_out":59}
{"sheet":"MapPage","index":2,"n_rows":113,"n_cols":6,"rows_kept":113,"cut":false,"hidden":true,"merged":[]}
[null,{"$f":"E1&\": \"&F1","v":": "},{"$f":"OFFSET(Map!$B$42,MATCH(MapPage!E1,mapxaxis,0),MATCH(MapPage!F1,mapyaxis,0))","v":{"$error":"#N/A"}},{"$f":"OFFSET(Map!$B$3,MATCH(MapPage!E1,mapxaxis,0),MATCH(MapPage!F1,mapyaxis,0))","v":{"$error":"#N/A"}}]
["Riskk GL Description","Sun GL Description","Riskk GL Code","Sun GL Account Code","X-axis","Y-axis"]
["Cost: Local Listed Share",{"$f":"E3&\": \"&F3","v":"Cost: Local Listed Shares"},{"$f":"OFFSET(Map!$B$42,MATCH(MapPage!E3,mapxaxis,0),MATCH(MapPage!F3,mapyaxis,0))","v":100010},{"$f":"OFFSET(Map!$B$3,MATCH(MapPage!E3,mapxaxis,0),MATCH(MapPage!F3,mapyaxis,0))","v":53301},"Cost","Local Listed Shares"]
["Cost: Foreign Listed Share",{"$f":"E4&\": \"&F4","v":"Cost: Foreign Listed Shares"},{"$f":"OFFSET(Map!$B$42,MATCH(MapPage!E4,mapxaxis,0),MATCH(MapPage!F4,mapyaxis,0))","v":100015},{"$f":"OFFSET(Map!$B$3,MATCH(MapPage!E4,mapxaxis,0),MATCH(MapPage!F4,mapyaxis,0))","v":53301},"Cost","Foreign Listed Shares"]
["Cost: Local UnListed Share","Cost: Unquoted Shares",{"$f":"OFFSET(Map!$B$42,MATCH(MapPage!E5,mapxaxis,0),MATCH(MapPage!F5,mapyaxis,0))","v":100030},{"$f":"OFFSET(Map!$B$3,MATCH(MapPage!E5,mapxaxis,0),MATCH(MapPage!F5,mapyaxis,0))","v":53302},"Cost","Unquoted Shares"]
["Cost: Commercial Bond","Cost: Local Corporate Bonds",{"$f":"OFFSET(Map!$B$42,MATCH(MapPage!E6,mapxaxis,0),MATCH(MapPage!F6,mapyaxis,0))","v":100110},{"$f":"OFFSET(Map!$B$3,MATCH(MapPage!E6,mapxaxis,0),MATCH(MapPage!F6,mapyaxis,0))","v":53202},"Cost","Local Corporate Bonds"]
{"$rows_left_out":108}
{"sheet":"Main","index":3,"n_rows":29,"n_cols":10,"rows_kept":29,"cut":false,"hidden":false,"merged":[]}
[null,null,null,null,null,null,{"$f":"EOMONTH(valuedate,-MONTH(valuedate))+1","v":"2020-01-01"},{"$f":"EOMONTH(valuedate,-MONTH(valuedate)+3)+1","v":"2020-04-01"},null,"USD"]
[null,null,null,null,null,null,{"$f":"EOMONTH(valuedate,-MONTH(valuedate)+6)+1","v":"2020-07-01"},{"$f":"EOMONTH(valuedate,-MONTH(valuedate)+9)+1","v":"2020-10-01"}]
[]
[]
[]
[]
{"$rows_left_out":24}
{"sheet":"Transfertext","index":4,"n_rows":61,"n_cols":1,"rows_kept":61,"cut":false,"hidden":false,"merged":[]}
[{"$f":"\"VERSION\"&REPT(\" \",25)&\"42001\"","v":"VERSION                         42001"}]
[{"$f":"IF(InTB!K3=999,\"  999\",InTB!K3)&REPT(\" \",10)&YEAR(InTB!A3)&\"0\"&TEXT(InTB!A3,\"mm\")&TEXT(InTB!A3,\"yyyymmdd\")&REPT(\" \",2)&\"L\"&REPT(\" \",7)&REPT(\" \",7)&TEXT(ABS(InTB!F3)*1000,\"000000000000000000\")&IF(InTB!F3>=0,\"D\",\"C\")&REPT(\" \",1)&\"SINV \"&\"IMS  \"&InTB!B3&REPT(\" \",15-LEN(InTB!B3))&\"IMS: INVESTMENT\"&REPT(\" \",10)&TEXT(InTB!A3,\"yyyymmdd\")&YEAR(InTB!A3)&\"0\"&TEXT(InTB!A3,\"mm\")&TEXT(InTB!A3,\"yyyymmdd\")&REPT(\" \",6)&REPT(\" \",9)&TEXT(InTB!A3,\"yyyymmdd\")&YEAR(InTB!A3)&\"0\"&TEXT(InTB!A3,\"mm\")&\"V\"&REPT(\" \",85)&\"COT\"&REPT(\" \",12)&\"KLZZZ          \"&\"CN             \"&\"OT             \"&REPT(\" \",196)","v":"12340          202001220201214  L              000000000000701000D SINV IMS  HFT            IMS: INVESTMENT          20201214202001220201214               202012142020012V                                                                                     COT            KLZZZ          CN             OT                                                                                                                                                                                                                 "}]
[{"$f":"IF(InTB!K4=999,\"  999\",InTB!K4)&REPT(\" \",10)&YEAR(InTB!A4)&\"0\"&TEXT(InTB!A4,\"mm\")&TEXT(InTB!A4,\"yyyymmdd\")&REPT(\" \",2)&\"L\"&REPT(\" \",7)&REPT(\" \",7)&TEXT(ABS(InTB!F4)*1000,\"000000000000000000\")&IF(InTB!F4>=0,\"D\",\"C\")&REPT(\" \",1)&\"SINV \"&\"IMS  \"&InTB!B4&REPT(\" \",15-LEN(InTB!B4))&\"IMS: INVESTMENT\"&REPT(\" \",10)&TEXT(InTB!A4,\"yyyymmdd\")&YEAR(InTB!A4)&\"0\"&TEXT(InTB!A4,\"mm\")&TEXT(InTB!A4,\"yyyymmdd\")&REPT(\" \",6)&REPT(\" \",9)&TEXT(InTB!A4,\"yyyymmdd\")&YEAR(InTB!A4)&\"0\"&TEXT(InTB!A4,\"mm\")&\"V\"&REPT(\" \",85)&\"COT\"&REPT(\" \",12)&\"KLZZZ          \"&\"CN             \"&\"OT             \"&REPT(\" \",196)","v":"16210          202001220201214  L              000000000000008740C SINV IMS  HFT            IMS: INVESTMENT          20201214202001220201214               202012142020012V                                                                                     COT            KLZZZ          CN             OT                                                                                                                                                                                                                 "}]
[{"$f":"IF(InTB!K5=999,\"  999\",InTB!K5)&REPT(\" \",10)&YEAR(InTB!A5)&\"0\"&TEXT(InTB!A5,\"mm\")&TEXT(InTB!A5,\"yyyymmdd\")&REPT(\" \",2)&\"L\"&REPT(\" \",7)&REPT(\" \",7)&TEXT(ABS(InTB!F5)*1000,\"000000000000000000\")&IF(InTB!F5>=0,\"D\",\"C\")&REPT(\" \",1)&\"SINV \"&\"IMS  \"&InTB!B5&REPT(\" \",15-LEN(InTB!B5))&\"IMS: INVESTMENT\"&REPT(\" \",10)&TEXT(InTB!A5,\"yyyymmdd\")&YEAR(InTB!A5)&\"0\"&TEXT(InTB!A5,\"mm\")&TEXT(InTB!A5,\"yyyymmdd\")&REPT(\" \",6)&REPT(\" \",9)&TEXT(InTB!A5,\"yyyymmdd\")&YEAR(InTB!A5)&\"0\"&TEXT(InTB!A5,\"mm\")&\"V\"&REPT(\" \",85)&\"COT\"&REPT(\" \",12)&\"KLZZZ          \"&\"CN             \"&\"OT             \"&REPT(\" \",196)","v":"16210          202001220201214  L              000000000217829920C SINV IMS  TMUT           IMS: INVESTMENT          20201214202001220201214               202012142020012V                                                                                     COT            KLZZZ          CN             OT                                                                                                                                                                                                                 "}]
[{"$f":"IF(InTB!K6=999,\"  999\",InTB!K6)&REPT(\" \",10)&YEAR(InTB!A6)&\"0\"&TEXT(InTB!A6,\"mm\")&TEXT(InTB!A6,\"yyyymmdd\")&REPT(\" \",2)&\"L\"&REPT(\" \",7)&REPT(\" \",7)&TEXT(ABS(InTB!F6)*1000,\"000000000000000000\")&IF(InTB!F6>=0,\"D\",\"C\")&REPT(\" \",1)&\"SINV \"&\"IMS  \"&InTB!B6&REPT(\" \",15-LEN(InTB!B6))&\"IMS: INVESTMENT\"&REPT(\" \",10)&TEXT(InTB!A6,\"yyyymmdd\")&YEAR(InTB!A6)&\"0\"&TEXT(InTB!A6,\"mm\")&TEXT(InTB!A6,\"yyyymmdd\")&REPT(\" \",6)&REPT(\" \",9)&TEXT(InTB!A6,\"yyyymmdd\")&YEAR(InTB!A6)&\"0\"&TEXT(InTB!A6,\"mm\")&\"V\"&REPT(\" \",85)&\"COT\"&REPT(\" \",12)&\"KLZZZ          \"&\"CN             \"&\"OT             \"&REPT(\" \",196)","v":"21110          202001220201214  L              000000008487715460C SINV IMS  HFT            IMS: INVESTMENT          20201214202001220201214               202012142020012V                                                                                     COT            KLZZZ          CN             OT                                                                                                                                                                                                                 "}]
[{"$f":"IF(InTB!K7=999,\"  999\",InTB!K7)&REPT(\" \",10)&YEAR(InTB!A7)&\"0\"&TEXT(InTB!A7,\"mm\")&TEXT(InTB!A7,\"yyyymmdd\")&REPT(\" \",2)&\"L\"&REPT(\" \",7)&REPT(\" \",7)&TEXT(ABS(InTB!F7)*1000,\"000000000000000000\")&IF(InTB!F7>=0,\"D\",\"C\")&REPT(\" \",1)&\"SINV \"&\"IMS  \"&InTB!B7&REPT(\" \",15-LEN(InTB!B7))&\"IMS: INVESTMENT\"&REPT(\" \",10)&TEXT(InTB!A7,\"yyyymmdd\")&YEAR(InTB!A7)&\"0\"&TEXT(InTB!A7,\"mm\")&TEXT(InTB!A7,\"yyyymmdd\")&REPT(\" \",6)&REPT(\" \",9)&TEXT(InTB!A7,\"yyyymmdd\")&YEAR(InTB!A7)&\"0\"&TEXT(InTB!A7,\"mm\")&\"V\"&REPT(\" \",85)&\"COT\"&REPT(\" \",12)&\"KLZZZ          \"&\"CN             \"&\"OT             \"&REPT(\" \",196)","v":"21110          202001220201214  L              000000004772902480C SINV IMS  HFT            IMS: INVESTMENT          20201214202001220201214               202012142020012V                                                                                     COT            KLZZZ          CN             OT                                                                                                                                                                                                                 "}]
{"$rows_left_out":56}
{"sheet":"TransfertextRev","index":5,"n_rows":59,"n_cols":1,"rows_kept":59,"cut":false,"hidden":false,"merged":[]}
[{"$f":"\"VERSION\"&REPT(\" \",25)&\"42001\"","v":"VERSION                         42001"}]
[{"$f":"IF(InTBRev!K3=999,\"  999\",InTBRev!K3)&REPT(\" \",10)&YEAR(InTBRev!A3+1)&\"0\"&TEXT(InTBRev!A3+1,\"mm\")&TEXT(InTBRev!A3+1,\"yyyymmdd\")&REPT(\" \",2)&\"L\"&REPT(\" \",7)&REPT(\" \",7)&TEXT(ABS(InTBRev!F3)*1000,\"000000000000000000\")&IF(InTBRev!F3>=0,\"D\",\"C\")&REPT(\" \",1)&\"SINV \"&\"IMS  \"&InTBRev!B3&REPT(\" \",15-LEN(InTBRev!B3))&\"IMS: INVESTMENT\"&REPT(\" \",10)&TEXT(InTBRev!A3+1,\"yyyymmdd\")&YEAR(InTBRev!A3+1)&\"0\"&TEXT(InTBRev!A3+1,\"mm\")&TEXT(InTBRev!A3+1,\"yyyymmdd\")&REPT(\" \",6)&REPT(\" \",9)&TEXT(InTBRev!A3+1,\"yyyymmdd\")&YEAR(InTBRev!A3+1)&\"0\"&TEXT(InTBRev!A3+1,\"mm\")&\"V\"&REPT(\" \",85)&\"COT\"&REPT(\" \",12)&\"KLZZZ          \"&\"CN             \"&\"OT             \"&REPT(\" \",196)","v":"12340          202001220201208  L              000000000000701000C SINV IMS  HFT            IMS: INVESTMENT          20201208202001220201208               202012082020012V                                                                                     COT            KLZZZ          CN             OT                                                                                                                                                                                                                 "}]
[{"$f":"IF(InTBRev!K4=999,\"  999\",InTBRev!K4)&REPT(\" \",10)&YEAR(InTBRev!A4+1)&\"0\"&TEXT(InTBRev!A4+1,\"mm\")&TEXT(InTBRev!A4+1,\"yyyymmdd\")&REPT(\" \",2)&\"L\"&REPT(\" \",7)&REPT(\" \",7)&TEXT(ABS(InTBRev!F4)*1000,\"000000000000000000\")&IF(InTBRev!F4>=0,\"D\",\"C\")&REPT(\" \",1)&\"SINV \"&\"IMS  \"&InTBRev!B4&REPT(\" \",15-LEN(InTBRev!B4))&\"IMS: INVESTMENT\"&REPT(\" \",10)&TEXT(InTBRev!A4+1,\"yyyymmdd\")&YEAR(InTBRev!A4+1)&\"0\"&TEXT(InTBRev!A4+1,\"mm\")&TEXT(InTBRev!A4+1,\"yyyymmdd\")&REPT(\" \",6)&REPT(\" \",9)&TEXT(InTBRev!A4+1,\"yyyymmdd\")&YEAR(InTBRev!A4+1)&\"0\"&TEXT(InTBRev!A4+1,\"mm\")&\"V\"&REPT(\" \",85)&\"COT\"&REPT(\" \",12)&\"KLZZZ          \"&\"CN             \"&\"OT             \"&REPT(\" \",196)","v":"16210          202001220201208  L              000000000000008740D SINV IMS  HFT            IMS: INVESTMENT          20201208202001220201208               202012082020012V                                                                                     COT            KLZZZ          CN             OT                                                                                                                                                                                                                 "}]
[{"$f":"IF(InTBRev!K5=999,\"  999\",InTBRev!K5)&REPT(\" \",10)&YEAR(InTBRev!A5+1)&\"0\"&TEXT(InTBRev!A5+1,\"mm\")&TEXT(InTBRev!A5+1,\"yyyymmdd\")&REPT(\" \",2)&\"L\"&REPT(\" \",7)&REPT(\" \",7)&TEXT(ABS(InTBRev!F5)*1000,\"000000000000000000\")&IF(InTBRev!F5>=0,\"D\",\"C\")&REPT(\" \",1)&\"SINV \"&\"IMS  \"&InTBRev!B5&REPT(\" \",15-LEN(InTBRev!B5))&\"IMS: INVESTMENT\"&REPT(\" \",10)&TEXT(InTBRev!A5+1,\"yyyymmdd\")&YEAR(InTBRev!A5+1)&\"0\"&TEXT(InTBRev!A5+1,\"mm\")&TEXT(InTBRev!A5+1,\"yyyymmdd\")&REPT(\" \",6)&REPT(\" \",9)&TEXT(InTBRev!A5+1,\"yyyymmdd\")&YEAR(InTBRev!A5+1)&\"0\"&TEXT(InTBRev!A5+1,\"mm\")&\"V\"&REPT(\" \",85)&\"COT\"&REPT(\" \",12)&\"KLZZZ          \"&\"CN             \"&\"OT             \"&REPT(\" \",196)","v":"16210          202001220201208  L              000000000217829920D SINV IMS  TMUT           IMS: INVESTMENT          20201208202001220201208               202012082020012V                                                                                     COT            KLZZZ          CN             OT                                                                                                                                                                                                                 "}]
[{"$f":"IF(InTBRev!K6=999,\"  999\",InTBRev!K6)&REPT(\" \",10)&YEAR(InTBRev!A6+1)&\"0\"&TEXT(InTBRev!A6+1,\"mm\")&TEXT(InTBRev!A6+1,\"yyyymmdd\")&REPT(\" \",2)&\"L\"&REPT(\" \",7)&REPT(\" \",7)&TEXT(ABS(InTBRev!F6)*1000,\"000000000000000000\")&IF(InTBRev!F6>=0,\"D\",\"C\")&REPT(\" \",1)&\"SINV \"&\"IMS  \"&InTBRev!B6&REPT(\" \",15-LEN(InTBRev!B6))&\"IMS: INVESTMENT\"&REPT(\" \",10)&TEXT(InTBRev!A6+1,\"yyyymmdd\")&YEAR(InTBRev!A6+1)&\"0\"&TEXT(InTBRev!A6+1,\"mm\")&TEXT(InTBRev!A6+1,\"yyyymmdd\")&REPT(\" \",6)&REPT(\" \",9)&TEXT(InTBRev!A6+1,\"yyyymmdd\")&YEAR(InTBRev!A6+1)&\"0\"&TEXT(InTBRev!A6+1,\"mm\")&\"V\"&REPT(\" \",85)&\"COT\"&REPT(\" \",12)&\"KLZZZ          \"&\"CN             \"&\"OT             \"&REPT(\" \",196)","v":"21110          202001220201208  L              000000008487715460D SINV IMS  HFT            IMS: INVESTMENT          20201208202001220201208               202012082020012V                                                                                     COT            KLZZZ          CN             OT                                                                                                                                                                                                                 "}]
[{"$f":"IF(InTBRev!K7=999,\"  999\",InTBRev!K7)&REPT(\" \",10)&YEAR(InTBRev!A7+1)&\"0\"&TEXT(InTBRev!A7+1,\"mm\")&TEXT(InTBRev!A7+1,\"yyyymmdd\")&REPT(\" \",2)&\"L\"&REPT(\" \",7)&REPT(\" \",7)&TEXT(ABS(InTBRev!F7)*1000,\"000000000000000000\")&IF(InTBRev!F7>=0,\"D\",\"C\")&REPT(\" \",1)&\"SINV \"&\"IMS  \"&InTBRev!B7&REPT(\" \",15-LEN(InTBRev!B7))&\"IMS: INVESTMENT\"&REPT(\" \",10)&TEXT(InTBRev!A7+1,\"yyyymmdd\")&YEAR(InTBRev!A7+1)&\"0\"&TEXT(InTBRev!A7+1,\"mm\")&TEXT(InTBRev!A7+1,\"yyyymmdd\")&REPT(\" \",6)&REPT(\" \",9)&TEXT(InTBRev!A7+1,\"yyyymmdd\")&YEAR(InTBRev!A7+1)&\"0\"&TEXT(InTBRev!A7+1,\"mm\")&\"V\"&REPT(\" \",85)&\"COT\"&REPT(\" \",12)&\"KLZZZ          \"&\"CN             \"&\"OT             \"&REPT(\" \",196)","v":"21110          202001220201208  L              000000004596698110D SINV IMS  HFT            IMS: INVESTMENT          20201208202001220201208               202012082020012V                                                                                     COT            KLZZZ          CN             OT                                                                                                                                                                                                                 "}]
{"$rows_left_out":54}
{"sheet":"InTB","index":6,"n_rows":62,"n_cols":11,"rows_kept":62,"cut":false,"hidden":false,"merged":[]}
[null,null,null,null,null,-1,null,{"$f":"IF(I1=0,DATE(3000,1,1),IF(OR(LEFT(D1,1)=\"6\",LEFT(D1,1)=\"7\"),EOMONTH(A1,-MONTH(A1)+CHOOSE(CEILING(MONTH(A1)/3,1),1,4,7,10)-1)+1,A1))","v":"3000-01-01"},{"$f":"IF(COUNTA(InCurrency!A:A)=1,0,IF(G1=GlobalCurr,1,1/VLOOKUP(TEXT(IF(OR(LEFT(D1,1)=\"6\",LEFT(D1,1)=\"7\"),EOMONTH(A1,-MONTH(A1)+CHOOSE(CEILING(MONTH(A1)/3,1),1,4,7,10)-1)+1,A1),\"dd-MM-yyyy\")&G1,InCurrency!$D:$E,2,0)))","v":0},{"$f":"IF(COUNTA(InCurrency!A:A)=1,0,ROUND(F1*I1,2))","v":0},{"$f":"IFERROR(IF(OR(D1=\"200000\",D1=\"300000\"),VLOOKUP(D1,Mapping!A:E,5,0),IF(D1=\"500000\",IF(B1=\"HWANG\",VLOOKUP(\"HWANG500000\",Mapping!$A:$E,5,0),VLOOKUP(\"RHB500000\",Mapping!$A:$E,5,0)),VLOOKUP(D1&E1,Mapping!C:E,3,0))),0)","v":0}]
["TBDate","qFundCode","Description","ShortGL","qAssetAccType","Total","qCurrencyCode","Currency Date","Currency","USD Value","SunGL code"]
["2020-12-14","HFT","Expenses: Bank Charges","710102","000",701,"MYR","3000-01-01",0,0,12340]
["2020-12-14","HFT","Income: Other Income","640003","000",-8.74,"MYR","3000-01-01",0,0,16210]
["2020-12-14","TMUT","Income: Rebates of Management Fee","640001","000",-217829.92,"MYR","3000-01-01",0,0,16210]
["2020-12-14","HFT","Income PL","630000","220",-8487715.4600000009,"MYR","3000-01-01",0,0,21110]
{"$rows_left_out":57}
{"sheet":"InTBRev","index":7,"n_rows":60,"n_cols":11,"rows_kept":60,"cut":false,"hidden":false,"merged":[]}
[null,null,null,null,null,-1]
["TBDate","qFundCode","Description","ShortGL","qAssetAccType","Total","qCurrencyCode","Currency Date","Currency","USD Value","SunGL code"]
["2020-12-07","HFT",12340,null,null,-701,"MYR",null,null,0,12340]
["2020-12-07","HFT",16210,null,null,8.74,"MYR",null,null,0,16210]
["2020-12-07","TMUT",16210,null,null,217829.92,"MYR",null,null,0,16210]
["2020-12-07","HFT",21110,null,null,8487715.4600000009,"MYR",null,null,0,21110]
{"$rows_left_out":55}
{"sheet":"Header","index":8,"n_rows":5,"n_cols":4,"rows_kept":5,"cut":false,"hidden":false,"merged":[]}
["Header of the file"]
[]
["Item","Start Position","Length","Comments"]
["VERSION",1,32,"Hardcode wording \"VERSION\""]
[42001,33,5,"Hardcode wording \"42001\""]

{"sheet":"InCurrency","index":9,"n_rows":1,"n_cols":5,"rows_kept":1,"cut":false,"hidden":true,"merged":[]}
["ExDate","BaseCurrency","QuoteCurrency","ExDate&Curr","ExRate"]

{"sheet":"DailyTrialBalance","index":10,"n_rows":82,"n_cols":12,"rows_kept":82,"cut":false,"hidden":true,"merged":[]}
[]
["TBDate","qFundCode","qCurrencyCode","ShortGL","Total","Currency","USD Value","SunGL code","code","check","desc"]
["2014-12-31","HFT","MYR",100210,50642526.729999997,"","",52003,{"$f":"OFFSET(Mapping!$E$1,MATCH(D3,Mapping!$B:$B,0)-1,0)","v":{"$error":"#N/A"}},{"$f":"H3=I3","v":{"$error":"#N/A"}},{"$f":"OFFSET(Investment!$P$1,MATCH(L3,Investment!$M:$M,0)-1,0)","v":"Cost: Local Money Market Placement"},{"$f":"TEXT(D3,\"0\")","v":"100210"}]
["2014-12-31","HFT","MYR",100220,675380325.5,"","",52001,{"$f":"OFFSET(Mapping!$E$1,MATCH(D4,Mapping!$B:$B,0)-1,0)","v":{"$error":"#N/A"}},{"$error":"#N/A"},{"$f":"OFFSET(Investment!$P$1,MATCH(L4,Investment!$M:$M,0)-1,0)","v":{"$error":"#N/A"}},{"$f":"TEXT(D4,\"0\")","v":"100220"}]
["2014-12-31","HFT","MYR",139210,227969.94,"","",{"$error":"#N/A"},{"$f":"OFFSET(Mapping!$E$1,MATCH(D5,Mapping!$B:$B,0)-1,0)","v":{"$error":"#N/A"}},{"$error":"#N/A"},{"$f":"OFFSET(Investment!$P$1,MATCH(L5,Investment!$M:$M,0)-1,0)","v":"IntDebtor: Local Money Market Placement"},"139210"]
["2014-12-31","HFT","MYR",139220,3703762.27,"","",{"$error":"#N/A"},{"$f":"OFFSET(Mapping!$E$1,MATCH(D6,Mapping!$B:$B,0)-1,0)","v":{"$error":"#N/A"}},{"$error":"#N/A"},{"$f":"OFFSET(Investment!$P$1,MATCH(L6,Investment!$M:$M,0)-1,0)","v":{"$error":"#N/A"}},"139220"]
{"$rows_left_out":77}
{"sheet":"Map (3)","index":11,"n_rows":61,"n_cols":60,"rows_kept":61,"cut":false,"hidden":true,"merged":[]}
[null,"Please fill in the Sun GL Account code for thetable below",null,"BDCO","BDMG","CSFD","CSMM","SHUL","SHLI","REIT","BXCO","BDMG","CSFD","SHFL","BNID","UTCX","UTCX","UTBX","UTCX"]
[null,null,null,5,8,13,15,29,28,26,10,8,13,27,9,31,31,30,31]
[null,null,null,"Local",null,null,null,null,null,null,"Foreign"]
[null,null,null,"Local Corporate Bonds","MGS","Local Deposit","Money Market","Unquoted Shares","Local Listed Shares","REITS","Foreign Corporate Bonds","MGS","Foreign Deposit","Foreign Listed Shares","NID","UNIT TRUST (Hwang Enhanced Cash Fund)","UNIT TRUST (Amcash Plus)","UNIT TRUST (CIMB  P.- Bond Fund)","UNIT TRUST (Nomura i-cash fund)",null,null,null,"qAccType","GLMapProdCode","Description","Cost","AmortBSVal","AccreBSVal","ProvUnGnL","UnGnLCon","FXGnL","UnFXGnL","UnFXGnLCon","Gains","Income","IncomeVal","IncomeCon","Expenses","AmortPL","AccrePL","AmortPLVal","AmortPLCon","AccrePLVal","AccrePLCon","ProvUnGnLRes","UnFXGnLRes","IntProDivDisDebtor","DivGrossProceed","DivTaxExempt","DivFee","DivTaxed","Debtor","Creditor","FXControl","DbCust","CrCust","FXLoss","RelLoss","KeyInDate","KeyInBy"]
[25,"Cost","Cost",53202,53101,52001,52003,53302,53301,53501,53202,53101,52001,53301,52002,53401,53403,53404,53405,null,null,null,"BDCG","100","Cagamas Bond","100100","110100","120100","689100","989100","650000","","","600100","630100","639100","939100","799100","610100","620100","619100","919100","629100","929100","189100","","139100","","","","130100","200100","300100","","","","","",39447,"Linda"]
[50,"DivTaxed","Pre Acq Coupon",21260,null,null,null,null,null,null,21260,null,null,null,null,null,null,null,null,null,null,null,"BDCO","110","Commercial Bond","100110","110110","120110","689110","989110","650000","699110","999110","600110","630110","639110","939110","799110","610110","620110","619110","919110","629110","929110","189110","199110","139110","","","","130110","200100","300100","999999","799900","320110","655000","605110",38718,"Riskk.Com"]
{"$rows_left_out":56}
{"sheet":"Mapping","index":12,"n_rows":134,"n_cols":5,"rows_kept":134,"cut":false,"hidden":false,"merged":[]}
["qGLCode","qAssetAccType","qGLCode&qAssetAccType","Description","SunGL"]
["100000","220",{"$f":"A2 & B2","v":"100000220"},"Cost: FD Placement",52001]
["100000","190","100000190","Cost: NID",52002]
["100000","210","100000210","Cost: Local Money Market Placement",52003]
["100000","140","100000140","Cost: Malaysia Government Securities",53101]
["100000","110","100000110","Cost: Commercial Bond",53202]
{"$rows_left_out":129}
{"sheet":"Investment","index":13,"n_rows":48,"n_cols":21,"rows_kept":48,"cut":false,"hidden":true,"merged":[]}
[null,null,"TB for Investment as at 31/12/2014",null,"Date prepared:",null,"23/1/2014 9.10 AM"]
[null,null,null,null,"Given",null,null,null,null,null,null,"FUND","GL","DEBIT","CREDIT","DESCRIPTION",null,null,"SUM"]
[null,null,"Profit & Loss",null,null,null,null,null,null,null,null,"HWANG","100010",38740287.93,0,"Cost: Local Listed Share",0,"BS ",{"$f":"N3+O3","v":38740287.93},{"$f":"OFFSET(Mapping!$E$1,MATCH(M3,Mapping!$A:$A,0)-1,0)","v":{"$error":"#N/A"}},{"$f":"TEXT(T3,\"0\")","v":{"$error":"#N/A"}}]
[{"$f":"VALUE(B4)","v":21110},"21110","INT INCOME - FD",-17426176.829999998,{"$f":"MATCH(A4,Mapping!#REF!,0)-1","v":{"$error":"#REF!"}},{"$f":"SUMIF(InTB!$K:$K,Investment!B4,InTB!$F:$F)","v":-9978518.8399999999},{"$f":"F4-D4","v":7447657.9899999984},null,null,null,null,"TMLAFS","100010",67909450.140000001,0,"Cost: Local Listed Share",0,"BS ",67909450.140000001,{"$f":"OFFSET(Mapping!$E$1,MATCH(M4,Mapping!$A:$A,0)-1,0)","v":{"$error":"#N/A"}},{"$f":"TEXT(T4,\"0\")","v":{"$error":"#N/A"}}]
[{"$f":"VALUE(B5)","v":21120},"21120","INT INCOME - STD",-622030.89,{"$f":"MATCH(A5,Mapping!#REF!,0)-1","v":{"$error":"#REF!"}},{"$f":"SUMIF(InTB!$K:$K,Investment!B5,InTB!$F:$F)","v":-420307.94},{"$f":"F5-D5","v":201722.95},null,null,null,null,"TMLHFT","100010",1290283.06,0,"Cost: Local Listed Share",0,"BS ",1290283.06,{"$f":"OFFSET(Mapping!$E$1,MATCH(M5,Mapping!$A:$A,0)-1,0)","v":{"$error":"#N/A"}},{"$error":"#N/A"}]
[21120,21120,"INT INCOME STD - TMALM",-884925.14,{"$f":"MATCH(A6,Mapping!#REF!,0)-1","v":{"$error":"#REF!"}},{"$f":"SUMIF(InTB!$K:$K,Investment!B6,InTB!$F:$F)","v":-420307.94},{"$f":"F6-D6","v":464617.2},null,null,null,null,"TMLAFS","100110",30376500,0,"Cost: Commercial Bond",0,"BS ",30376500,{"$f":"OFFSET(Mapping!$E$1,MATCH(M6,Mapping!$A:$A,0)-1,0)","v":{"$error":"#N/A"}},{"$error":"#N/A"}]
{"$rows_left_out":42}