{"text_format":"1","workbook":"xlsx","n_sheets":8,"sheets":["Main","InJournal","InDiv","InTrn","InFund","InPortfolio","PortVal","Summary"],"not_rendered":{"charts":0,"images":7,"macros":1,"external_links":0,"defined_names":117,"comments":0,"pivot_tables":1},"unopened":[],"bounds":{"document_bytes":16777216,"sheet_cells":100000,"rows_first":2000,"rows_last":500,"rows_between":2000,"halvings":0,"cell_chars":16384,"cell_head_chars":4096},"cells_cut":0,"cells_raw":0,"read":"whole","date_system":"1900"}

{"sheet":"Main","index":0,"n_rows":15,"n_cols":9,"rows_kept":15,"cut":false,"hidden":false,"merged":[[1,0,1,2]]}
[]
["SOCSO Weekly Portfolio Position"]
[]
[null,null,null,null,null,"* Please sheet(s) to print",null,"* For pivot table listing control"]
[null,null,null,null,null,"Sheet","YES/NO","Start Row","Last Col"]
[null,"Company :","NOMURA ASSET MANAGEMENT MALAYSIA SDN BHD",{"$f":"VLOOKUP(FundCode,InFund!A2:G75,7,0)","v":"NM"},null,"PortVal","YES",8,14]
[null,"Fund :","SOCSO",{"$f":"VLOOKUP(FundCode,InFund!A2:G76,6,0)","v":"2020-12-31"},null,"Summary","YES"]
[null,"Fund Name :",{"$f":"VLOOKUP(FundCode,InFund!A2:G75,2,0)","v":"PERTUBUHAN KESELAMATAN SOSIAL(SOCSO)"}]
[null,"Start Date :",{"$f":"EndDate-WEEKDAY(EndDate,2)+1","v":"2021-10-18"},{"$f":"DATE(YEAR(ValueDate), MONTH(ValueDate), 0)","v":"2021-09-30"}]
[null,"End Date:","2021-10-22"]
{"$rows_left_out":6}
{"sheet":"InJournal","index":1,"n_rows":19,"n_cols":18,"rows_kept":19,"cut":false,"hidden":true,"merged":[]}
["GLKey","JournalID","GLCode","qFundCode","qCurrencyCode","AccDate","Description","Amount","TrialBalanceRef","UnitPricingFlag","ApprovalStatus","AppDtTime","AppOrRejBy","AutoPostFlag","SPeriod","FirstGL","ShortGL","CPName"]
["MAN*210200451","N000281777","SOCSO-MYR000-500000","SOCSO","MYR","2021-02-23","Compensation to client",330.82,null,500,"A","3000-01-01","N/A                           ","1900-01-01","Prev",5,500000,"HSBC BANK"]
["MAN*210200452","N000281777","SOCSO-MYR000-640003","SOCSO","MYR","2021-02-23","Compensation to client",-330.82,null,500,"A","3000-01-01","N/A                           ","1900-01-01","Prev",6,640003,"HSBC BANK"]
["MAN*210501237","JV-21050072","SOCSO-MYR000-640004","SOCSO","MYR","2021-02-26","Management Fee",-177840.98,null,0,"P","1900-01-02","N/A                           ","00:00:00","Prev",6,640004,"HSBC BANK"]
["MAN*210501238","JV-21050072","SOCSO-MYR000-710106","SOCSO","MYR","2021-02-26","Management Fee",177840.98,null,0,"P","1900-01-02","N/A                           ","00:00:00","Prev",7,710106,"HSBC BANK"]
["MAN*210602805","JV-21060250","SOCSO-MYR000-600000","SOCSO","MYR","2021-04-30","Impairment",252280.45,null,0,"P","1900-01-02","N/A                           ","00:00:00","Prev",6,600000,"HSBC BANK"]
["MAN*210602806","JV-21060250","SOCSO-MYR000-601000","SOCSO","MYR","2021-04-30","Impairment",-252280.45,null,0,"P","1900-01-02","N/A                           ","00:00:00","Prev",6,601000,"HSBC BANK"]
["MAN*210602867","JV-21060260","SOCSO-MYR000-600000","SOCSO","MYR","2021-04-30","Reverse impairment",-252280.45,null,0,"P","1900-01-02","N/A                           ","00:00:00","Prev",6,600000,"HSBC BANK"]
["MAN*210602868","JV-21060260","SOCSO-MYR000-601000","SOCSO","MYR","2021-04-30","Reverse impairment",252280.45,null,0,"P","1900-01-02","N/A                           ","00:00:00","Prev",6,601000,"HSBC BANK"]
["MAN*210700037","N000299280","SOCSO-MYR000-500000","SOCSO","MYR","2021-06-30","Interest Received",709.52,null,500,"A","3000-01-01","N/A                           ","1900-01-01","Prev",5,500000,"HSBC BANK"]
{"$rows_left_out":10}
{"sheet":"InDiv","index":2,"n_rows":116,"n_cols":71,"rows_kept":116,"cut":false,"hidden":true,"merged":[]}
["qstockcode","FundName","StockCurrency","StockName","PlaceFlag","UTFlag","FundCurrency","SettleTrnAccDt","Description","CPName","qCountry","qAssetClass","qManagerCode","PurchaseDate","qKLSESector","RevDate","qIssuerCode","CrossTrade","ListedFlag","StockCycle","TranSCControl","AccSCControl","qFundGrpCode","qEvtDeclareID","EvtUploaded","SecCountryID","FundGrpName","qCPType","CPTel","CPFax","CPContactPerson","ExchgRateSF","MaturityDate","PayDate","TradeDate","RevDate1","ReversalFlag","TranGains","TranIncome","TranPreAcq","TranPrice","TranProceed","CPCountryID","SettCPCode","SCGrossProceed","SCNetProceed","SettCurrency","BankedAmt","BankGL","FCSettAmt","FCSettGL","FXGainsAmt","FXGainsGL","TranAmortAccre","TranBuyCapital","TranExpenses","TranFXGnL","qPaymentModeID","SettReversalFlag","SettleAmt","SettleBankAcc","SettleGL","FCSettCostAmt","FCSettCostGL","SettVoucher","DivCummFV","DivType","lodgedate","ExRate","BursaCode","ISINCode"]
["B29H4P8","PERTUBUHAN KESELAMATAN SOSIAL(SOCSO)","MYR","AEON CREDIT SERVICE M BHD","1900-01-03","00:00:00","MYR","2021-11-03","AEON CREDIT SERVICE M BHD","NOT APPLICABLE","MY","EQT","NAMM","2020-12-31",4020,401769,"N/A",0,1,0,0,null,"SOCSO",null,null,"MY","PERTUBUHAN KESELAMATAN SOCIAL(SOCSO)",4,"03-2166 2636","03-20709387","N/A",1,"3000-01-01","2021-11-03","2021-10-13","3000-01-01",0,-60587.01,"00:00:00","00:00:00",0.28499999999999998,0,"MY","N/A",60587.01,60587.01,"MYR",60587.01,"SOCSO-MYR000-500000",0,null,0,null,0,0,0,0,"DDT",0,-60587.01,"DF","SOCSO-MYR010-299000",0,null,"VCH-211100309",212586,"Accrual","2021-10-14",1,5139,"MYL5139OO000"]
["B29H4P8","PERTUBUHAN KESELAMATAN SOSIAL(SOCSO)","MYR","AEON CREDIT SERVICE M BHD","1900-01-03","00:00:00","MYR","2021-07-15","AEON CREDIT SERVICE M BHD","NOT APPLICABLE","MY","EQT","NAMM","2020-12-31",4020,401769,"N/A",0,1,0,0,null,"SOCSO",null,null,"MY","PERTUBUHAN KESELAMATAN SOCIAL(SOCSO)",4,"03-2166 2636","03-20709387","N/A",1,"3000-01-01","2021-07-15","2021-06-30","3000-01-01",0,-42517.2,"00:00:00","00:00:00",0.2,0,"MY","N/A",42517.2,42517.2,"MYR",42517.2,"SOCSO-MYR000-500000",0,null,0,null,0,0,0,0,"DDT",0,-42517.2,"DF","SOCSO-MYR010-299000",0,null,"VCH-210701461",212586,"Received","2021-07-01",1,5139,"MYL5139OO000"]
["BKRQ635","PERTUBUHAN KESELAMATAN SOSIAL(SOCSO)","MYR","AME ELITE CONSORTIUM BHD","1900-01-03","00:00:00","MYR","2021-07-08","AME ELITE CONSORTIUM BHD","NOT APPLICABLE","MY","EQT","NAMM","2020-12-31",2010,401769,"N/A",0,1,0,0,null,"SOCSO",null,null,"MY","PERTUBUHAN KESELAMATAN SOCIAL(SOCSO)",4,"03-2166 2636","03-20709387","N/A",1,"3000-01-01","2021-07-08","2021-06-16","3000-01-01",0,-47724,"00:00:00","00:00:00",0.04,0,"MY","N/A",47724,47724,"MYR",47724,"SOCSO-MYR000-500000",0,null,0,null,0,0,0,0,"DDT",0,-47724,"DF","SOCSO-MYR010-299000",0,null,"VCH-210700633",1193100,"Received","2021-06-17",1,5293,"MYL5293OO005"]
["B2QZGV5","PERTUBUHAN KESELAMATAN SOSIAL(SOCSO)","MYR","AXIATA GROUP BERHAD","1900-01-03","00:00:00","MYR","2021-04-08","AXIATA GROUP BERHAD","NOT APPLICABLE","MY","EQT","NAMM","2020-12-31",5010,401769,"N/A",0,1,0,0,null,"SOCSO",null,null,"MY","PERTUBUHAN KESELAMATAN SOCIAL(SOCSO)",4,"03-2166 2636","03-20709387","N/A",1,"3000-01-01","2021-04-08","2021-03-24","3000-01-01",0,-28385,"00:00:00","00:00:00",0.05,0,"MY","N/A",28385,28385,"MYR",28385,"SOCSO-MYR000-500000",0,null,0,null,0,0,0,0,"DDT",0,-28385,"DF","SOCSO-MYR010-299000",0,null,"VCH-210400696",567700,"Received","2021-03-25",1,6888,"MYL6888OO001"]
["B2QZGV5","PERTUBUHAN KESELAMATAN SOSIAL(SOCSO)","MYR","AXIATA GROUP BERHAD","1900-01-03","00:00:00","MYR","2021-09-24","AXIATA GROUP BERHAD","NOT APPLICABLE","MY","EQT","NAMM","2020-12-31",5010,401769,"N/A",0,1,0,0,null,"SOCSO",null,null,"MY","PERTUBUHAN KESELAMATAN SOCIAL(SOCSO)",4,"03-2166 2636","03-20709387","N/A",1,"3000-01-01","2021-09-24","2021-09-14","3000-01-01",0,-31508,"00:00:00","00:00:00",0.04,0,"MY","N/A",31508,31508,"MYR",31508,"SOCSO-MYR000-500000",0,null,0,null,0,0,0,0,"DDT",0,-31508,"DF","SOCSO-MYR010-299000",0,null,"VCH-210902515",787700,"Received","2021-09-15",1,6888,"MYL6888OO001"]
["B0CMCL8","PERTUBUHAN KESELAMATAN SOSIAL(SOCSO)","MYR","AXIS REAL ESTATE INVESTMENT","1900-01-03","00:00:00","MYR","2021-08-30","AXIS REAL ESTATE INVESTMENT","NOT APPLICABLE","MY","EQT","NAMM","2020-12-31",6010,401769,"N/A",0,1,0,0,null,"SOCSO",null,null,"MY","PERTUBUHAN KESELAMATAN SOCIAL(SOCSO)",4,"03-2166 2636","03-20709387","N/A",1,"3000-01-01","2021-08-30","2021-08-03","3000-01-01",0,-8377.74,"00:00:00","00:00:00",5.1000000000000004E-3,0,"MY","N/A",8377.74,8377.74,"MYR",8377.74,"SOCSO-MYR000-500000",0,null,0,null,0,0,0,0,"DDT",0,-8377.74,"DF","SOCSO-MYR010-299000",0,null,"VCH-210802895",1642695,"Received","2021-08-04",1,5106,"MYL5106TO008"]
["B0CMCL8","PERTUBUHAN KESELAMATAN SOSIAL(SOCSO)","MYR","AXIS REAL ESTATE INVESTMENT","1900-01-03","00:00:00","MYR","2021-08-30","AXIS REAL ESTATE INVESTMENT","NOT APPLICABLE","MY","EQT","NAMM","2020-12-31",6010,401769,"N/A",0,1,0,0,null,"SOCSO",null,null,"MY","PERTUBUHAN KESELAMATAN SOCIAL(SOCSO)",4,"03-2166 2636","03-20709387","N/A",1,"3000-01-01","2021-08-30","2021-08-03","3000-01-01",0,-31046.93,"00:00:00","00:00:00",1.89E-2,0,"MY","N/A",31046.93,31046.93,"MYR",31046.93,"SOCSO-MYR000-500000",0,null,0,null,0,0,0,0,"DDT",0,-31046.93,"DF","SOCSO-MYR010-299000",0,null,"VCH-210802928",1642695,"Received","2021-08-04",1,5106,"MYL5106TO008"]
["B0CMCL8","PERTUBUHAN KESELAMATAN SOSIAL(SOCSO)","MYR","AXIS REAL ESTATE INVESTMENT","1900-01-03","00:00:00","MYR","2021-05-31","AXIS REAL ESTATE INVESTMENT","NOT APPLICABLE","MY","EQT","NAMM","2020-12-31",6010,401769,"N/A",0,1,0,0,null,"SOCSO",null,null,"MY","PERTUBUHAN KESELAMATAN SOCIAL(SOCSO)",4,"03-2166 2636","03-20709387","N/A",1,"3000-01-01","2021-05-31","2021-05-05","3000-01-01",0,-28418.62,"00:00:00","00:00:00",1.7299999999999999E-2,0,"MY","N/A",28418.62,28418.62,"MYR",28418.62,"SOCSO-MYR000-500000",0,null,0,null,0,0,0,0,"DDT",0,-28418.62,"DF","SOCSO-MYR010-299000",0,null,"VCH-210503187",1642695,"Received","2021-05-06",1,5106,"MYL5106TO008"]
["B0CMCL8","PERTUBUHAN KESELAMATAN SOSIAL(SOCSO)","MYR","AXIS REAL ESTATE INVESTMENT","1900-01-03","00:00:00","MYR","2021-05-31","AXIS REAL ESTATE INVESTMENT","NOT APPLICABLE","MY","EQT","NAMM","2020-12-31",6010,401769,"N/A",0,1,0,0,null,"SOCSO",null,null,"MY","PERTUBUHAN KESELAMATAN SOCIAL(SOCSO)",4,"03-2166 2636","03-20709387","N/A",1,"3000-01-01","2021-05-31","2021-05-05","3000-01-01",0,-8213.4699999999993,"00:00:00","00:00:00",5.0000000000000001E-3,0,"MY","N/A",8213.4699999999993,8213.4699999999993,"MYR",8213.4699999999993,"SOCSO-MYR000-500000",0,null,0,null,0,0,0,0,"DDT",0,-8213.4699999999993,"DF","SOCSO-MYR010-299000",0,null,"VCH-210503216",1642695,"Received","2021-05-06",1,5106,"MYL5106TO008"]
{"$rows_left_out":107}
{"sheet":"InTrn","index":3,"n_rows":995,"n_cols":13,"rows_kept":995,"cut":false,"hidden":true,"merged":[]}
["qFundCode","qProductType","qTrnCode","TradeDate","AccDate","PayDate","MaturityDate","TranIncome","costfc","costsc","SCNetProceed","FCNetProceed","TranGains"]
["SOCSO","EQT","SX","2021-01-01","2021-01-01","2021-01-01","3000-01-01",0,-252280.45,-252280.45,0,0,252280.45]
["SOCSO","EQT","SX","2021-01-01","2021-01-01","2021-01-01","3000-01-01",0,-1205600.6100000001,-1205600.6100000001,0,0,1205600.6100000001]
["SOCSO","EQT","SX","2021-01-01","2021-01-01","2021-01-01","3000-01-01",0,-1290545.6399999999,-1290545.6399999999,0,0,1290545.6399999999]
["SOCSO","EQT","SX","2021-01-01","2021-01-01","2021-01-01","3000-01-01",0,-3224891,-3224891,0,0,3224891]
["SOCSO","EQT","SX","2021-01-01","2021-01-01","2021-01-01","3000-01-01",0,-930569.67,-930569.67,0,0,930569.67]
["SOCSO","EQT","SX","2021-01-01","2021-01-01","2021-01-01","3000-01-01",0,-643156.65,-643156.65,0,0,643156.65]
["SOCSO","EQT","SX","2021-01-01","2021-01-01","2021-01-01","3000-01-01",0,-128090.02,-128090.02,0,0,128090.02]
["SOCSO","CSH","RM","2021-01-04","2021-01-04","2021-01-04","2021-01-04",-1601.64,-7900000,-7900000,7901601.6399999997,7901601.6399999997,0]
["SOCSO","CSH","RP","2021-01-04","2021-01-04","2021-01-04","2021-01-05",0,7800000,7800000,-7800000,-7800000,0]
{"$rows_left_out":986}
{"sheet":"InFund","index":4,"n_rows":58,"n_cols":9,"rows_kept":58,"cut":false,"hidden":true,"merged":[]}
["qFundCode","FundName","qFundType","Islamic","FinanceYrStart","FinanceYrEnd","qCompanyID","RollEOYFlag","Fundcurrency"]
["AJC-MASHAREQ","ALJAZIRA JAPANESE EQUITY FUND",1,1,"2013-03-01","2020-12-31","NI",1,"USD"]
["BNM-ICLIF","IFM ICLIF SHARIAH EQUITY NOMURA-I",1,1,"2013-08-26","2020-12-31","NI",1,"MYR"]
["BNM-ICLIF-FI2","IFM ICLIF CORP BOND NOMURA",2,0,"2021-01-04","2020-12-31","NM",1,"MYR"]
["BNM-INCEIF","IFM INCEIF SHARIAH EQUITY NOMURA-I",1,1,"2013-08-26","2020-12-31","NI",1,"MYR"]
["BNM-INCEIF-FI","IFM INCEIF SUKUK NOMURA-I",2,1,"2016-11-28","2020-12-31","NI",1,"MYR"]
["BNM-MEDF-FI","IFM MEDF CORP BOND NOMURA",2,0,"2016-11-28","2020-12-31","NM",1,"MYR"]
["BNMMF","IFM MEDF CONV EQUITY NOMURA",1,0,"2011-08-08","2020-12-31","NM",1,"MYR"]
["BNM-NTF","IFM NTF CONV EQUITY NOMURA",1,0,"2020-09-17","2020-12-31","NM",1,"MYR"]
["BNM-NTF-FI","IFM NTF CORP BOND NOMURA",2,0,"2016-11-28","2020-12-31","NM",1,"MYR"]
{"$rows_left_out":49}
{"sheet":"InPortfolio","index":5,"n_rows":66,"n_cols":49,"rows_kept":66,"cut":false,"hidden":true,"merged":[]}
["qFundCode","qProductType","qStockCode","qMasterID","UnrealisedGainsStock","UnrealisedGainsExchg","MarketValueFC","MarketValueSC","MaturityDate","UnitFaceValue","PriceCurr","ExchgRate","AccruedInterest","AmortAccreation","CostFC","CostSC","ExPreAcq","ExPreAcqSC","fRefPrice","PurchaseYTM","PurchaseDate","ValueYTM","BookValue1Int","ValGains","MarketValueDate","PreAcqSC","PreAcqFC","LastMarketValue","LCD","NCD","Diminution","qInvType","CheckValReturn","AmortAccreationSC","TIncome","PercNAV","NAV","CountryName","StockCurrency","ISINCode","BursaCode","StockName","SectorName","DivReceivable","ProductGrp","qCountryID","UnGain","UnLoss","ReportGrp"]
["SOCSO","CSH","RPF*MYR*PBK","CSH*211000973",0,0,10300493.84,10300493.84,"2021-10-25",10300000,0,1,493.84,0,10300000,10300000,10301481.51,10301481.51,1,1.7500000000000002E-2,"2021-10-22",0,10300493.84,1481.51,"2021-10-22",0,0,0,"3000-01-01","3000-01-01",0,"FVTPL",0,0,987.67,5.3853998522769171,191267020.50999999,"MALAYSIA","MYR","N/A",null,"RPF*MYR*PBK","UNKNOWN",0,"CSH","MY",493.83999999985099,0,"CSH"]
["SOCSO","EQT",6075745,"SOCSO*6075745",1128019.51,0,9065357.7400000002,9065357.7400000002,"3000-01-01",1733338,5.23,1,0,0,7937338.2300000004,7937338.2300000004,7937338.2300000004,7937338.2300000004,0,0,"2020-12-31",0,7937338.2300000004,17333.38,"2021-10-22",0,0,0,"3000-01-01","3000-01-01",0,"FVTPL",0,0,0,4.7396345255067311,191267020.50999999,"MALAYSIA","MYR","MYL1023OO000","1023","CIMB GROUP HOLDINGS BHD","FINANCIAL SERVICES",180960.49,"EQT","MY",1128019.5099999998,0,"EQT"]
["SOCSO","EQT",6086242,"SOCSO*6086242",96551.07,0,5152700,5152700,"3000-01-01",1190000,4.33,1,0,0,5056148.93,5056148.93,5056148.93,5056148.93,0,0,"2021-04-09",0,5056148.93,11230.39,"2021-10-22",0,0,0,"3000-01-01","3000-01-01",0,"FVTPL",0,0,0,2.6939824682063271,191267020.50999999,"MALAYSIA","MYR","MYL6947OO005","6947","DIGI.COM BHD","TELECOMMUNICATIONS & MEDIA",0,"EQT","MY",96551.070000000298,0,"EQT"]
["SOCSO","EQT",6113429,"SOCSO*6113429",343609.44,0,3097692,3097692,"3000-01-01",1985700,1.56,1,0,0,2754082.56,2754082.56,2754082.56,2754082.56,0,0,"2021-01-11",0,2754082.56,100529.36,"2021-10-22",0,0,0,"3000-01-01","3000-01-01",0,"FVTPL",0,0,0,1.6195641003557348,191267020.50999999,"MALAYSIA","MYR","MYL6963OO002","6963","V.S. INDUSTRY BERHAD","INDUSTRIAL PRODUCTS & SERVICES",9928.5,"EQT","MY",343609.43999999994,0,"EQT"]
["SOCSO","EQT",6188193,"SOCSO*6188193",142947.07999999999,0,3948000,3948000,"3000-01-01",600000,6.58,1,0,0,3805052.92,3805052.92,3805052.92,3805052.92,0,0,"2021-06-08",0,3805052.92,-60000,"2021-10-22",0,0,0,"3000-01-01","3000-01-01",0,"FVTPL",0,0,0,2.06413002590459,191267020.50999999,"MALAYSIA","MYR","MYL5014OO005","5014","MALAYSIA AIRPORTS HLDGS BHD","TRANSPORTATION & LOGISTICS",0,"EQT","MY",142947.08000000007,0,"EQT"]
["SOCSO","EQT",6244675,"SOCSO*6244675",170809.25,0,6780634.5,6780634.5,"3000-01-01",1189585,5.7,1,0,0,6609825.25,6609825.25,6609825.25,6609825.25,0,0,"2020-12-31",0,6609825.25,0,"2021-10-22",0,0,0,"3000-01-01","3000-01-01",0,"FVTPL",0,0,0,3.5451143024656928,191267020.50999999,"MALAYSIA","MYR","MYL1066OO009","1066","RHB BANK BHD","FINANCIAL SERVICES",178437.75,"EQT","MY",170809.25,0,"EQT"]
["SOCSO","EQT",6336538,"SOCSO*6336538",296204.64,0,1848234,1848234,"3000-01-01",407100,4.54,1,0,0,1552029.36,1552029.36,1552029.36,1552029.36,0,0,"2020-12-31",0,1552029.36,25981.86,"2021-10-22",0,0,0,"3000-01-01","3000-01-01",0,"FVTPL",0,0,0,0.96631086481705764,191267020.50999999,"MALAYSIA","MYR","MYL5031OO009","5031","TIME DOTCOM BHD","TELECOMMUNICATIONS & MEDIA",0,"EQT","MY",296204.6399999999,0,"EQT"]
["SOCSO","EQT",6359881,"SOCSO*6359881",-544293.89,0,3793519.29,3793519.29,"3000-01-01",1189191,3.19,1,0,0,4337813.18,4337813.18,4337813.18,4337813.18,0,0,"2020-12-31",0,4337813.18,-11891.91,"2021-10-22",0,0,0,"3000-01-01","3000-01-01",0,"FVTPL",0,0,0,1.9833629864076143,191267020.50999999,"MALAYSIA","MYR","MYL5398OO002","5398","GAMUDA BHD","CONSTRUCTION",0,"EQT","MY",0,-544293.88999999966,"EQT"]
["SOCSO","EQT",6436450,"SOCSO*6436450",312672.01,0,4392391.5199999996,4392391.5199999996,"3000-01-01",240284,18.28,1,0,0,4079719.51,4079719.51,4079719.51,4079719.51,0,0,"2020-12-31",0,4079719.51,0,"2021-10-22",0,0,0,"3000-01-01","3000-01-01",0,"FVTPL",0,0,0,2.2964709275483028,191267020.50999999,"MALAYSIA","MYR","MYL1082OO006","1082","HONG LEONG FINANCIAL GROUP","FINANCIAL SERVICES",0,"EQT","MY",312672.00999999978,0,"EQT"]
{"$rows_left_out":57}
{"sheet":"PortVal","index":6,"n_rows":59,"n_cols":31,"rows_kept":59,"cut":false,"hidden":false,"merged":[]}
[{"$f":"IF(R1=\"\",\"\",IF(AND(R1<>\"\",S1=\"\"),\"NAML Equity Total\",\"NAML Equity\"))","v":""},{"$f":"IF(OR(R1=\"\"),\"\",IF(AND(R1=\"EQT\",S1=\"\"),\"Stock Total\",IF(AND(R1=\"WRT\",S1=\"\"),\"Warrant Total\",IF(R1=\"EQT\",\"Stock\",\"Warrant\"))))","v":""},{"$f":"IF(S1=\"\",\"\",IF(S1=\"MY\",\"MYS\",S1))","v":""},{"$f":"IF(T1=\"\",\"\",T1)","v":""},{"$f":"IF(V1=\"\",\"\",V1)","v":""},{"$f":"IF(Y1=\"\",\"\",Y1)","v":""},{"$f":"IF(Z1=\"\",\"\",Z1)","v":""},{"$f":"IF(OR(R1=\"\",C1=\"\"),\"\",IF(Z1=0,0,ROUND(AA1/Z1,4)))","v":""},{"$f":"IF(AA1=\"\",\"\",AA1)","v":""},{"$f":"IF(OR(R1=\"\",C1=\"\"),\"\",IF(Z1=0,0,ROUND(AB1/Z1,4)))","v":""},{"$f":"IF(AB1=\"\",\"\",AB1)","v":""},{"$f":"IF(AB1=\"\",\"\",AB1+AC1)","v":""},{"$f":"IF(AD1=\"\",\"\",AD1)","v":""},{"$f":"IF(AE1=\"\",\"\",AE1)","v":""}]
[{"$f":"FundName","v":"PERTUBUHAN KESELAMATAN SOSIAL(SOCSO)"}]
["PORTFOLIO HOLDING AS OF",null,{"$f":"EndDate","v":"2021-10-22"}]
[]
["Classificatican","Category","Country","Currency","Issue code","Issue name","Quantity","Unit Cost","Book Cost","Market Price","Market Value","Market Value with Dividend Receivable","Unrealised Gain","Unrealised Loss",null,null,null,"qProductType","EQT"]
["Total",null,null,null,null,null,{"$f":"INDEX(PortVal!G:G,MATCH(\"NAML Equity Total\",PortVal!A:A,FALSE))+INDEX(PortVal!G:G,MATCH(\"NAML Cash Total\",PortVal!A:A,FALSE))","v":54257988.259999998},null,{"$f":"INDEX(PortVal!I:I,MATCH(\"NAML Equity Total\",PortVal!A:A,FALSE))+INDEX(PortVal!I:I,MATCH(\"NAML Cash Total\",PortVal!A:A,FALSE))","v":175837830.57000002},null,{"$f":"INDEX(PortVal!K:K,MATCH(\"NAML Equity Total\",PortVal!A:A,FALSE))+INDEX(PortVal!K:K,MATCH(\"NAML Cash Total\",PortVal!A:A,FALSE))","v":190784881.87},{"$f":"INDEX(PortVal!L:L,MATCH(\"NAML Equity Total\",PortVal!A:A,FALSE))+INDEX(PortVal!L:L,MATCH(\"NAML Cash Total\",PortVal!A:A,FALSE))","v":191266526.67000002},{"$f":"INDEX(PortVal!M:M,MATCH(\"NAML Equity Total\",PortVal!A:A,FALSE))+INDEX(PortVal!M:M,MATCH(\"NAML Cash Total\",PortVal!A:A,FALSE))","v":17819685.859999999},{"$f":"INDEX(PortVal!N:N,MATCH(\"NAML Equity Total\",PortVal!A:A,FALSE))+INDEX(PortVal!N:N,MATCH(\"NAML Cash Total\",PortVal!A:A,FALSE))","v":-2872634.5600000005}]
["NAML Equity Total",null,null,null,null,null,{"$f":"INDEX(PortVal!G:G,MATCH(\"Stock Total\",PortVal!B:B,FALSE))+IF(ISNA(INDEX(PortVal!G:G,MATCH(\"Warrant Total\",PortVal!B:B,FALSE)))=TRUE,0,ISNA(INDEX(PortVal!G:G,MATCH(\"Warrant Total\",PortVal!B:B,FALSE))))","v":44364745},null,{"$f":"INDEX(PortVal!I:I,MATCH(\"Stock Total\",PortVal!B:B,FALSE))+IF(ISNA(INDEX(PortVal!I:I,MATCH(\"Warrant Total\",PortVal!B:B,FALSE)))=TRUE,0,ISNA(INDEX(PortVal!I:I,MATCH(\"Warrant Total\",PortVal!B:B,FALSE))))","v":165944587.31000003},null,{"$f":"INDEX(PortVal!K:K,MATCH(\"Stock Total\",PortVal!B:B,FALSE))+IF(ISNA(INDEX(PortVal!K:K,MATCH(\"Warrant Total\",PortVal!B:B,FALSE)))=TRUE,0,ISNA(INDEX(PortVal!K:K,MATCH(\"Warrant Total\",PortVal!B:B,FALSE))))","v":180891638.61000001},{"$f":"INDEX(PortVal!L:L,MATCH(\"Stock Total\",PortVal!B:B,FALSE))+IF(ISNA(INDEX(PortVal!L:L,MATCH(\"Warrant Total\",PortVal!B:B,FALSE)))=TRUE,0,ISNA(INDEX(PortVal!L:L,MATCH(\"Warrant Total\",PortVal!B:B,FALSE))))","v":181373283.41000003},{"$f":"INDEX(PortVal!M:M,MATCH(\"Stock Total\",PortVal!B:B,FALSE))+IF(ISNA(INDEX(PortVal!M:M,MATCH(\"Warrant Total\",PortVal!B:B,FALSE)))=TRUE,0,ISNA(INDEX(PortVal!M:M,MATCH(\"Warrant Total\",PortVal!B:B,FALSE))))","v":17819685.859999999},{"$f":"INDEX(PortVal!N:N,MATCH(\"Stock Total\",PortVal!B:B,FALSE))+IF(ISNA(INDEX(PortVal!N:N,MATCH(\"Warrant Total\",PortVal!B:B,FALSE)))=TRUE,0,ISNA(INDEX(PortVal!N:N,MATCH(\"Warrant Total\",PortVal!B:B,FALSE))))","v":-2872634.5600000005},null,null,null,"Row Labels","qCountryID","StockCurrency","SectorName","qStockCode","ISINCode","BursaCode","StockName","Sum of UnitFaceValue","Sum of CostFC","Sum of MarketValueFC","Sum of DivReceivable","Sum of UnGain","Sum of UnLoss"]
["NAML Equity Total","Stock Total","","","","",44364745,"",165944587.31000003,"",180891638.61000001,181373283.41000003,17819685.859999999,-2872634.5600000005,null,null,null,"EQT",null,null,null,null,null,null,null,44364745,165944587.31000003,180891638.61000001,481644.79999999999,17819685.859999999,-2872634.5600000005]
["NAML Equity","Stock","MYS","MYR",6359881,"GAMUDA BHD",1189191,3.6476999999999999,4337813.18,3.19,3793519.29,3793519.29,0,-544293.88999999966,null,null,null,"EQT","MY","MYR","CONSTRUCTION",6359881,"MYL5398OO002","5398","GAMUDA BHD",1189191,4337813.18,3793519.29,0,0,-544293.88999999966]
["NAML Equity","Stock","MYS","MYR","BKRQ635","AME ELITE CONSORTIUM BHD",1651500,1.399,2310410.66,1.99,3286485,3286485,976074.33999999985,0,null,null,null,"EQT","MY","MYR","CONSTRUCTION","BKRQ635","MYL5293OO005","5293","AME ELITE CONSORTIUM BHD",1651500,2310410.66,3286485,0,976074.33999999985,0]
{"$rows_left_out":50}
{"sheet":"Summary","index":7,"n_rows":16,"n_cols":3,"rows_kept":16,"cut":false,"hidden":false,"merged":[]}
["Equity",{"$f":"\" As at \" & TEXT(EndDate,\"dd-MMM-yyyy\")","v":" As at 22-Oct-2021"}," YTD"]
["Cash / Deposit (RM)",{"$f":"INDEX(PortVal!K:K,MATCH(\"NAML Cash Total\",PortVal!A:A,FALSE))","v":9893243.2599999998},{"$f":"INDEX(PortVal!K:K,MATCH(\"NAML Cash Total\",PortVal!A:A,FALSE))","v":9893243.2599999998}]
["Equity (Book Cost RM)",{"$f":"INDEX(PortVal!I:I,MATCH(\"NAML Equity Total\",PortVal!A:A,FALSE))","v":165944587.31000003},{"$f":"INDEX(PortVal!I:I,MATCH(\"NAML Equity Total\",PortVal!A:A,FALSE))","v":165944587.31000003}]
["Equity (Market Value RM)",{"$f":"INDEX(PortVal!K:K,MATCH(\"NAML Equity Total\",PortVal!A:A,FALSE))","v":180891638.61000001},{"$f":"INDEX(PortVal!K:K,MATCH(\"NAML Equity Total\",PortVal!A:A,FALSE))","v":180891638.61000001}]
["NAV & Portfolio (RM)",{"$f":"INDEX(PortVal!L:L,MATCH(\"Total\",PortVal!A:A,FALSE))","v":191266526.67000002},{"$f":"INDEX(PortVal!L:L,MATCH(\"Total\",PortVal!A:A,FALSE))","v":191266526.67000002}]
["No of Stock Held",{"$f":"COUNTIF(PortVal!B:B,\"Stock\")+COUNTIF(PortVal!B:B,\"Convertible Bond\")","v":44},{"$f":"COUNTIF(PortVal!B:B,\"Stock\")+COUNTIF(PortVal!B:B,\"Convertible Bond\")","v":44}]
["No of Warrants / Rights / Bonus / IPO Held",{"$f":"COUNTIF(PortVal!B:B,\"Rights\")+COUNTIF(PortVal!B:B,\"Warrant\")","v":0},{"$f":"COUNTIF(PortVal!B:B,\"Rights\")+COUNTIF(PortVal!B:B,\"Warrant\")","v":0}]
["No of Stocks with Unrealised Gain/ Break-even ",{"$f":"SUMPRODUCT((PortVal!B:B=\"Stock\")*(PortVal!M:M>0))+SUMPRODUCT((PortVal!B:B=\"Rights\")*(PortVal!M:M>0))","v":33},{"$f":"SUMPRODUCT((PortVal!B:B=\"Stock\")*(PortVal!M:M>0))+SUMPRODUCT((PortVal!B:B=\"Rights\")*(PortVal!M:M>0))","v":33}]
["No of Stocks with Unrealised Losses",{"$f":"SUMPRODUCT((PortVal!B:B=\"Stock\")*(PortVal!N:N<0))+SUMPRODUCT((PortVal!B:B=\"Rights\")*(PortVal!N:N<0))","v":11},{"$f":"SUMPRODUCT((PortVal!B:B=\"Stock\")*(PortVal!N:N<0))+SUMPRODUCT((PortVal!B:B=\"Rights\")*(PortVal!N:N<0))","v":11}]
["Realised Gain / Loss on Stocks (RM)",{"$f":"-SUMIFS(InTrn!M:M,InTrn!C:C,\"SS\",InTrn!D:D,\">=\" & ValueDate)","v":156797.45000000001},{"$f":"-SUMIFS(InTrn!M:M,InTrn!C:C,\"SS\")","v":9504545.1200000048}]
{"$rows_left_out":6}