{"text_format":"1","workbook":"xlsx","n_sheets":30,"sheets":["Riskk","Login","Main","UTFMain","UTFList","UTF1","UTF2A","UTF2B","UTF2C","UTF2D","InPortfolio","UTF2E","UTF2F","UTF2G","UTF2H","UTF3A","UTF3B","UTF3C","UTF3D","UTF4A","UTF5","UTF6","UTF7","InPort","InPos","InTran","InPricing","InIndex","InTWRR","InFund"],"not_rendered":{"charts":0,"images":80,"macros":1,"external_links":0,"defined_names":79,"comments":0,"pivot_tables":13},"unopened":[],"bounds":{"document_bytes":16777216,"sheet_cells":100000,"rows_first":2000,"rows_last":500,"rows_between":2000,"halvings":0,"cell_chars":16384,"cell_head_chars":4096},"cells_cut":0,"cells_raw":0,"read":"whole","date_system":"1900"}

{"sheet":"Riskk","index":0,"n_rows":5,"n_cols":11,"rows_kept":5,"cut":false,"hidden":true,"merged":[]}
["linda","UPSW",null,null,null,null,null,{"$f":"COUNT(H3:H20)","v":0},false]
[null,"Userid",null,null,null,null,null,"Main/sub","Caption","On Action","NewGroup"]
[3,"UserLevel"]
["2006-05-09T11:19:39","LoginTime"]
[null,"LogoutTime"]

{"sheet":"Login","index":1,"n_rows":18,"n_cols":10,"rows_kept":18,"cut":false,"hidden":false,"merged":[]}
[]
[null,"Riskk",null,null,null,null,null,"Box 389, Lot 7.16, Wisma Central, Jln Ampang, 50450 Kuala Lumpur"]
[null,"Sdn Bhd (CN 388306K)"]
[]
[]
[]
[]
[]
[null,"SC REPORT"]
[]
{"$rows_left_out":9}
{"sheet":"Main","index":2,"n_rows":24,"n_cols":11,"rows_kept":24,"cut":false,"hidden":true,"merged":[]}
["Riskk ",null,null,"Box 389, Lot 7.16, Wisma Central, Jln Ampang, 50450 Kuala Lumpur"]
["Sdn Bhd (CN 388306K)"]
[]
[]
[null,"Report Detail",null,null,null,null,null,null,null,"Sheet","Print"]
[null,"Company  :","BIMB Investment Management Berhad",null,null,null,null,null,null,"UTFMain","YES"]
[null,"Fund  :","IF",null,null,null,null,null,null,"UTFList","YES"]
[null,"Fund Name  :",{"$f":"VLOOKUP(FundCode,InFund!$A:$D,2,0)","v":"BIMB I Flexi Fund"},null,null,null,null,null,null,"UTF1","YES"]
[null,"Fund Prefix :",{"$f":"VLOOKUP(FundCode,InFund!$A:$G,7,0)","v":"IF"},null,null,null,null,null,null,"UTF2A","YES"]
[null,"Inception Date  :",{"$f":"VLOOKUP(FundCode,InFund!$A:$D,3,0)","v":"2015-04-01"},null,null,null,null,null,null,"UTF2B","YES"]
{"$rows_left_out":15}
{"sheet":"UTFMain","index":3,"n_rows":36,"n_cols":7,"rows_kept":36,"cut":false,"hidden":true,"merged":[[13,6,13,7],[12,6,12,8]]}
[]
[null,null,null,"                                       UTF COMPLIANCE RETURNS"]
[null,null,null,"DECLARATION/VERIFICATION FORM"]
[null,null,null,{"$f":"\"For the Month Ended \" & TEXT(EOM,\"MMM yyyy\")","v":"For the Month Ended Mar 2016"}]
[{"$f":"EDATE(EOM,0)","v":"2016-03-31"}]
[]
[null,null,null,"Management Company ",null,{"$f":"\": \" &CompanyName","v":": BIMB Investment Management Berhad"}]
[null,null,null,"Trustee  ",null,{"$f":"\": \" & VLOOKUP(FundCode,InFund!$A:$H,8,0)","v":": AMANAHRAYA TRUSTEES BERHAD"}]
[null,null,null,"Fund ",null,{"$f":"\": \" &FundName","v":": BIMB I Flexi Fund"}]
[]
{"$rows_left_out":27}
{"sheet":"UTFList","index":4,"n_rows":29,"n_cols":8,"rows_kept":29,"cut":false,"hidden":true,"merged":[]}
[]
[null,null,null,"                                       UTF COMPLIANCE RETURNS"]
[null,null,null,"CHCEKLIST"]
[null,null,null,{"$f":"\"For the Month Ended \" & TEXT(EOM,\"MMM yyyy\")","v":"For the Month Ended Mar 2016"}]
[]
[{"$f":"EDATE(EOM,0)","v":"2016-03-31"}]
[]
[null,null,null,"Management Company ",null,{"$f":"\": \" &CompanyName","v":": BIMB Investment Management Berhad"}]
[null,null,null,"Fund ",null,{"$f":"\": \" &FundName","v":": BIMB I Flexi Fund"}]
[]
{"$rows_left_out":20}
{"sheet":"UTF1","index":5,"n_rows":13,"n_cols":10,"rows_kept":13,"cut":false,"hidden":true,"merged":[[3,3,3,9],[1,3,1,9],[10,6,10,9],[11,6,11,8],[9,6,9,9],[11,3,11,5]]}
[null,null,null,null,null,null,null,null,null,"UTF COMPLIANCE 1"]
[null,null,null," UTF COMPLIANCE RETURNS"]
[]
[null,null,null,"MANAGER'S BOX"]
[]
[{"$f":"EDATE(EOM,0)","v":"2016-03-31"}]
[]
[null,null,null,"Management Company ",null,null,{"$f":"\": \" &CompanyName","v":": BIMB Investment Management Berhad"}]
[null,null,null,"Name of Fund (Category/Type)",null,null,{"$f":"\": \" &FundName","v":": BIMB I Flexi Fund"}]
[null,null,null,"Month Ended",null,null,{"$f":"\":  \" & TEXT(EOM, \"dd mmm yyyy\")","v":":  31 Mar 2016"}]
{"$rows_left_out":4}
{"sheet":"UTF2A","index":6,"n_rows":18,"n_cols":12,"rows_kept":18,"cut":false,"hidden":true,"merged":[[1,3,1,6],[10,5,10,6],[7,5,7,6],[8,5,8,6],[9,5,9,6]]}
[null,null,null,null,null,null,"UTF COMPLIANCE 2A"]
[null,null,null,"UTF COMPLIANCE RETURNS"]
[]
[null,null,null,{"$f":"UPPER(\"Investments in Ordinary Shares of a Single Issuer Top 5\")","v":"INVESTMENTS IN ORDINARY SHARES OF A SINGLE ISSUER TOP 5"}]
[]
[{"$f":"EDATE(EOM,0)","v":"2016-03-31"}]
[]
[null,null,null,"Management Company ",":",{"$f":" CompanyName","v":"BIMB Investment Management Berhad"}]
[null,null,null,"Name of Fund (Category/Type)",":",{"$f":" FundName","v":"BIMB I Flexi Fund"}]
[null,null,null," Month Ended",":",{"$f":"TEXT(EOM,\"dd mmm yyyy\")","v":"31 Mar 2016"}]
{"$rows_left_out":9}
{"sheet":"UTF2B","index":7,"n_rows":100,"n_cols":19,"rows_kept":100,"cut":false,"hidden":true,"merged":[[1,3,1,9],[3,3,3,9],[4,3,4,9]]}
[null,null,null,null,null,null,null,null,null,"UTF COMPLIANCE 2B"]
[null,null,null,"UTF COMPLIANCE RETURNS"]
[]
[null,null,null,{"$f":"UPPER(\"Investments in Transferable Securities And Money Market Instruments of a Single Issuer\")","v":"INVESTMENTS IN TRANSFERABLE SECURITIES AND MONEY MARKET INSTRUMENTS OF A SINGLE ISSUER"}]
[null,null,null,"TOP 5"]
[{"$f":"EDATE(EOM,0)","v":"2016-03-31"}]
[]
[null,null,null,"Management Company ",":",{"$f":"CompanyName","v":"BIMB Investment Management Berhad"}]
[null,null,null,"Name of Fund (Category/Type)",":",{"$f":"FundName","v":"BIMB I Flexi Fund"}]
[null,null,null,"Month Ended",":",{"$f":"TEXT(EOM, \"dd mmm yyyy\")","v":"31 Mar 2016"}]
{"$rows_left_out":91}
{"sheet":"UTF2C","index":8,"n_rows":18,"n_cols":13,"rows_kept":18,"cut":false,"hidden":true,"merged":[[1,3,1,6],[4,3,4,6]]}
[null,null,null,null,null,null,"UTF COMPLIANCE 2C"]
[null,null,null,"UTF COMPLIANCE RETURNS"]
[]
[null,null,null,{"$f":"UPPER(\"Placements of Deposits with a Single Institution\")","v":"PLACEMENTS OF DEPOSITS WITH A SINGLE INSTITUTION"}]
[null,null,null,"TOP 5"]
[{"$f":"EDATE(EOM,0)","v":"2016-03-31"}]
[]
[null,null,null,"Management Company ",":",{"$f":"CompanyName","v":"BIMB Investment Management Berhad"}]
[null,null,null,"Name of Fund (Category/Type)",":",{"$f":" FundName","v":"BIMB I Flexi Fund"}]
[null,null,null,"Month Ended",":",{"$f":"TEXT(EOM,\"dd mmm yyyy\")","v":"31 Mar 2016"}]
{"$rows_left_out":9}
{"sheet":"UTF2D","index":9,"n_rows":18,"n_cols":14,"rows_kept":18,"cut":false,"hidden":true,"merged":[[1,3,1,6],[4,3,4,6]]}
[null,null,null,null,null,null,"UTF COMPLIANCE 2D"]
[null,null,null,"UTF COMPLIANCE RETURNS"]
[]
[null,null,null,{"$f":"UPPER(\"Investments in OTC Derivative of a Single Counter-Party\")","v":"INVESTMENTS IN OTC DERIVATIVE OF A SINGLE COUNTER-PARTY"}]
[null,null,null,"TOP 5"]
[{"$f":"EDATE(EOM,0)","v":"2016-03-31"}]
[]
[null,null,null,"Management Company ",":",{"$f":" CompanyName","v":"BIMB Investment Management Berhad"}]
[null,null,null,"Name of Fund (Category/Type)",":",{"$f":" FundName","v":"BIMB I Flexi Fund"}]
[null,null,null,"Month Ended",":",{"$f":"TEXT(EOM,\"dd mmm yyyy\")","v":"31 Mar 2016"}]
{"$rows_left_out":9}
{"sheet":"InPortfolio","index":10,"n_rows":1,"n_cols":122,"rows_kept":1,"cut":false,"hidden":true,"merged":[]}
["Class","qFundCode","qStockCode","UnitFaceValue","MarketValueSC","MarketValueFC","ExchangeRate","MaturityDateCSH","CostFC","CostSC","AccruedInterestFC","AccruedInterestSC","UnrealisedGainsStock","UnrealisedGainsExchg","PriceCurr","FundName","FundCurrency","MaxTenor","qCompanyID","StockName","StockCurrency","qAssetClass","SectorName","CurrencyName","Exchange","IslamicFlag","IssuerName","IssuerGrpName","qStockType","Board","qBondType","BndDesc","StockTypeDesc","qManagerCode","qCountryID","FreezeUnit","FundDesc","RatingUsed","NAV","ExchgName","qCshType","CshTypeDesc","UTFlag","qKLSESector","ValuationMethod","qRptSequence","fPercNAV","PurchaseYTM","PurchaseDate","MarketValueDate","BookValue","ValueYTM","ValGains","PreAcqSC","PreAcqFC","FundGrpName","LastMarketValue","Rating","Term","Term","Term","Term","Term","Term","Term","Term","Term","Term","Term","Term","Term","Term","Term","Term","Term","Term","Term","Term","Term","Term","Term","Term","Term","Term","Term","Term","Term","Term","Term","Term","Term","Term","Term","Term","Term","Term","Term","Term","Term","Term","Term","Term","Term","Term","Term","Term","Term","Term","Term","Term","Term","Term","Term","Term","Term","Term","Term","Term","Term","Term","Term","Term"]

{"sheet":"UTF2E","index":11,"n_rows":19,"n_cols":14,"rows_kept":19,"cut":false,"hidden":true,"merged":[[1,3,1,6],[4,3,4,6]]}
[null,null,null,null,null,null,"UTF COMPLIANCE 2E"]
[null,null,null,"UTF COMPLIANCE RETURNS"]
[]
[null,null,null,{"$f":"UPPER(\"Investment in Structured Product of a Single Counter-Party\")","v":"INVESTMENT IN STRUCTURED PRODUCT OF A SINGLE COUNTER-PARTY"}]
[null,null,null,"TOP 5"]
[{"$f":"EDATE(EOM,0)","v":"2016-03-31"}]
[]
[null,null,null,"Management Company ",":",{"$f":" CompanyName","v":"BIMB Investment Management Berhad"}]
[null,null,null,"Name of Fund (Category/Type)",":",{"$f":"FundName","v":"BIMB I Flexi Fund"}]
[null,null,null,"Month Ended",":",{"$f":"TEXT(EOM,\"dd mmm yyyy\")","v":"31 Mar 2016"}]
{"$rows_left_out":10}
{"sheet":"UTF2F","index":12,"n_rows":100,"n_cols":16,"rows_kept":100,"cut":false,"hidden":true,"merged":[[1,3,1,7],[4,3,4,7]]}
[null,null,null,null,null,null,null,"UTF COMPLIANCE 2F"]
[null,null,null,"UTF COMPLIANCE RETURNS"]
[]
[null,null,null,{"$f":"UPPER(\"Aggregate Investments of a Single Issuer/Institution\")","v":"AGGREGATE INVESTMENTS OF A SINGLE ISSUER/INSTITUTION"}]
[null,null,null,"TOP 5"]
[{"$f":"EDATE(EOM,0)","v":"2016-03-31"}]
[]
[null,null,null,"Management Company ",":",{"$f":"CompanyName","v":"BIMB Investment Management Berhad"}]
[null,null,null,"Name of Fund (Category/Type)",":",{"$f":"FundName","v":"BIMB I Flexi Fund"}]
[null,null,null,"Month Ended",":",{"$f":"TEXT(EOM,\"dd mmm yyyy\")","v":"31 Mar 2016"}]
{"$rows_left_out":91}
{"sheet":"UTF2G","index":13,"n_rows":18,"n_cols":14,"rows_kept":18,"cut":false,"hidden":true,"merged":[[1,3,1,6],[4,3,4,6]]}
[null,null,null,null,null,null,"UTF COMPLIANCE 2G"]
[null,null,null,"UTF COMPLIANCE RETURNS"]
[]
[null,null,null,{"$f":"UPPER(\"Investments in Units/Shares of a Single Collective Investment Scheme\")","v":"INVESTMENTS IN UNITS/SHARES OF A SINGLE COLLECTIVE INVESTMENT SCHEME"}]
[null,null,null,"TOP 5"]
[{"$f":"EDATE(EOM,0)","v":"2016-03-31"}]
[]
[null,null,null,"Management Company ",":",{"$f":"CompanyName","v":"BIMB Investment Management Berhad"}]
[null,null,null,"Name of Fund (Category/Type)",":",{"$f":"FundName","v":"BIMB I Flexi Fund"}]
[null,null,null,"Month Ended",":",{"$f":"TEXT(EOM,\"dd mmm yyyy\")","v":"31 Mar 2016"}]
{"$rows_left_out":9}
{"sheet":"UTF2H","index":14,"n_rows":80,"n_cols":20,"rows_kept":80,"cut":false,"hidden":true,"merged":[[10,6,10,9],[1,3,1,9],[4,3,4,9],[7,6,7,9],[8,6,8,9],[9,6,9,9]]}
[null,null,null,null,null,null,null,null,null,"UTF COMPLIANCE 2H"]
[null,null,null,"UTF COMPLIANCE RETURNS"]
[]
[null,null,null,{"$f":"UPPER(\"Investments in Transferable Securities And Money Market Instruments of a Group of Companies\")","v":"INVESTMENTS IN TRANSFERABLE SECURITIES AND MONEY MARKET INSTRUMENTS OF A GROUP OF COMPANIES"}]
[null,null,null,"TOP 5"]
[{"$f":"EDATE(EOM,0)","v":"2016-03-31"},null,null,null,null,null,null,null,null,null,null,null,null,"qAssetClass","(Multiple Items)"]
[]
[null,null,null,"Management Company ",":",{"$f":"CompanyName","v":"BIMB Investment Management Berhad"},null,null,null,null,null,null,null,null,null,null,null,"Values"]
[null,null,null,"Name of Fund (Category/Type)",":",{"$f":"FundName","v":"BIMB I Flexi Fund"},null,null,null,null,null,null,null,"Row Labels","IssuerName","Class","StockTypeDesc","Sum of MarketValueFC","Sum of fPercNAV","Count of IssuerGrpName"]
[null,null,null,"Month Ended",":",{"$f":"TEXT(EOM,\"dd mmm yyyy\")","v":"31 Mar 2016"}]
{"$rows_left_out":71}
{"sheet":"UTF3A","index":15,"n_rows":17,"n_cols":19,"rows_kept":17,"cut":false,"hidden":true,"merged":[[1,3,1,8],[4,3,4,8],[7,5,7,8],[8,5,8,8],[9,5,9,8]]}
[null,null,null,null,null,null,null,null,"UTF COMPLIANCE 3A"]
[null,null,null,"UTF COMPLIANCE RETURNS"]
[null,null,null,null,null,null,null,null,null,null,null,null,null,"qAssetClass","(Multiple Items)"]
[null,null,null,{"$f":"UPPER(\"Concentration of Investment in Equities/Warrants of a Single Issuer\")","v":"CONCENTRATION OF INVESTMENT IN EQUITIES/WARRANTS OF A SINGLE ISSUER"}]
[null,null,null,"TOP 5",null,null,null,null,null,null,null,null,null,null,null,null,"Values"]
[{"$f":"EDATE(EOM,0)","v":"2016-03-31"},null,null,null,null,null,null,null,null,null,null,null,null,"Row Labels","Class","StockTypeDesc","Sum of IssuedSize","Sum of UnitFaceValue","Sum of PercHolding"]
[]
[null,null,null,"Management Company ",null,{"$f":"\": \" & CompanyName","v":": BIMB Investment Management Berhad"}]
[null,null,null,"Name of Fund (Category/Type)",null,{"$f":"\": \" & FundName","v":": BIMB I Flexi Fund"}]
[null,null,null,"Month Ended",null,{"$f":"\": \" & TEXT(EOM,\"dd mmm yyyy\")","v":": 31 Mar 2016"}]
{"$rows_left_out":8}
{"sheet":"UTF3B","index":16,"n_rows":17,"n_cols":16,"rows_kept":17,"cut":false,"hidden":true,"merged":[[1,3,1,7],[4,3,4,7],[7,4,7,7],[8,4,8,7],[9,4,9,7]]}
[null,null,null,null,null,null,null,"UTF COMPLIANCE 3B"]
[null,null,null,"UTF COMPLIANCE RETURNS"]
[]
[null,null,null,{"$f":"UPPER(\"Concentration of Investment in Debentures of a Single Issuer\")","v":"CONCENTRATION OF INVESTMENT IN DEBENTURES OF A SINGLE ISSUER"}]
[null,null,null,"TOP 5"]
[{"$f":"EDATE(EOM,0)","v":"2016-03-31"}]
[]
[null,null,null,"Management Company ",{"$f":"\": \" & CompanyName","v":": BIMB Investment Management Berhad"}]
[null,null,null,"Name of Fund (Category/Type)",{"$f":"\": \" & FundName","v":": BIMB I Flexi Fund"},null,null,null,null,null,null,"qAssetClass","(Multiple Items)"]
[null,null,null,"Month Ended",{"$f":"\": \" & TEXT(EOM,\"dd mmm yyyy\")","v":": 31 Mar 2016"},null,null,null,null,null,null,"qBondType","(Multiple Items)"]
{"$rows_left_out":8}
{"sheet":"UTF3C","index":17,"n_rows":17,"n_cols":15,"rows_kept":17,"cut":false,"hidden":true,"merged":[[1,3,1,7],[4,3,4,7],[7,4,7,7],[8,4,8,7],[9,4,9,7]]}
[null,null,null,null,null,null,null,"UTF COMPLIANCE 3C"]
[null,null,null,"UTF COMPLIANCE RETURNS"]
[]
[null,null,null,{"$f":"UPPER(\"Concentration of Investment in Money Market Instruments of a Single Issuer\")","v":"CONCENTRATION OF INVESTMENT IN MONEY MARKET INSTRUMENTS OF A SINGLE ISSUER"}]
[null,null,null,"TOP 5"]
[{"$f":"EDATE(EOM,0)","v":"2016-03-31"}]
[]
[null,null,null,"Management Company ",{"$f":"\": \" & CompanyName","v":": BIMB Investment Management Berhad"}]
[null,null,null,"Name of Fund (Category/Type)",{"$f":"\": \" & FundName","v":": BIMB I Flexi Fund"},null,null,null,null,null,"qAssetClass","(Multiple Items)"]
[null,null,null,"Month Ended",{"$f":"\": \" & TEXT(EOM,\"dd mmm yyyy\")","v":": 31 Mar 2016"},null,null,null,null,null,"qBondType","(Multiple Items)"]
{"$rows_left_out":8}
{"sheet":"UTF3D","index":18,"n_rows":17,"n_cols":15,"rows_kept":17,"cut":false,"hidden":true,"merged":[[1,3,1,7],[4,3,4,7],[7,4,7,7],[8,4,8,7],[9,4,9,7]]}
[null,null,null,null,null,null,null,"UTF COMPLIANCE 3D"]
[null,null,null,"UTF COMPLIANCE RETURNS"]
[]
[null,null,null,{"$f":"UPPER(\"Concentration of Investment in Collective Investment Scheme of a Single Issuer\")","v":"CONCENTRATION OF INVESTMENT IN COLLECTIVE INVESTMENT SCHEME OF A SINGLE ISSUER"}]
[null,null,null,"TOP 5"]
[{"$f":"EDATE(EOM,0)","v":"2016-03-31"}]
[]
[null,null,null,"Management Company ",{"$f":"\": \" & CompanyName","v":": BIMB Investment Management Berhad"},null,null,null,null,null,"qAssetClass","(Multiple Items)"]
[null,null,null,"Name of Fund (Category/Type)",{"$f":"\": \" & FundName","v":": BIMB I Flexi Fund"}]
[null,null,null,"Month Ended",{"$f":"\": \" & TEXT(EOM,\"dd mmm yyyy\")","v":": 31 Mar 2016"},null,null,null,null,null,null,null,null,"Values"]
{"$rows_left_out":8}
{"sheet":"UTF4A","index":19,"n_rows":13,"n_cols":8,"rows_kept":13,"cut":false,"hidden":true,"merged":[[1,3,1,7],[4,3,4,7]]}
[null,null,null,null,null,null,null,"UTF COMPLIANCE 4A"]
[null,null,null,"UTF COMPLIANCE RETURNS"]
[]
[null,null,null,{"$f":"UPPER(\"Investment in Unlisted Securities\")","v":"INVESTMENT IN UNLISTED SECURITIES"}]
[]
[{"$f":"EDATE(EOM,0)","v":"2016-03-31"}]
[]
[null,null,null,"Management Company ",null,":",{"$f":"CompanyName","v":"BIMB Investment Management Berhad"}]
[null,null,null,"Name of Fund (Category/Type)",null,":",{"$f":"FundName","v":"BIMB I Flexi Fund"}]
[null,null,null,"Month Ended",null,":",{"$f":"TEXT(EOM,\"dd mmm yyyy\")","v":"31 Mar 2016"}]
{"$rows_left_out":4}
{"sheet":"UTF5","index":20,"n_rows":13,"n_cols":8,"rows_kept":13,"cut":false,"hidden":true,"merged":[[1,3,1,7],[4,3,4,7],[11,6,11,7]]}
[null,null,null,null,null,null,null,"UTF COMPLIANCE 5"]
[null,null,null,"UTF COMPLIANCE RETURNS"]
[]
[null,null,null,{"$f":"UPPER(\"Investments in Permitted Investments of a Money Market Fund\")","v":"INVESTMENTS IN PERMITTED INVESTMENTS OF A MONEY MARKET FUND"}]
[null,null,null,"TOP 10"]
[{"$f":"EDATE(EOM,0)","v":"2016-03-31"}]
[]
[null,null,null,"Management Company ",":",{"$f":"CompanyName","v":"BIMB Investment Management Berhad"}]
[null,null,null,"Name of Fund (Category/Type)",":",{"$f":"FundName","v":"BIMB I Flexi Fund"}]
[null,null,null,"Month Ended",":",{"$f":"TEXT(EOM,\"dd mmm yyyy\")","v":"31 Mar 2016"}]
{"$rows_left_out":4}
{"sheet":"UTF6","index":21,"n_rows":13,"n_cols":7,"rows_kept":13,"cut":false,"hidden":true,"merged":[[1,3,1,6],[4,3,4,6]]}
[null,null,null,null,null,null,"UTF COMPLIANCE 6"]
[null,null,null,"UTF COMPLIANCE RETURNS"]
[]
[null,null,null,{"$f":"UPPER(\"Holding of Permitted Investments for a Capital Protected Fund\")","v":"HOLDING OF PERMITTED INVESTMENTS FOR A CAPITAL PROTECTED FUND"}]
[]
[{"$f":"EDATE(EOM,0)","v":"2016-03-31"}]
[]
[null,null,null,"Management Company ",":",{"$f":" CompanyName","v":"BIMB Investment Management Berhad"}]
[null,null,null,"Name of Fund (Category/Type)",":",{"$f":" FundName","v":"BIMB I Flexi Fund"}]
[null,null,null,"Month Ended",":",{"$f":"TEXT(EOM,\"dd mmm yyyy\")","v":"31 Mar 2016"}]
{"$rows_left_out":4}
{"sheet":"UTF7","index":22,"n_rows":23,"n_cols":11,"rows_kept":23,"cut":false,"hidden":true,"merged":[[1,3,1,5],[4,3,4,5]]}
[null,null,null,null,null,"UTF COMPLIANCE 7"]
[null,null,null,"UTF COMPLIANCE RETURNS"]
[]
[null,null,null,{"$f":"UPPER(\"Use of Brokers/Dealers\")","v":"USE OF BROKERS/DEALERS"}]
[]
[{"$f":"EDATE(EOM,0)","v":"2016-03-31"}]
[]
[null,null,null,"Management Company ",{"$f":"\": \" & CompanyName","v":": BIMB Investment Management Berhad"}]
[null,null,null,"Name of Fund (Category/Type)",{"$f":"\": \" & FundName","v":": BIMB I Flexi Fund"}]
[null,null,null,"Financial Year Ended",{"$f":"\": \" & TEXT(EOM,\"dd mmm yyyy\")","v":": 31 Mar 2016"}]
{"$rows_left_out":14}
{"sheet":"InPort","index":23,"n_rows":1,"n_cols":9,"rows_kept":1,"cut":false,"hidden":true,"merged":[]}
["qAssetClass","Class","MarketValueFC","IssuerName","IssuerGrpName","StockTypeDesc","fPercNAV","fPercNAV","fPercNAV"]

{"sheet":"InPos","index":24,"n_rows":2,"n_cols":82,"rows_kept":2,"cut":false,"hidden":true,"merged":[]}
["qAssetClass","qStockCode","StockDesc","UnitFaceValue","CostSC","CostFC","MarketValueSC","MarketValueFC","SG1","MaturityDate","ExchangeCountry","IssuerName","IssuerGrpName","VetoValues","IssuedSize","Coupon","MarketValue","RatingUsed","Description","StockTypeDesc","StockName","StockCountry","List","qBondType","Class","PercHolding",{"$f":"IF(LEN(L1)>5,L1& \" - (\" & B1& \") \",\"\")","v":"IssuerName - (qStockCode) "},{"$f":"L1&I1","v":"IssuerNameSG1"},{"$f":"M1&L1&B1","v":"IssuerGrpNameIssuerNameqStockCode"},{"$f":"IF(AND(COUNTIF($M:$M,M1)>0,A1<>\"CSH\",M1<>\"N/A\"),M1,\"\")","v":"IssuerGrpName"},{"$f":"A1&L1","v":"qAssetClassIssuerName"},{"$f":"B1&M1","v":"qStockCodeIssuerGrpName"},{"$f":"C1&N1","v":"StockDescVetoValues"},"UnitFaceValueIssuedSize","CostSCCoupon","CostFCMarketValue","MarketValueSCRatingUsed","MarketValueFCDescription","SG1StockTypeDesc","MaturityDateStockName","ExchangeCountryStockCountry","IssuerNameList","IssuerGrpNameqBondType","VetoValuesClass","IssuedSizePercHolding","CouponIssuerName - (qStockCode) ","MarketValueIssuerNameSG1","RatingUsedIssuerGrpNameIssuerNameqStockCode","DescriptionIssuerGrpName","StockTypeDescqAssetClassIssuerName","StockNameqStockCodeIssuerGrpName","StockCountryStockDescVetoValues","ListUnitFaceValueIssuedSize","qBondTypeCostSCCoupon","ClassCostFCMarketValue","PercHoldingMarketValueSCRatingUsed","IssuerName - (qStockCode) MarketValueFCDescription","IssuerNameSG1SG1StockTypeDesc","IssuerGrpNameIssuerNameqStockCodeMaturityDateStockName","IssuerGrpNameExchangeCountryStockCountry","qAssetClassIssuerNameIssuerNameList","qStockCodeIssuerGrpNameIssuerGrpNameqBondType","StockDescVetoValuesVetoValuesClass","UnitFaceValueIssuedSizeIssuedSizePercHolding","CostSCCouponCouponIssuerName - (qStockCode) ","CostFCMarketValueMarketValueIssuerNameSG1","MarketValueSCRatingUsedRatingUsedIssuerGrpNameIssuerNameqStockCode","MarketValueFCDescriptionDescriptionIssuerGrpName","SG1StockTypeDescStockTypeDescqAssetClassIssuerName","MaturityDateStockNameStockNameqStockCodeIssuerGrpName","ExchangeCountryStockCountryStockCountryStockDescVetoValues","IssuerNameListListUnitFaceValueIssuedSize","IssuerGrpNameqBondTypeqBondTypeCostSCCoupon","VetoValuesClassClassCostFCMarketValue","IssuedSizePercHoldingPercHoldingMarketValueSCRatingUsed","CouponIssuerName - (qStockCode) IssuerName - (qStockCode) MarketValueFCDescription","MarketValueIssuerNameSG1IssuerNameSG1SG1StockTypeDesc","RatingUsedIssuerGrpNameIssuerNameqStockCodeIssuerGrpNameIssuerNameqStockCodeMaturityDateStockName","DescriptionIssuerGrpNameIssuerGrpNameExchangeCountryStockCountry","StockTypeDescqAssetClassIssuerNameqAssetClassIssuerNameIssuerNameList","StockNameqStockCodeIssuerGrpNameqStockCodeIssuerGrpNameIssuerGrpNameqBondType","StockCountryStockDescVetoValuesStockDescVetoValuesVetoValuesClass"]
["CSH","RDI*MYR*HLISLA","Not Applicable",10052449.869999999,10052449.869999999,10052449.869999999,10052449.869999999,10052449.869999999,"N/A",42306,"Malaysia","N/A","N/A","",0,null,10052,null,"Not Applicable",null,"HONG LEONG ISLAMIC BANK BERHAD","Malaysia","Unlisted",null,"Placements of Deposits",0]

{"sheet":"InTran","index":25,"n_rows":203,"n_cols":45,"rows_kept":203,"cut":false,"hidden":true,"merged":[]}
["CPName","qTrnCode","SCNetProceed","SCNetProceed","SCNetProceed","SCNetProceed","SCNetProceed","SCNetProceed","SCNetProceed","SCNetProceed","SCNetProceed","SCNetProceed","SCNetProceed","SCNetProceed","SCNetProceed","SCNetProceed","SCNetProceed","SCNetProceed","SCNetProceed","SCNetProceed","SCNetProceed","SCNetProceed","SCNetProceed","SCNetProceed","SCNetProceed","SCNetProceed","SCNetProceed","SCNetProceed","SCNetProceed","SCNetProceed","SCNetProceed","SCNetProceed","SCNetProceed","SCNetProceed","SCNetProceed","SCNetProceed","SCNetProceed","SCNetProceed","SCNetProceed","SCNetProceed","SCNetProceed","SCNetProceed","SCNetProceed","SCNetProceed","SCNetProceed"]
["AmInvestment Bank Berhad","SP",50185.15]
["AmInvestment Bank Berhad","SP",76482.17]
["AmInvestment Bank Berhad","SP",40429.89]
["AmInvestment Bank Berhad","SP",39144.42]
["AmInvestment Bank Berhad","SP",45795.93]
["AmInvestment Bank Berhad","SP",18681.32]
["AmInvestment Bank Berhad","SP",54558.93]
["AmInvestment Bank Berhad","SS",69048.649999999994]
["AmInvestment Bank Berhad","SS",166711.19]
{"$rows_left_out":194}
{"sheet":"InPricing","index":26,"n_rows":17,"n_cols":5,"rows_kept":17,"cut":false,"hidden":true,"merged":[]}
[]
["qValDate","NAV","BuyPrice","SellPrice","ValPrice"]
["2011-05-31",1308538.44,0.995,0.995,0.99501634000000005]
["2011-06-30",1284497.43,0.99980000000000002,0.99980000000000002,0.99980714000000004]
["2011-07-31",1280452.28,1.0033000000000001,1.0033000000000001,1.0033095400000001]
["2011-08-31",1172482.0900000001,0.91859999999999997,0.91859999999999997,0.91863185999999997]
["2011-09-30",1096914.04,0.85940000000000005,0.85940000000000005,0.85935130000000004]
["2011-10-31",1176540.95,0.91790000000000005,0.91790000000000005,0.91791716999999995]
["2011-11-30",1144090.6499999999,0.91900000000000004,0.91900000000000004,0.91903858000000005]
["2011-12-31",1211136.46,0.97119999999999995,0.97119999999999995,0.97124076999999998]
{"$rows_left_out":8}
{"sheet":"InIndex","index":27,"n_rows":17,"n_cols":3,"rows_kept":17,"cut":false,"hidden":true,"merged":[]}
[]
["ValueDate","qIndexBenchMark","Indices"]
["2011-05-31","KLCI",1558.29]
["2011-06-30","KLCI",1579.07]
["2011-07-31","KLCI",1548.81]
["2011-08-31","KLCI",1447.27]
["2011-09-30","KLCI",1387.13]
["2011-10-31","KLCI",1491.89]
["2011-11-30","KLCI",1472.1]
["2011-12-31","KLCI",1530.73]
{"$rows_left_out":8}
{"sheet":"InTWRR","index":28,"n_rows":3,"n_cols":6,"rows_kept":3,"cut":false,"hidden":true,"merged":[]}
[]
["qFundCode","ValueDate","LastValueDate","NAV","LVNav","TWRR"]
["HLGTSSF",40724,40723,1284497.43,1277148.17,5.7338295946083306E-3]

{"sheet":"InFund","index":29,"n_rows":13,"n_cols":8,"rows_kept":13,"cut":false,"hidden":true,"merged":[]}
[]
["qFundCode","FundName","FinanceYrStart","FinanceYrEnd","qIndexBenchMark","FundCurrency","FundPrefix","CPName"]
["BICMF","BIMB I Cash Management Fund","2015-07-01","2016-06-30","FBMKLCI","MYR","BICMF","AMANAHRAYA TRUSTEES BERHAD"]
["BICMF3","BIMB I Cash Management Fund 3","2015-12-14","2016-12-31","FBMKLCI","MYR","BICMF3","AMANAHRAYA TRUSTEES BERHAD"]
["BIMMF","BIMB Invest Money Market Fund","2015-07-01","2016-06-30","FBMKLCI","MYR","BIMMF","AMANAHRAYA TRUSTEES BERHAD"]
["GD1","Arabesque i Global Dividend Fund 1","2015-11-05","2016-03-31","FBMKLCI","USD","GD1","DEUTSCHE TRUSTEE MALAYSIA BERHAD"]
["GD1RM","BIMB i Global Dividend Fund 1 (MYR)","2015-10-01","2015-12-31","FBMKLCI","MYR","GD1RM","MANAGEMENT COMPANY"]
["IB","Fakhim","2015-09-01","2015-08-28","FBMKLCI","MYR","IB","ABB TRUSTEE BERHAD"]
["ID","Falah","2015-09-01","2015-08-28","FBMKLCI","MYR","ID","ABB TRUSTEE BERHAD"]
["IF","BIMB I Flexi Fund","2015-04-01","2016-03-31","FBMKLCI","MYR","IF","AMANAHRAYA TRUSTEES BERHAD"]
{"$rows_left_out":3}