{"text_format":"1","workbook":"xlsx","n_sheets":29,"sheets":["Riskk","Login","Main","UTFMain","UTFList","UTF1","UTF2A","UTF2B","UTF2C","UTF2D","InPortfolio","UTF2E","UTF2F","UTF2G","UTF2H","UTF3A","UTF3B","UTF3C","UTF3D","UTF4A","UTF5","UTF6","UTF7","InPos","InTran","InPricing","InIndex","InTWRR","InFund"],"not_rendered":{"charts":0,"images":83,"macros":1,"external_links":0,"defined_names":71,"comments":0,"pivot_tables":12},"unopened":[],"bounds":{"document_bytes":16777216,"sheet_cells":100000,"rows_first":2000,"rows_last":500,"rows_between":2000,"halvings":0,"cell_chars":16384,"cell_head_chars":4096},"cells_cut":0,"cells_raw":0,"read":"whole","date_system":"1900"}

{"sheet":"Riskk","index":0,"n_rows":5,"n_cols":11,"rows_kept":5,"cut":false,"hidden":true,"merged":[]}
["linda","UPSW",null,null,null,null,null,{"$f":"COUNT(H3:H20)","v":0},false]
[null,"Userid",null,null,null,null,null,"Main/sub","Caption","On Action","NewGroup"]
[3,"UserLevel"]
["2006-05-09T11:19:39","LoginTime"]
[null,"LogoutTime"]

{"sheet":"Login","index":1,"n_rows":18,"n_cols":10,"rows_kept":18,"cut":false,"hidden":false,"merged":[]}
[]
[null,"Riskk",null,null,null,null,null,"Box 389, Lot 7.16, Wisma Central, Jln Ampang, 50450 Kuala Lumpur"]
[null,"Sdn Bhd (CN 388306K)"]
[]
[]
[]
[]
[]
{"$rows_left_out":11}
{"sheet":"Main","index":2,"n_rows":24,"n_cols":11,"rows_kept":24,"cut":false,"hidden":true,"merged":[]}
["Riskk ",null,null,"Box 389, Lot 7.16, Wisma Central, Jln Ampang, 50450 Kuala Lumpur"]
["Sdn Bhd (CN 388306K)"]
[]
[]
[null,"Report Detail",null,null,null,null,null,null,null,"Sheet","Print"]
[null,"Company  :","Permodalan BSN Berhad",null,null,null,null,null,null,"UTFMain","YES"]
[null,"Fund  :","ASBSN",null,null,null,null,null,null,"UTFList","YES"]
[null,"Fund Name  :",{"$f":"VLOOKUP(FundCode,InFund!$A:$D,2,0)","v":"Amanah Saham BSN"},null,null,null,null,null,null,"UTF1","YES"]
{"$rows_left_out":17}
{"sheet":"UTFMain","index":3,"n_rows":36,"n_cols":7,"rows_kept":36,"cut":false,"hidden":true,"merged":[[13,6,13,7],[12,6,12,8]]}
[]
[null,null,null,"                                       UTF COMPLIANCE RETURNS"]
[null,null,null,"DECLARATION/VERIFICATION FORM"]
[null,null,null,{"$f":"\"For the Month Ended \" & TEXT(EOM,\"MMM yyyy\")","v":"For the Month Ended Apr 2013"}]
[{"$f":"EDATE(EOM,0)","v":"2013-04-30"}]
[]
[null,null,null,"Management Company ",null,{"$f":"\": \" &CompanyName","v":": Permodalan BSN Berhad"}]
[null,null,null,"Trustee  ",null,{"$f":"\": \" & VLOOKUP(FundCode,InFund!$A:$H,8,0)","v":": AMANAHRAYA TRUSTEES BERHAD"}]
{"$rows_left_out":29}
{"sheet":"UTFList","index":4,"n_rows":29,"n_cols":8,"rows_kept":29,"cut":false,"hidden":true,"merged":[]}
[]
[null,null,null,"                                       UTF COMPLIANCE RETURNS"]
[null,null,null,"CHCEKLIST"]
[null,null,null,{"$f":"\"For the Month Ended \" & TEXT(EOM,\"MMM yyyy\")","v":"For the Month Ended Apr 2013"}]
[]
[{"$f":"EDATE(EOM,0)","v":"2013-04-30"}]
[]
[null,null,null,"Management Company ",null,{"$f":"\": \" &CompanyName","v":": Permodalan BSN Berhad"}]
{"$rows_left_out":22}
{"sheet":"UTF1","index":5,"n_rows":14,"n_cols":10,"rows_kept":14,"cut":false,"hidden":true,"merged":[[3,3,3,9],[1,3,1,9],[10,6,10,9],[11,6,11,8],[9,6,9,9],[11,3,11,5]]}
[null,null,null,null,null,null,null,null,null,"UTF COMPLIANCE 1"]
[null,null,null," UTF COMPLIANCE RETURNS"]
[]
[null,null,null,"MANAGER'S BOX"]
[]
[{"$f":"EDATE(EOM,0)","v":"2013-04-30"}]
[]
[null,null,null,"Management Company ",null,null,{"$f":"\": \" &CompanyName","v":": Permodalan BSN Berhad"}]
{"$rows_left_out":7}
{"sheet":"UTF2A","index":6,"n_rows":20,"n_cols":11,"rows_kept":20,"cut":false,"hidden":true,"merged":[[1,3,1,5],[10,4,10,5],[7,4,7,5],[8,4,8,5],[9,4,9,5]]}
[null,null,null,null,null,"UTF COMPLIANCE 2A"]
[null,null,null,"UTF COMPLIANCEL RETURNS"]
[]
[null,null,null,{"$f":"UPPER(\"Investments in Ordinary Shares of a Single Issuer Top 5\")","v":"INVESTMENTS IN ORDINARY SHARES OF A SINGLE ISSUER TOP 5"}]
[]
[{"$f":"EDATE(EOM,0)","v":"2013-04-30"}]
[]
[null,null,null,"Management Company ",{"$f":"\": \" & CompanyName","v":": Permodalan BSN Berhad"}]
{"$rows_left_out":13}
{"sheet":"UTF2B","index":7,"n_rows":100,"n_cols":17,"rows_kept":100,"cut":false,"hidden":true,"merged":[[1,3,1,8],[3,3,3,8],[4,3,4,8]]}
[null,null,null,null,null,null,null,null,"UTF COMPLIANCE 2B"]
[null,null,null," UTF STATISTICAL RETURNS"]
[]
[null,null,null,{"$f":"UPPER(\"Investments in Transferable Securities And Money Market Instruments of a Single Issuer\")","v":"INVESTMENTS IN TRANSFERABLE SECURITIES AND MONEY MARKET INSTRUMENTS OF A SINGLE ISSUER"}]
[null,null,null,"TOP 5"]
[{"$f":"EDATE(EOM,0)","v":"2013-04-30"}]
[]
[null,null,null,"Management Company ",{"$f":"\": \" &CompanyName","v":": Permodalan BSN Berhad"}]
{"$rows_left_out":93}
{"sheet":"UTF2C","index":8,"n_rows":18,"n_cols":12,"rows_kept":18,"cut":false,"hidden":true,"merged":[[1,3,1,5],[4,3,4,5]]}
[null,null,null,null,null,"UTF COMPLIANCE 2C"]
[null,null,null,"UTF COMPLIANCEL RETURNS"]
[]
[null,null,null,{"$f":"UPPER(\"Placements of Deposits with a Single Institution\")","v":"PLACEMENTS OF DEPOSITS WITH A SINGLE INSTITUTION"}]
[null,null,null,"TOP 5"]
[{"$f":"EDATE(EOM,0)","v":"2013-04-30"}]
[]
[null,null,null,"Management Company ",{"$f":"\": \" & CompanyName","v":": Permodalan BSN Berhad"}]
{"$rows_left_out":11}
{"sheet":"UTF2D","index":9,"n_rows":18,"n_cols":14,"rows_kept":18,"cut":false,"hidden":true,"merged":[[1,3,1,6],[4,3,4,6]]}
[null,null,null,null,null,null,"UTF COMPLIANCE 2D"]
[null,null,null,"UTF COMPLIANCEL RETURNS"]
[]
[null,null,null,{"$f":"UPPER(\"Investments in OTC Derivative of a Single Counter-Party\")","v":"INVESTMENTS IN OTC DERIVATIVE OF A SINGLE COUNTER-PARTY"}]
[null,null,null,"TOP 5"]
[{"$f":"EDATE(EOM,0)","v":"2013-04-30"}]
[]
[null,null,null,"Management Company ",null,{"$f":"\": \" & CompanyName","v":": Permodalan BSN Berhad"}]
{"$rows_left_out":11}
{"sheet":"InPortfolio","index":10,"n_rows":71,"n_cols":59,"rows_kept":71,"cut":false,"hidden":true,"merged":[]}
["Class","qFundCode","qStockCode","UnitFaceValue","MarketValueSC","MarketValueFC","ExchangeRate","MaturityDateCSH","CostFC","CostSC","AccruedInterestFC","AccruedInterestSC","UnrealisedGainsStock","UnrealisedGainsExchg","PriceCurr","FundName","FundCurrency","MaxTenor","qCompanyID","StockName","StockCurrency","qAssetClass","SectorName","CurrencyName","Exchange","IslamicFlag","IssuerName","IssuerGrpName","qStockType","Board","qBondType","BndDesc","StockTypeDesc","qManagerCode","qCountryID","FreezeUnit","FundDesc","RatingUsed","NAV","ExchgName","qCshType","CshTypeDesc","UTFlag","qKLSESector","ValuationMethod","qRptSequence","fPercNAV","PurchaseYTM","PurchaseDate","MarketValueDate","BookValue","ValueYTM","ValGains","PreAcqSC","PreAcqFC","FundGrpName","LastMarketValue","Rating","Term"]
["Equity","ASBSN","1023",720000,5572800,5572800,1,401774,5655175.3700000001,5655175.3700000001,0,0,-82375.37,0,7.74,"Amanah Saham BSN","MYR",365,"PB","CIMB","MYR","EQT","Finance","Ringgit Malaysia","KLSE",0,"CIMB Holdings Berhad","COMMERZ","ORD","MB",null,null,"Ordinary","Aznil","MY",null,"Amanah Saham Bank Simpanan Nasional",null,100528690.31999999,"KUALA LUMPUR STOCK EXCHANGE",null,null,1,4,0,1,5.5434920939095358,0,40788,41394,5655175.3700000001,0,14400,0,0,"Amanah Saham Bank Simpanan Nasional",0,"N/A       "]
["Equity","ASBSN","1066      ",435000,3688800,3688800,1,401790,3644670.68,3644670.68,0,0,44129.32,0,8.48,"Amanah Saham BSN","MYR",365,"PB","RHBCAP","MYR","EQT","Finance","Ringgit Malaysia","KLSE",0,"Rhb Capital Berhad","RHB","ORD","MB",null,null,"Ordinary","Aznil","MY",null,"Amanah Saham Bank Simpanan Nasional",null,100528690.31999999,"KUALA LUMPUR STOCK EXCHANGE",null,null,1,4,0,1,3.6694002361494213,0,40854,41394,3644670.68,0,52200,0,0,"Amanah Saham Bank Simpanan Nasional",0,"N/A       "]
["Equity","ASBSN","1155     ",170000,1635400,1635400,1,401773,1537802.73,1537802.73,0,0,97597.27,0,9.6199999999999992,"Amanah Saham BSN","MYR",365,"PB","MAYBANK","MYR","EQT","Finance","Ringgit Malaysia","KLSE",0,"Malayan Banking Berhad","MAYBANK","ORD","MB",null,null,"Ordinary","Aznil","MY",null,"Amanah Saham Bank Simpanan Nasional",null,100528690.31999999,"KUALA LUMPUR STOCK EXCHANGE",null,null,1,4,0,1,1.6267992697350802,0,41271,41394,1537802.73,0,17231.759999999998,0,0,"Amanah Saham Bank Simpanan Nasional",0,"N/A       "]
["Equity","ASBSN","1651",314000,442740,442740,1,401771,719522.38,719522.38,0,0,-276782.38,0,1.41,"Amanah Saham BSN","MYR",365,"PB","MRCB","MYR","EQT","Construction","Ringgit Malaysia","KLSE",0,"M'sian Resources Corporation Bhd","MRCB","ORD","MB",null,null,"Ordinary","Aznil","MY",null,"Amanah Saham Bank Simpanan Nasional",null,100528690.31999999,"KUALA LUMPUR STOCK EXCHANGE",null,null,1,2,0,1,0.44041158657362683,0,40766,41394,719522.38,0,3140,0,0,"Amanah Saham Bank Simpanan Nasional",0,"N/A       "]
["Equity","ASBSN","1818",600000,4290000,4290000,1,401775,5701926.8499999996,5701926.8499999996,0,0,-1411926.85,0,7.15,"Amanah Saham BSN","MYR",365,"PB","BURSA","MYR","EQT","Finance","Ringgit Malaysia","KLSE",0,"Bursa Malaysia Berhad","Bursa Malaysia","ORD","MB",null,null,"Ordinary","Aznil","MY",null,"Amanah Saham Bank Simpanan Nasional",null,100528690.31999999,"KUALA LUMPUR STOCK EXCHANGE",null,null,1,4,0,1,4.2674384659187314,0,40358,41394,5701926.8499999996,0,-30000,0,0,"Amanah Saham Bank Simpanan Nasional",0,"N/A       "]
["Equity","ASBSN","1961",835000,4200050,4200050,1,401779,4844642.5,4844642.5,0,0,-644592.5,0,5.03,"Amanah Saham BSN","MYR",365,"PB","IOICORP","MYR","EQT","Plantation","Ringgit Malaysia","KLSE",0,"IOI Corporation Berhad","IOI","ORD","MB",null,null,"Ordinary","Aznil","MY",null,"Amanah Saham Bank Simpanan Nasional",null,100528690.31999999,"KUALA LUMPUR STOCK EXCHANGE",null,null,1,9,0,1,4.177961521860599,0,40493,41394,4844642.5,0,58450,0,0,"Amanah Saham Bank Simpanan Nasional",0,"N/A       "]
["Equity","ASBSN","2003",470000,1682600,1682600,1,401796,2240009.27,2240009.27,0,0,-557409.27,0,3.58,"Amanah Saham BSN","MYR",365,"PB","KULIM","MYR","EQT","Plantation","Ringgit Malaysia","KLSE",0,"Kulim (Malaysia) Berhad","Kulim Berhad","ORD","MB",null,null,"Ordinary","Aznil","MY",null,"Amanah Saham Bank Simpanan Nasional",null,100528690.31999999,"KUALA LUMPUR STOCK EXCHANGE",null,null,1,9,0,1,1.6737510402691975,0,41289,41394,2240009.27,0,23500,0,0,"Amanah Saham Bank Simpanan Nasional",0,"N/A       "]
{"$rows_left_out":64}
{"sheet":"UTF2E","index":11,"n_rows":13,"n_cols":7,"rows_kept":13,"cut":false,"hidden":true,"merged":[[1,3,1,6],[4,3,4,6]]}
[null,null,null,null,null,null,"UTF COMPLIANCE 2E"]
[null,null,null,"UTF COMPLIANCEL RETURNS"]
[]
[null,null,null,{"$f":"UPPER(\"Investment in Structured Product of a Single Counter-Party\")","v":"INVESTMENT IN STRUCTURED PRODUCT OF A SINGLE COUNTER-PARTY"}]
[null,null,null,"TOP 5"]
[{"$f":"EDATE(EOM,0)","v":"2013-04-30"}]
[]
[null,null,null,"Management Company ",null,{"$f":"\": \" & CompanyName","v":": Permodalan BSN Berhad"}]
{"$rows_left_out":6}
{"sheet":"UTF2F","index":12,"n_rows":100,"n_cols":14,"rows_kept":100,"cut":false,"hidden":true,"merged":[[1,3,1,6],[4,3,4,6]]}
[null,null,null,null,null,null,"UTF COMPLIANCE 2F"]
[null,null,null,"UTF COMPLIANCEL RETURNS"]
[]
[null,null,null,{"$f":"UPPER(\"Aggregate Investments of a Single Issuer/Institution\")","v":"AGGREGATE INVESTMENTS OF A SINGLE ISSUER/INSTITUTION"}]
[null,null,null,"TOP 5"]
[{"$f":"EDATE(EOM,0)","v":"2013-04-30"}]
[]
[null,null,null,"Management Company ",{"$f":"\": \" & CompanyName","v":": Permodalan BSN Berhad"}]
{"$rows_left_out":93}
{"sheet":"UTF2G","index":13,"n_rows":18,"n_cols":14,"rows_kept":18,"cut":false,"hidden":true,"merged":[[1,3,1,6],[4,3,4,6]]}
[null,null,null,null,null,null,"UTF COMPLIANCE 2G"]
[null,null,null,"UTF COMPLIANCEL RETURNS"]
[]
[null,null,null,{"$f":"UPPER(\"Investments in Units/Shares of a Single Collective Investment Scheme\")","v":"INVESTMENTS IN UNITS/SHARES OF A SINGLE COLLECTIVE INVESTMENT SCHEME"}]
[null,null,null,"TOP 5"]
[{"$f":"EDATE(EOM,0)","v":"2013-04-30"}]
[]
[null,null,null,"Management Company ",null,{"$f":"\": \" & CompanyName","v":": Permodalan BSN Berhad"}]
{"$rows_left_out":11}
{"sheet":"UTF2H","index":14,"n_rows":150,"n_cols":18,"rows_kept":150,"cut":false,"hidden":true,"merged":[[10,5,10,8],[1,3,1,8],[4,3,4,8],[7,5,7,8],[8,5,8,8],[9,5,9,8]]}
[null,null,null,null,null,null,null,null,"UTF COMPLIANCE 2H"]
[null,null,null,"UTF COMPLIANCEL RETURNS"]
[]
[null,null,null,{"$f":"UPPER(\"Investments in Transferable Securities And Money Market Instruments of a Group of Companies\")","v":"INVESTMENTS IN TRANSFERABLE SECURITIES AND MONEY MARKET INSTRUMENTS OF A GROUP OF COMPANIES"}]
[null,null,null,"TOP 5"]
[{"$f":"EDATE(EOM,0)","v":"2013-04-30"}]
[]
[null,null,null,"Management Company ",{"$f":"\": \" & CompanyName","v":": Permodalan BSN Berhad"}]
{"$rows_left_out":143}
{"sheet":"UTF3A","index":15,"n_rows":17,"n_cols":20,"rows_kept":17,"cut":false,"hidden":true,"merged":[[1,3,1,8],[4,3,4,8],[7,5,7,8],[8,5,8,8],[9,5,9,8]]}
[null,null,null,null,null,null,null,null,"UTF COMPLIANCE 3A"]
[null,null,null,"UTF COMPLIANCEL RETURNS"]
[null,null,null,null,null,null,null,null,null,null,null,null,null,"qAssetClass","EQT"]
[null,null,null,{"$f":"UPPER(\"Concentration of Investment in Equities/Warrants of a Single Issuer\")","v":"CONCENTRATION OF INVESTMENT IN EQUITIES/WARRANTS OF A SINGLE ISSUER"}]
[null,null,null,"TOP 5",null,null,null,null,null,null,null,null,null,null,null,null,null,"Values"]
[{"$f":"EDATE(EOM,0)","v":"2013-04-30"},null,null,null,null,null,null,null,null,null,null,null,null,"Row Labels","StockName","Class","StockTypeDesc","Sum of IssuedSize","Sum of UnitFaceValue","Sum of PercHolding"]
[null,null,null,null,null,null,null,null,null,null,null,null,null,"Malayan Flour Mills Bhd","MFLOUR","Equity","Ordinary",538193.54839000001,2064,0.38350515463710644]
[null,null,null,"Management Company ",null,{"$f":"\": \" & CompanyName","v":": Permodalan BSN Berhad"},null,null,null,null,null,null,null,"Muhibbah Engineering (M) Bhd","MUHIBAH","Equity","Ordinary",409020.97901999997,838,0.20487946657597339]
{"$rows_left_out":10}
{"sheet":"UTF3B","index":16,"n_rows":17,"n_cols":17,"rows_kept":17,"cut":false,"hidden":true,"merged":[[1,3,1,7],[4,3,4,7],[7,4,7,7],[8,4,8,7],[9,4,9,7]]}
[null,null,null,null,null,null,null,"UTF COMPLIANCE 3B"]
[null,null,null,"UTF COMPLIANCEL RETURNS"]
[]
[null,null,null,{"$f":"UPPER(\"Concentration of Investment in Debentures of a Single Issuer\")","v":"CONCENTRATION OF INVESTMENT IN DEBENTURES OF A SINGLE ISSUER"}]
[null,null,null,"TOP 5"]
[{"$f":"EDATE(EOM,0)","v":"2013-04-30"}]
[]
[null,null,null,"Management Company ",{"$f":"\": \" & CompanyName","v":": Permodalan BSN Berhad"}]
{"$rows_left_out":10}
{"sheet":"UTF3C","index":17,"n_rows":17,"n_cols":16,"rows_kept":17,"cut":false,"hidden":true,"merged":[[1,3,1,7],[4,3,4,7],[7,4,7,7],[8,4,8,7],[9,4,9,7]]}
[null,null,null,null,null,null,null,"UTF COMPLIANCE 3C"]
[null,null,null,"UTF COMPLIANCEL RETURNS"]
[]
[null,null,null,{"$f":"UPPER(\"Concentration of Investment in Money Market Instruments of a Single Issuer\")","v":"CONCENTRATION OF INVESTMENT IN MONEY MARKET INSTRUMENTS OF A SINGLE ISSUER"}]
[null,null,null,"TOP 5"]
[{"$f":"EDATE(EOM,0)","v":"2013-04-30"}]
[]
[null,null,null,"Management Company ",{"$f":"\": \" & CompanyName","v":": Permodalan BSN Berhad"}]
{"$rows_left_out":10}
{"sheet":"UTF3D","index":18,"n_rows":17,"n_cols":16,"rows_kept":17,"cut":false,"hidden":true,"merged":[[1,3,1,7],[4,3,4,7],[7,4,7,7],[8,4,8,7],[9,4,9,7]]}
[null,null,null,null,null,null,null,"UTF COMPLIANCE 3D"]
[null,null,null,"UTF COMPLIANCEL RETURNS"]
[]
[null,null,null,{"$f":"UPPER(\"Concentration of Investment in Collective Investment Scheme of a Single Issuer\")","v":"CONCENTRATION OF INVESTMENT IN COLLECTIVE INVESTMENT SCHEME OF A SINGLE ISSUER"}]
[null,null,null,"TOP 5"]
[{"$f":"EDATE(EOM,0)","v":"2013-04-30"}]
[]
[null,null,null,"Management Company ",{"$f":"\": \" & CompanyName","v":": Permodalan BSN Berhad"},null,null,null,null,null,"qAssetClass","(Multiple Items)"]
{"$rows_left_out":10}
{"sheet":"UTF4A","index":19,"n_rows":13,"n_cols":7,"rows_kept":13,"cut":false,"hidden":true,"merged":[[1,3,1,6],[4,3,4,6]]}
[null,null,null,null,null,null,"UTF COMPLIANCE 4A"]
[null,null,null,"UTF COMPLIANCEL RETURNS"]
[]
[null,null,null,{"$f":"UPPER(\"Investment in Unlisted Securities\")","v":"INVESTMENT IN UNLISTED SECURITIES"}]
[]
[{"$f":"EDATE(EOM,0)","v":"2013-04-30"}]
[]
[null,null,null,"Management Company ",null,{"$f":"\": \" & CompanyName","v":": Permodalan BSN Berhad"}]
{"$rows_left_out":6}
{"sheet":"UTF5","index":20,"n_rows":13,"n_cols":8,"rows_kept":13,"cut":false,"hidden":true,"merged":[[1,3,1,7],[4,3,4,7],[11,6,11,7]]}
[null,null,null,null,null,null,null,"UTF COMPLIANCE 5"]
[null,null,null,"UTF COMPLIANCEL RETURNS"]
[]
[null,null,null,{"$f":"UPPER(\"Investments in Permitted Investments of a Money Market Fund\")","v":"INVESTMENTS IN PERMITTED INVESTMENTS OF A MONEY MARKET FUND"}]
[null,null,null,"TOP 10"]
[{"$f":"EDATE(EOM,0)","v":"2013-04-30"}]
[]
[null,null,null,"Management Company ",null,null,{"$f":"\": \" & CompanyName","v":": Permodalan BSN Berhad"}]
{"$rows_left_out":6}
{"sheet":"UTF6","index":21,"n_rows":13,"n_cols":7,"rows_kept":13,"cut":false,"hidden":true,"merged":[[1,3,1,6],[4,3,4,6]]}
[null,null,null,null,null,null,"UTF COMPLIANCE 6"]
[null,null,null,"UTF COMPLIANCEL RETURNS"]
[]
[null,null,null,{"$f":"UPPER(\"Holding of Permitted Investments for a Capital Protected Fund\")","v":"HOLDING OF PERMITTED INVESTMENTS FOR A CAPITAL PROTECTED FUND"}]
[]
[{"$f":"EDATE(EOM,0)","v":"2013-04-30"}]
[]
[null,null,null,"Management Company ",null,{"$f":"\": \" & CompanyName","v":": Permodalan BSN Berhad"}]
{"$rows_left_out":6}
{"sheet":"UTF7","index":22,"n_rows":23,"n_cols":11,"rows_kept":23,"cut":false,"hidden":true,"merged":[[1,3,1,5],[4,3,4,5]]}
[null,null,null,null,null,"UTF COMPLIANCE 7"]
[null,null,null,"UTF COMPLIANCEL RETURNS"]
[]
[null,null,null,{"$f":"UPPER(\"Use of Brokers/Dealers\")","v":"USE OF BROKERS/DEALERS"}]
[]
[{"$f":"EDATE(EOM,0)","v":"2013-04-30"}]
[]
[null,null,null,"Management Company ",{"$f":"\": \" & CompanyName","v":": Permodalan BSN Berhad"}]
{"$rows_left_out":16}
{"sheet":"InPos","index":23,"n_rows":52,"n_cols":32,"rows_kept":52,"cut":false,"hidden":true,"merged":[]}
["qAssetClass","qStockCode","StockDesc","UnitFaceValue","CostSC","CostFC","MarketValueSC","MarketValueFC","SG1","MaturityDate","ExchangeCountry","IssuerName","IssuerGrpName","VetoValues","IssuedSize","Coupon","MarketValue","RatingUsed","Description","StockTypeDesc","StockName","StockCountry","List","qBondType","Class","PercHolding",{"$f":"IF(LEN(L1)>5,L1& \" - (\" & B1& \") \",\"\")","v":"IssuerName - (qStockCode) "},{"$f":"L1&I1","v":"IssuerNameSG1"},{"$f":"M1&L1&B1","v":"IssuerGrpNameIssuerNameqStockCode"},{"$f":"IF(AND(COUNTIF($M:$M,M1)>0,A1<>\"CSH\",M1<>\"N/A\"),M1,\"\")","v":"IssuerGrpName"},{"$f":"A1&L1","v":"qAssetClassIssuerName"},{"$f":"IF(AND(AD1<>\"\",COUNTIF(L:L,L1)<>COUNTIF($AD:$AD,AD1)),AD1,\"\")","v":""}]
["BND","RA130112","SABAH DEVELOPMENT BANK BERHAD CP",2000,1994509.59,1994509.59,1997071.78,1997071.78,"N/A",41410,"Malaysia","Sabah Development Bank Bhd","N/A","",110000,0,1997,"MARC1","Not Applicable","Commercial Paper","CCP RA130112","Malaysia","Unlisted","6","Bond",1.8181818181818181,{"$f":"IF(LEN(L2)>5,L2& \" - (\" & B2& \") \",\"\")","v":"Sabah Development Bank Bhd - (RA130112) "},{"$f":"L2&I2","v":"Sabah Development Bank BhdN/A"},{"$f":"M2&L2&B2","v":"N/ASabah Development Bank BhdRA130112"},{"$f":"IF(AND(COUNTIF($M:$M,M2)>0,A2<>\"CSH\",M2<>\"N/A\"),M2,\"\")","v":""},{"$f":"A2&L2","v":"BNDSabah Development Bank Bhd"},{"$f":"IF(AND(AD2<>\"\",COUNTIF(L:L,L2)<>COUNTIF($AD:$AD,AD2)),AD2,\"\")","v":""}]
["BND","RA130112","SABAH DEVELOPMENT BANK BERHAD CP",2000,1994509.59,1994509.59,1997071.78,1997071.78,"N/A",41410,"Malaysia","Sabah Development Bank Bhd","N/A","",110000,0,1997,"P1","Not Applicable","Commercial Paper","CCP RA130112","Malaysia","Unlisted","6","Bond",1.8181818181818181]
["BND","RA130120","SABAH DEVELOPMENT BANK BERHAD CP",2000,1994526.03,1994526.03,1995985.75,1995985.75,"N/A",41416,"Malaysia","Sabah Development Bank Bhd","N/A","",160000,0,1996,"MARC1","Not Applicable","Commercial Paper","CCP RA130120","Malaysia","Unlisted","6","Bond",1.25]
["BND","RA130120","SABAH DEVELOPMENT BANK BERHAD CP",2000,1994526.03,1994526.03,1995985.75,1995985.75,"N/A",41416,"Malaysia","Sabah Development Bank Bhd","N/A","",160000,0,1996,"P1","Not Applicable","Commercial Paper","CCP RA130120","Malaysia","Unlisted","6","Bond",1.25]
["CSH","RPI*MYR*BKRB","Not Applicable",374,374000,374000,375931.48,375931.48,"N/A",41429,"Malaysia","Bank Rakyat Berhad","N/A","",0,null,376,null,"Not Applicable",null,"RPI*MYR*BKRB","Malaysia","Unlisted",null,"Placements of Deposits",0]
["CSH","RPI*MYR*BKRB","Not Applicable",130,130000,130000,130254.66,130254.66,"N/A",41464,"Malaysia","Bank Rakyat Berhad","N/A","",0,null,130,null,"Not Applicable",null,"RPI*MYR*BKRB","Malaysia","Unlisted",null,"Placements of Deposits",0]
["CSH","RPI*MYR*BKRB","Not Applicable",308,308000,308000,308411.37,308411.37,"N/A",41471,"Malaysia","Bank Rakyat Berhad","N/A","",0,null,308,null,"Not Applicable",null,"RPI*MYR*BKRB","Malaysia","Unlisted",null,"Placements of Deposits",0]
{"$rows_left_out":45}
{"sheet":"InTran","index":24,"n_rows":1,"n_cols":3,"rows_kept":1,"cut":false,"hidden":true,"merged":[]}
["CPName","qTrnCode","SCNetProceed"]

{"sheet":"InPricing","index":25,"n_rows":18,"n_cols":6,"rows_kept":18,"cut":false,"hidden":true,"merged":[]}
[]
["qValDate","NAV","BuyPrice","SellPrice","ValPrice","TotalUnits"]
["2013-03-29",99105757.700000003,0.35220000000000001,0.35220000000000001,0.35218819000000001,281400000]
["2013-04-30",100528690.31999999,0.35799999999999998,0.35799999999999998,0.35800816000000002,280800000]
["2013-05-31",106006181.8,0.37890000000000001,0.37890000000000001,0.37886412000000003,279800000]
["2013-06-28",105636175.55,0.3775,0.3775,0.37754173000000002,279800000]
["2013-07-31",106498011.19,0.38290000000000002,0.38290000000000002,0.38294862000000002,278100000]
["2013-08-30",103170547,0.37030000000000002,0.37030000000000002,0.37031783000000001,278600000]
{"$rows_left_out":11}
{"sheet":"InIndex","index":26,"n_rows":17,"n_cols":3,"rows_kept":17,"cut":false,"hidden":true,"merged":[]}
[]
["ValueDate","qIndexBenchMark","Indices"]
["2011-05-31","KLCI",1558.29]
["2011-06-30","KLCI",1579.07]
["2011-07-31","KLCI",1548.81]
["2011-08-31","KLCI",1447.27]
["2011-09-30","KLCI",1387.13]
["2011-10-31","KLCI",1491.89]
{"$rows_left_out":10}
{"sheet":"InTWRR","index":27,"n_rows":3,"n_cols":6,"rows_kept":3,"cut":false,"hidden":true,"merged":[]}
[]
["qFundCode","ValueDate","LastValueDate","NAV","LVNav","TWRR"]
["HLGTSSF",40724,40723,1284497.43,1277148.17,5.7338295946083306E-3]

{"sheet":"InFund","index":28,"n_rows":6,"n_cols":8,"rows_kept":6,"cut":false,"hidden":true,"merged":[]}
[]
["qFundCode","FundName","FinanceYrStart","FinanceYrEnd","qIndexBenchMark","FundCurrency","FundPrefix","CPName"]
["ASBSN","Amanah Saham BSN","1994-12-31","2013-12-31","GIS60GIM","MYR","ASBSN","AMANAHRAYA TRUSTEES BERHAD"]
["i-CASH","CASH","2013-06-21","2013-12-31","OPR","MYR","iCASH","AMANAHRAYA TRUSTEES BERHAD"]
["IFRAH","Ifrah","2012-02-09","2013-12-31","GIS60GIM","MYR","IFRAH","AMANAHRAYA TRUSTEES BERHAD"]
["JADID","Jadid","2008-06-18","2013-12-31","GIS60GIM","MYR","JADID","AMANAHRAYA TRUSTEES BERHAD"]