{"text_format":"1","workbook":"xlsx","n_sheets":15,"sheets":["Riskk","Login","aaAAAFundSdf","aaCshSecurityPdf","CounterParty","ReportIn","Report","Main","CSH","CashFlowDetails","MaturityList","aaAAABankAccountSdf","aaAAACurrencySdf","CashFlowData","MaturityData"],"not_rendered":{"charts":0,"images":10,"macros":1,"external_links":1,"defined_names":53,"comments":2,"pivot_tables":0},"unopened":[],"bounds":{"document_bytes":16777216,"sheet_cells":100000,"rows_first":2000,"rows_last":500,"rows_between":2000,"halvings":0,"cell_chars":16384,"cell_head_chars":4096},"cells_cut":0,"cells_raw":0,"read":"whole","date_system":"1900"}

{"sheet":"Riskk","index":0,"n_rows":46,"n_cols":118,"rows_kept":46,"cut":false,"hidden":false,"merged":[]}
["linda","UPSW",null,null,null,null,null,{"$f":"COUNT(H3:H20)","v":0},false,null,null,null,null,null,{"$f":"K1-L1-M1","v":0},null,null,null,null,null,null,null,null,"TBKey",{"$f":"C1&D1","v":""},null,null,null,null,null,null,null,null,null,null,null,null,null,null,null,null,null,null,null,null,null,null,null,null,null,null,null,null,null,null,null,null,null,null,null,null,null,null,null,null,null,null,null,null,null,null,null,null,null,null,"MstHstKey",{"$f":"G1&BG1","v":""},{"$f":"G1&IF(C1=\"DEV\",MID(H1,FIND(\"*\",H1,1)+1,3),0)","v":"0"},null,null,null,null,null,null,null,null,null,null,null,null,"TranKey",{"$f":"H1&BX1","v":"0MstHstKey"},null,null,null,null,null,null,null,null,null,null,null,null,null,null,null,null,null,null,null,null,null,null,null,null,"ReceivableKey",{"$f":"IF(LEFT(E1,1)=\"C\",0,M1&B1)","v":"UPSW"}]
[null,"Userid",null,null,null,null,null,"Main/sub","Caption","On Action","NewGroup"]
[3,"UserLevel"]
["2006-05-09T11:19:39","LoginTime"]
[null,"LogoutTime"]
[null,"User"]
[]
[]
[]
[]
{"$rows_left_out":37}
{"sheet":"Login","index":1,"n_rows":18,"n_cols":10,"rows_kept":18,"cut":false,"hidden":false,"merged":[]}
[]
[null,null,null,null,null,null,null,"Box 389, Lot 7.16, Wisma Central, Jln Ampang, 50450 Kuala Lumpur"]
[null,"Sdn Bhd (CN 388306K)"]
[]
[]
[]
[]
[]
[null,"Radar Cash Upload"]
[]
{"$rows_left_out":9}
{"sheet":"aaAAAFundSdf","index":2,"n_rows":581,"n_cols":3,"rows_kept":581,"cut":false,"hidden":true,"merged":[]}
["qFundCode","FundDesc","FundPrefix"]
["AG-ALK","AL-KABIR BIN MOHD ALI","AGALK"]
["AG-BAY","BAY BEE CHOO","AGBAY"]
["AG-BCK","BOEY CHEE KEONG","AGBCK"]
["AG-CEH","CHUA ENG HUI","AGCEH"]
["AG-CHAR","CHARMAINE LAI SHU MING","AGCHAR"]
["AG-CHM","CHEN HOCK MEET","AGCHM"]
["AG-CHS","CHONG HIN SANG","AGCHS"]
["AG-CKC","CHOO KWEE CHIN","AGCKC"]
["AG-CL","CATHERINE LAM","AGCL"]
{"$rows_left_out":572}
{"sheet":"aaCshSecurityPdf","index":3,"n_rows":150,"n_cols":6,"rows_kept":150,"cut":false,"hidden":true,"merged":[]}
["qCshLink","qCPCode","qCshType","ForeignBnk","Basis","WithHoldingTax"]
["FDC*MYR*ABNA","ABN-AMRO","FDC",0,365,0]
["FDC*MYR*ALL","ALLIANCEBANK","FDC",0,365,0]
["FDC*MYR*AMB","AMBANK","FDC",0,365,0]
["FDC*MYR*AMFB","AMFB","FDC",0,365,0]
["FDC*MYR*AMMB","AMMB","FDC",0,365,0]
["FDC*MYR*AMRC","BOA","FDC",0,365,0]
["FDC*MYR*ASDB","ASDB","FDC",0,365,0]
["FDC*MYR*BCBB","BCBB","FDC",0,365,0]
["FDC*MYR*CHASE","CHASE","FDC",0,365,0]
{"$rows_left_out":141}
{"sheet":"CounterParty","index":4,"n_rows":63,"n_cols":8,"rows_kept":63,"cut":false,"hidden":true,"merged":[]}
["qCPCode","qCshCPType","CshCP","qIssuerCode","Rating","BNMAcc","KeyInDate","KeyInBy"]
["ABN-AMRO",2,"ABNA","ABNAMRO",1,"DF","2006-09-04T17:16:17","cash"]
["Alliance Bank(IS)",2,"N/A","N/A",1,"N/A","2016-08-17T17:03:50","yinlai"]
["Alliance Islamic",2,"AIBB","AIBB",1,"DF","2018-10-31T15:59:55","jaya"]
["ALLIANCEBANK",2,"ALL","ALLIANCEBK",1,"DF","2018-02-09T12:01:22","jaya"]
["AM ISLAMIC BANK",2,"AMIB","AMISLAMIC",1,"DF","2017-12-13T11:48:25","jaya"]
["AMBANK",2,"AMB","AMFIN",1,"DF","2006-01-01T15:26:52","Riskk.Com"]
["AMB-ZNID",3,"N/A","N/A",1,"N/A","2012-04-10T17:14:17","jessica"]
["AMFB",2,"AMFB","AMFB",1,"DF","2006-01-01T15:26:52","Riskk.Com"]
["AMMB",3,"AMMB","AMMB",1,"DF","2006-01-01T15:26:52","Riskk.Com"]
{"$rows_left_out":54}
{"sheet":"ReportIn","index":5,"n_rows":114,"n_cols":54,"rows_kept":114,"cut":false,"hidden":true,"merged":[]}
["qCshTrnID","SettleGroup","qStockCode","qTrnCode","qTranMethod","qFundCode","Rate","MaturityPrinciple","FaceValue","Cost","SettCurrency","LiquidityProceed","Proceed","TradeDate","ValueDate","PayDate","MaturityDate","qCshType","qCPCode","SourceBankAccNo","ExchgRateSF","CustodianCode","CustodianFee","Uploaded","ErrDesc","qOrderBreachID","RolloverFlag","Tenor","FIDealer","InterestRM","DealerKeyInDate","DealerKeyInBy","KeyInDate","KeyInBy","FundName","PrintPageFlag","CPAccNo","CPName","CPContactPerson","CPAddress","CPPostCode","CPStateName","CPCityName","TrusteeCode","TrusteeName","TrusteeContactCP","TrusteeAddress","TrusteePostCode","TrusteeCityName","TrusteeStateName","SourceBankCode","CshTypeDesc","PlaceFlag","Adjustment"]
["CSH*140804967","","RDC*MYR*PBB","RP",1,"1073",3.2500000000000001E-2,847000,0,0,"MYR",0,0,41877,41877,41877,41878,"RDC","B:PBB","DB-MYR-0022376000",1,"0",0,"F","","N/A",2,1,"",75.42,41877.456424456017,"ASTCLK",41877.456424270837,"ASTCLK","(1073)  - YAYASAN SABAH",0,"DF","PUBLIC BANK BERHAD","GRACE SEW","DEUTSCHE BANK (MALAYSIA) BERHAD","50250           ","Kuala Lumpur.","Kuala Lumpur","DBNOMINEETSB","DB (MALAYSIA) NOMINEE (TEMPATAN) SENDIRIAN BERHAD","Client Services team","DEUTSCHE BANK (MALAYSIA) BERHAD","50250           ","Kuala Lumpur","Kuala Lumpur.","B:DEUTSCHE","Short Term Money Market Deposit",2,-847000]
["CSH*140805138","","RDC*MYR*PBB","RP",1,"1073",3.2500000000000001E-2,0,850000,850000,"MYR",-850000,-850000,41877,41877,41877,41878,"RDC","B:PBB","DB-MYR-0022376000",1,"0",0,"F","","N/A",2,1,"Kelvin",0,41877.481352314811,"ASTCLK",41877.481352118055,"ASTCLK","(1073)  - YAYASAN SABAH",0,"DF","PUBLIC BANK BERHAD","GRACE SEW","DEUTSCHE BANK (MALAYSIA) BERHAD","50250           ","Kuala Lumpur.","Kuala Lumpur","DBNOMINEETSB","DB (MALAYSIA) NOMINEE (TEMPATAN) SENDIRIAN BERHAD","Client Services team","DEUTSCHE BANK (MALAYSIA) BERHAD","50250           ","Kuala Lumpur","Kuala Lumpur.","B:DEUTSCHE","Short Term Money Market Deposit",2,850000]
["CSH*140804968","","RDC*MYR*PBB","RP",1,"1081",3.2500000000000001E-2,672000,0,0,"MYR",0,0,41877,41877,41877,41878,"RDC","B:PBB","DB-MYR-0022624000",1,"0",0,"F","","N/A",2,1,"",59.84,41877.45642746528,"ASTCLK",41877.456427233796,"ASTCLK","(1081)  - JOHN EDWIN DIXON",0,"DF","PUBLIC BANK BERHAD","GRACE SEW","DEUTSCHE BANK (MALAYSIA) BERHAD","50250           ","Kuala Lumpur.","Kuala Lumpur","DBNOMINEEASB","DB (MALAYSIA) NOMINEE (ASING) SENDIRIAN BERHAD","Client Services team","DEUTSCHE BANK (MALAYSIA) BERHAD","50250           ","Kuala Lumpur","Kuala Lumpur.","B:DEUTSCHE","Short Term Money Market Deposit",2,-672000]
["CSH*140805139","","RDC*MYR*PBB","RP",1,"1081",3.2500000000000001E-2,0,675000,675000,"MYR",-675000,-675000,41877,41877,41877,41878,"RDC","B:PBB","DB-MYR-0022624000",1,"0",0,"F","","N/A",2,1,"Kelvin",0,41877.481355474534,"ASTCLK",41877.481355324075,"ASTCLK","(1081)  - JOHN EDWIN DIXON",0,"DF","PUBLIC BANK BERHAD","GRACE SEW","DEUTSCHE BANK (MALAYSIA) BERHAD","50250           ","Kuala Lumpur.","Kuala Lumpur","DBNOMINEEASB","DB (MALAYSIA) NOMINEE (ASING) SENDIRIAN BERHAD","Client Services team","DEUTSCHE BANK (MALAYSIA) BERHAD","50250           ","Kuala Lumpur","Kuala Lumpur.","B:DEUTSCHE","Short Term Money Market Deposit",2,675000]
["CSH*140804969","","RDC*MYR*PBB","RP",1,"1084",3.2500000000000001E-2,4861000,0,0,"MYR",0,0,41877,41877,41877,41878,"RDC","B:PBB","DB-MYR-0022392000",1,"0",0,"F","","N/A",2,1,"",432.83,41877.456429664351,"ASTCLK",41877.456429479163,"ASTCLK","(1084)  - Y. USAHAWAN BUMIPUTRA",0,"DF","PUBLIC BANK BERHAD","GRACE SEW","DEUTSCHE BANK (MALAYSIA) BERHAD","50250           ","Kuala Lumpur.","Kuala Lumpur","DBNOMINEETSB","DB (MALAYSIA) NOMINEE (TEMPATAN) SENDIRIAN BERHAD","Client Services team","DEUTSCHE BANK (MALAYSIA) BERHAD","50250           ","Kuala Lumpur","Kuala Lumpur.","B:DEUTSCHE","Short Term Money Market Deposit",2,-4861000]
["CSH*140805140","","RDC*MYR*PBB","RP",1,"1084",3.2500000000000001E-2,0,4878000,4878000,"MYR",-4878000,-4878000,41877,41877,41877,41878,"RDC","B:PBB","DB-MYR-0022392000",1,"0",0,"F","","N/A",2,1,"Kelvin",0,41877.48135775463,"ASTCLK",41877.481357557874,"ASTCLK","(1084)  - Y. USAHAWAN BUMIPUTRA",0,"DF","PUBLIC BANK BERHAD","GRACE SEW","DEUTSCHE BANK (MALAYSIA) BERHAD","50250           ","Kuala Lumpur.","Kuala Lumpur","DBNOMINEETSB","DB (MALAYSIA) NOMINEE (TEMPATAN) SENDIRIAN BERHAD","Client Services team","DEUTSCHE BANK (MALAYSIA) BERHAD","50250           ","Kuala Lumpur","Kuala Lumpur.","B:DEUTSCHE","Short Term Money Market Deposit",2,4878000]
["CSH*140804970","","RDC*MYR*PBB","RP",1,"1085",3.2500000000000001E-2,7138000,0,0,"MYR",0,0,41877,41877,41877,41878,"RDC","B:PBB","DB-MYR-0022426000",1,"0",0,"F","","N/A",2,1,"",635.58000000000004,41877.456431909719,"ASTCLK",41877.456431678242,"ASTCLK","(1085)  - PRG PERTUKARAN FELLOWSHIP PM M'SIA",0,"DF","PUBLIC BANK BERHAD","GRACE SEW","DEUTSCHE BANK (MALAYSIA) BERHAD","50250           ","Kuala Lumpur.","Kuala Lumpur","DBNOMINEETSB","DB (MALAYSIA) NOMINEE (TEMPATAN) SENDIRIAN BERHAD","Client Services team","DEUTSCHE BANK (MALAYSIA) BERHAD","50250           ","Kuala Lumpur","Kuala Lumpur.","B:DEUTSCHE","Short Term Money Market Deposit",2,-7138000]
["CSH*140805141","","RDC*MYR*PBB","RP",1,"1085",3.2500000000000001E-2,0,7161000,7161000,"MYR",-7161000,-7161000,41877,41877,41877,41878,"RDC","B:PBB","DB-MYR-0022426000",1,"0",0,"F","","N/A",2,1,"Kelvin",0,41877.481359953701,"ASTCLK",41877.481359756945,"ASTCLK","(1085)  - PRG PERTUKARAN FELLOWSHIP PM M'SIA",0,"DF","PUBLIC BANK BERHAD","GRACE SEW","DEUTSCHE BANK (MALAYSIA) BERHAD","50250           ","Kuala Lumpur.","Kuala Lumpur","DBNOMINEETSB","DB (MALAYSIA) NOMINEE (TEMPATAN) SENDIRIAN BERHAD","Client Services team","DEUTSCHE BANK (MALAYSIA) BERHAD","50250           ","Kuala Lumpur","Kuala Lumpur.","B:DEUTSCHE","Short Term Money Market Deposit",2,7161000]
["CSH*140804971","","RDC*MYR*PBB","RP",1,"1089",3.2500000000000001E-2,3551000,0,0,"MYR",0,0,41877,41877,41877,41878,"RDC","B:PBB","DB-MYR-0022459000",1,"0",0,"F","","N/A",2,1,"",316.18,41877.4564340625,"ASTCLK",41877.456433912041,"ASTCLK","(1089)  - GIBRALTAR BSN LIFE BERHAD (LIFE-PAR)",2,"DF","PUBLIC BANK BERHAD","GRACE SEW","DEUTSCHE BANK (MALAYSIA) BERHAD","50250           ","Kuala Lumpur.","Kuala Lumpur","DBNOMINEETSB","DB (MALAYSIA) NOMINEE (TEMPATAN) SENDIRIAN BERHAD","Client Services team","DEUTSCHE BANK (MALAYSIA) BERHAD","50250           ","Kuala Lumpur","Kuala Lumpur.","B:DEUTSCHE","Short Term Money Market Deposit",2,-3551000]
{"$rows_left_out":105}
{"sheet":"Report","index":6,"n_rows":122,"n_cols":18,"rows_kept":122,"cut":false,"hidden":true,"merged":[]}
[]
[null,null,null,null,null,null,null,null,null,null,null,null,null,null,null,{"$f":"\"Prepared By :\" & Userid","v":"Prepared By :"}]
[null,null,null,null,null,null,null,null,null,null,null,null,null,null,null,"Time Stamp : "]
[null,null,null,null,null,null,null,null,null,null,null,null,null,null,null,"Check By : "]
[null,null,null,null,null,null,null,null,null,null,null,null,null,null,null,"Approved By :"]
[null,null,{"$f":"\"Placement Detials As At \" & TEXT(ValueDate,\"dd-MMM-Yyyy\")","v":"Placement Detials As At 02-Oct-2019"}]
[]
[null,null,"Fund Code","Fund Name","Maturity (Principle)","Maturity (Profit Due)","Placement Adjustment","Placement","Rate (%)","Tenure (D)","Placement Type","Counter Party Name","Trade Date","Maturity Date","Interest Due","Account Number","Trustee / Nominee","Dealer"]
[]
[null,null,{"$f":"ReportIn!F2","v":"1073"},{"$f":"ReportIn!AI2","v":"(1073)  - YAYASAN SABAH"},{"$f":"ReportIn!H2","v":847000},{"$f":"ReportIn!AD2","v":75.42},{"$f":"ReportIn!BB2","v":-847000},{"$f":"ReportIn!I2","v":0},{"$f":"ReportIn!G2","v":3.2500000000000001E-2},{"$f":"ReportIn!AB2:AB2","v":1},{"$f":"ReportIn!AZ2","v":"Short Term Money Market Deposit"},{"$f":"ReportIn!AL2","v":"PUBLIC BANK BERHAD"},{"$f":"ReportIn!N2","v":41877},{"$f":"ReportIn!Q2","v":41878},{"$f":"ROUND(H10*J10*I10/VLOOKUP(ReportIn!C2,aaCshSecurityPdf!A:E,5,0),2)","v":{"$error":"#N/A"}},{"$f":"ReportIn!T2","v":"DB-MYR-0022376000"},{"$f":"ReportIn!AR2","v":"DBNOMINEETSB"},{"$f":"ReportIn!AC2","v":""}]
{"$rows_left_out":113}
{"sheet":"Main","index":7,"n_rows":20,"n_cols":22,"rows_kept":20,"cut":false,"hidden":true,"merged":[[19,12,19,14]]}
[null,null,null,null,null,null,null,null,null,null,null,null,"Box 389, Lot 7.16, Wisma Central, Jln Ampang, 50450 Kuala Lumpur",null,null,null,null,null,"BoBizDate","BoLstBizDate"]
[null,null,null,null,null,null,null,null,null,null,null,null,null,null,null,null,null,null,"2019-06-27","2019-06-26","FDC",0]
[null,null,null,null,null,null,null,null,null,null,null,null,null,null,null,null,null,null,null,null,"FDC",1]
[null,null,null,null,null,null,null,null,null,null,null,null,null,null,null,null,null,null,null,null,"FDI",2]
[null,"Upload Detail",null,null,null,null,null,null,null,null,null,null,null,null,null,null,null,null,null,null,"RPI"]
[null,null,null,null,null,null,null,null,null,null,null,null,null,null,null,null,null,null,null,null,"RPC"]
[null,"Radar Cash Upload Program",null,null,null,null,null,null,null,null,null,null,null,null,null,null,null,null,null,null,"RST"]
[]
[]
[null,null,"Value Date",null,"2019-10-02"]
{"$rows_left_out":11}
{"sheet":"CSH","index":8,"n_rows":20,"n_cols":17,"rows_kept":20,"cut":false,"hidden":true,"merged":[]}
["Group","Fund","Rate (%)","Tenor","Placement Date","Maturity Date","Financial Institution","Placement Type","Amount (RM)","FI Dealer","Source Bank Account No","Currency","Roll Over Flag","Maturity Principle","Maturity Profit","Accrued Valuation","Remark"]
["A",null,0,0,{"$f":"BizDate","v":"2019-06-27"},{"$f":"E2+D2","v":"2019-06-27"},null,"RCB",0,null,{"$f":"\"DF\"","v":"DF"},{"$f":"\"MYR\"","v":"MYR"},0,0,0,1]
["A",null,0,0,{"$f":"BizDate","v":"2019-06-27"},{"$f":"E3+D3","v":"2019-06-27"},null,"RCB",0,null,{"$f":"\"DF\"","v":"DF"},{"$f":"\"MYR\"","v":"MYR"},0,0,0,1]
["A",null,0,0,{"$f":"BizDate","v":"2019-06-27"},{"$f":"E4+D4","v":"2019-06-27"},null,"RCB",0,null,{"$f":"\"DF\"","v":"DF"},{"$f":"\"MYR\"","v":"MYR"},0,0,0,1]
["A",null,0,0,{"$f":"BizDate","v":"2019-06-27"},{"$f":"E5+D5","v":"2019-06-27"},null,"RCB",0,null,{"$f":"\"DF\"","v":"DF"},{"$f":"\"MYR\"","v":"MYR"},0,0,0,1]
["A",null,0,0,{"$f":"BizDate","v":"2019-06-27"},{"$f":"E6+D6","v":"2019-06-27"},null,"RCB",0,null,{"$f":"\"DF\"","v":"DF"},{"$f":"\"MYR\"","v":"MYR"},0,0,0,1]
["A",null,0,0,{"$f":"BizDate","v":"2019-06-27"},{"$f":"E7+D7","v":"2019-06-27"},null,"RCB",0,null,{"$f":"\"DF\"","v":"DF"},{"$f":"\"MYR\"","v":"MYR"},0,0,0,1]
["A",null,0,0,{"$f":"BizDate","v":"2019-06-27"},{"$f":"E8+D8","v":"2019-06-27"},null,"RCB",0,null,{"$f":"\"DF\"","v":"DF"},{"$f":"\"MYR\"","v":"MYR"},0,0,0,1]
["A",null,0,0,{"$f":"BizDate","v":"2019-06-27"},{"$f":"E9+D9","v":"2019-06-27"},null,"RCB",0,null,{"$f":"\"DF\"","v":"DF"},{"$f":"\"MYR\"","v":"MYR"},0,0,0,1]
["A",null,0,0,{"$f":"BizDate","v":"2019-06-27"},{"$f":"E10+D10","v":"2019-06-27"},null,"RCB",0,null,{"$f":"\"DF\"","v":"DF"},{"$f":"\"MYR\"","v":"MYR"},0,0,0,1]
{"$rows_left_out":11}
{"sheet":"CashFlowDetails","index":9,"n_rows":103,"n_cols":15,"rows_kept":103,"cut":false,"hidden":true,"merged":[[6,0,6,11]]}
[]
[]
[]
[]
[]
[]
["STATEMENT OF BANK BALANCES AS AT 12 JUNE-19"]
["No","Fund Code","Currency","Additional Cash","Capital In/Out","Actual Bank Balance","GL Bank Balance","Effective Bank Balance","Today In Flow","Today Out Flow","Cash Available","Proposed Placement","Proposed Payment/Rollover","Note","Balance After Placement"]
[1,"TABRIC","MYR",0,0,31424.34,31424.84,31424.34,146135.28,0,177559.62,0,0,null,{"$f":"K9-L9-M9","v":177559.62}]
[2,"TACF","MYR",0,0,24152.55,24152.25,24152.55,1968440.51,0,1992593.06,0,0,null,{"$f":"K10-L10-M10","v":1992593.06}]
{"$rows_left_out":94}
{"sheet":"MaturityList","index":10,"n_rows":316,"n_cols":16,"rows_kept":316,"cut":false,"hidden":true,"merged":[]}
[]
[]
[]
[]
[]
[]
[null,null,null,null,null,"CASH MATURITY LIST AS AT 27-Jun-2019"]
["No","Master ID","Fund Code","Currency","Principle","Profit","Total","Cash Available","Rate (%)","Tenor (Day)","Placement Date","Maturity Date","Placement Type","Financial Institution","Bank Account","Placement Entity"]
[1,"CSH*190601599","TADAM","MYR",4045318.38,326.95,4045645.33,41598668.850000001,2.9499999999999997,1,"2019-06-26","2019-06-27","RPC","CIMB",312193264704,"UTMB-TADAM"]
[2,"CSH*190601599","TADAM","MYR",4045318.38,326.95,4045645.33,41598668.850000001,2.9499999999999997,1,"2019-06-26","2019-06-27","RPC","CIMB",514356534764,"UTMB-TADAM"]
{"$rows_left_out":307}
{"sheet":"aaAAABankAccountSdf","index":11,"n_rows":224,"n_cols":4,"rows_kept":224,"cut":false,"hidden":true,"merged":[]}
["qBankAccNo","qCPCode","PaymentEntity","BankGL"]
[114875015,"CITIBANK","BHLB-TAGF",500001]
[114875023,"CITIBANK","BHLB-TACF",500001]
[114875066,"CITIBANK","BHLB-TAAUSI",500000]
[114875074,"CITIBANK","BHLB-TAAUII",500000]
[114875082,"CITIBANK","BHLB-TASCAP",500001]
[115864122,"CITIBANK","MBBT-TAGTF",500001]
[115864157,"CITIBANK","MBBT-TAEURO",500001]
[115864165,"CITIBANK","MBBT-TAGAAF",500001]
[115864173,"CITIBANK","MBBT-TAREITs",500001]
{"$rows_left_out":215}
{"sheet":"aaAAACurrencySdf","index":12,"n_rows":16,"n_cols":1,"rows_kept":16,"cut":false,"hidden":true,"merged":[]}
["qCurrencyCode"]
["AUD"]
["BRL"]
["CNY"]
["EUR"]
["GBP"]
["HKD"]
["IDR"]
["JPY"]
["KRW"]
{"$rows_left_out":7}
{"sheet":"CashFlowData","index":13,"n_rows":96,"n_cols":16,"rows_kept":96,"cut":false,"hidden":true,"merged":[]}
["qFundCode","qCurrencyCode","AdditionalCash","ActualBankBalance","GLBankBalance","EffectiveBankBalance","Inflow","Outflow","CashAvailable","CapitalInOut","PlaceFlag","UploadedFlag","KeyInBy","KeyInDate","FundName","BalanceAfterPlacement"]
["TABRIC","MYR",0,31424.34,31424.84,31424.34,146135.28,0,177559.62,0,3,"F","idarosna                 ","2019-06-27T10:00:48","TA Bric & Emerging Markets Fund",177559.62]
["TACF","MYR",0,24152.55,24152.25,24152.55,1968440.51,0,1992593.06,0,3,"F","idarosna                 ","2019-06-27T10:00:48","TA Comet Fund",1992593.06]
["TADO","MYR",0,31329.73,31334.83,31329.73,847281.92,0,878611.65,0,3,"F","idarosna                 ","2019-06-27T10:00:48","TA Dana Optimix",878611.65]
["TAGF","MYR",0,47579.3,47579.41,47579.3,3375694.02,0,3423273.32,0,3,"F","idarosna                 ","2019-06-27T10:00:48","TA Growth Fund",3423273.32]
["TAIB","MYR",0,26867.75,29516.55,26867.75,2032394.92,0,2059262.67,0,3,"F","idarosna                 ","2019-06-27T10:00:48","TA Asia Pacific Islamic Balanced Fund",2059262.67]
["TAICP","MYR",0,47821.94,47822.04,47821.94,14782206.43,0,14830028.369999999,0,3,"F","idarosna                 ","2019-06-27T10:00:48","TA Islamic CashPLUS Fund",14830028.369999999]
["TASCAP","MYR",0,25573.85,25582.85,25573.85,496893.76,0,522467.61,0,3,"F","idarosna                 ","2019-06-27T10:00:48","TA Small Cap Fund",522467.61]
["TRFIF","MYR",0,60081.41,60081.51,60081.41,0,0,60081.41,0,3,"F","idarosna                 ","2019-06-27T10:00:48","TA Total Return Fixed Income Fund",60081.41]
["TADART","MYR",0,23025.31,23025.31,23025.31,882697.65,0,905722.96,0,3,"F","idarosna                 ","2019-06-27T10:00:48","TA DANA PRINCIPAL PRESERVATION ROBOTIC THEME",905722.96]
{"$rows_left_out":87}
{"sheet":"MaturityData","index":14,"n_rows":309,"n_cols":14,"rows_kept":309,"cut":false,"hidden":true,"merged":[]}
["qEventTrxID","qFundCode","FundName","FI","UnitFaceValue","Interest","Rate","Currency","PlacementType","Tenor","qBankAccNo","MaturityDate","PurchaseDate","PaymentEntityLoc"]
["CSH*190601599","TADAM","TA Dynamic Absolute Mandate","CIMB",4045318.38,326.95,2.9499999999999997,"MYR","RPC",1,312193264704,"2019-06-27","2019-06-26","UTMB-TADAM"]
["CSH*190601599","TADAM","TA Dynamic Absolute Mandate","CIMB",4045318.38,326.95,2.9499999999999997,"MYR","RPC",1,514356534764,"2019-06-27","2019-06-26","UTMB-TADAM"]
["CSH*190601599","TADAM","TA Dynamic Absolute Mandate","CIMB",4045318.38,326.95,2.9499999999999997,"MYR","RPC",1,"TADAM-HKD","2019-06-27","2019-06-26","UTMB-TADAM"]
["CSH*190601599","TADAM","TA Dynamic Absolute Mandate","CIMB",4045318.38,326.95,2.9499999999999997,"MYR","RPC",1,"TADAM-SGD","2019-06-27","2019-06-26","UTMB-TADAM"]
["CSH*190601599","TADAM","TA Dynamic Absolute Mandate","CIMB",4045318.38,326.95,2.9499999999999997,"MYR","RPC",1,"TADAM-USD","2019-06-27","2019-06-26","UTMB-TADAM"]
["CSH*190601437","TADAM","TA Dynamic Absolute Mandate","CIMB",4044991.46,326.92,2.9499999999999997,"MYR","RPC",null,312193264704,"2019-06-27",null,"UTMB-TADAM"]
["CSH*190601437","TADAM","TA Dynamic Absolute Mandate","CIMB",4044991.46,326.92,2.9499999999999997,"MYR","RPC",null,514356534764,"2019-06-27",null,"UTMB-TADAM"]
["CSH*190601437","TADAM","TA Dynamic Absolute Mandate","CIMB",4044991.46,326.92,2.9499999999999997,"MYR","RPC",null,"TADAM-HKD","2019-06-27",null,"UTMB-TADAM"]
["CSH*190601437","TADAM","TA Dynamic Absolute Mandate","CIMB",4044991.46,326.92,2.9499999999999997,"MYR","RPC",null,"TADAM-SGD","2019-06-27",null,"UTMB-TADAM"]
{"$rows_left_out":299}