{"text_format":"1","workbook":"xlsx","n_sheets":8,"sheets":["Main","InTrn","InFund","InPortfolio","Hldg","PortVal","Trade","Depo"],"not_rendered":{"charts":0,"images":7,"macros":1,"external_links":0,"defined_names":67,"comments":0,"pivot_tables":4},"unopened":[],"bounds":{"document_bytes":16777216,"sheet_cells":100000,"rows_first":2000,"rows_last":500,"rows_between":2000,"halvings":0,"cell_chars":16384,"cell_head_chars":4096},"cells_cut":0,"cells_raw":0,"read":"whole","date_system":"1900"}

{"sheet":"Main","index":0,"n_rows":15,"n_cols":9,"rows_kept":15,"cut":false,"hidden":false,"merged":[[1,0,1,2]]}
[]
["MSIG-EQ Daily Report"]
[]
[null,null,null,null,null,"* Please sheet(s) to print",null,"* For pivot table listing control"]
[null,null,null,null,null,"Sheet","YES/NO","Start Row","Last Col"]
[null,"Company :","NOMURA ASSET MANAGEMENT MALAYSIA SDN BHD",{"$f":"VLOOKUP(FundCode,InFund!A2:G75,7,0)","v":"NM"},null,"Hldg","YES",6,20]
[null,"Fund :","MSIG-EQ",{"$f":"VLOOKUP(FundCode,InFund!A2:G76,6,0)","v":"2021-12-31"},null,"PortVal","YES",6,19]
[null,"Fund Name :",{"$f":"VLOOKUP(FundCode,InFund!A2:G75,2,0)","v":"NOMURA FOR MSIG INSURANCE (MALAYSIA)BHD (EQ)"},null,null,"Trade","YES",6,21]
[null,"Start Date :",{"$f":"EndDate","v":"2022-03-03"},{"$f":"DATE(YEAR(ValueDate), MONTH(ValueDate), 0)","v":"2022-02-28"},null,"Depo","YES",8,8]
[null,"End Date:","2022-03-03"]
{"$rows_left_out":6}
{"sheet":"InTrn","index":1,"n_rows":8,"n_cols":98,"rows_kept":8,"cut":false,"hidden":false,"merged":[]}
["qEventTrxID","qTrnCode","qProductType","qFundCode","TradeDate","ValueDate","PayDate","RevDate","AccDate","TranType","qCountryID","PosTrnMatDt","qCPCode","SettCurrency","qStockCode","ExchgRateSF","TranYTM","UnitFaceValue","CostSC","CostFC","SCGrossProceed","SCNetProceed","TranProceed","TranGains","BrokerageFee","ClearingFee","StampDuty","CustodianFeeCC","CustodianFeeFC","TranIncome","TranBuyCapital","TranFXGnL","FundName","FundCurrency","StockCurrency","StockName","UTFlag","Frequency","Coupon","BndSecMatDt","LCD","NCD","ExcelBasis","qBondType","BndTypeDesc","Basis","CshCPCode","qCshType","CPName","CshCP","CshTypeDesc","StkCcyDesc","FundCcyDesc","CountryName","StockDesc","TranPrice","Description","qManagerCode","Reversalflag","qAssetClass","Exchange","qStockType","qKLSESector","PELoc","PEFor","TranExpenses","qIssuerCode","IssuerName","CrossTrade","ContractNote","qAssetAccType","TranPreAcq","qMasterID","TranAmortAccre","Remarks","ExpFlag","VAT","GSTRevCharge","Islamic","Rating","ACCDescription","qInvType","ISINCode","BursaCode","IssuedSize","LocalStockCode","IssueDate","Ratio","AccruedInterestSC","AmortAccreationSC","BookValue","PurchaseDate","SPeriod","CummFV","FCNetProceed","FCGrossProceed","CshPurchaseDt","UnitTrust"]
["EQT*220300270","SS","EQT","MSIG-EQ","2022-03-03","2022-03-03","2022-03-07","3000-01-01","2022-03-03","SELL","MY","3000-01-01","HLB","MYR",6075745,1,0,-100000,-449301.63,-449301.63,508170,506999.95,0,-57698.32,254.09,0,763.5,0,0,0,-449301.63,0,"NOMURA FOR MSIG INSURANCE (MALAYSIA)BHD (EQ)","MYR","MYR","CIMB GROUP HOLDINGS BHD",0,null,null,null,null,null,null,null,null,null,null,null,"HONG LEONG INVESTMENT BANK","HLB",null,"Ringgit Malaysia","Ringgit Malaysia","MALAYSIA","CIMB GROUP HOLDINGS BHD",5.0816999999999997,"CIMB GROUP HOLDINGS BHD","NAMM",0,"EQT","XKLS","ORD",4010,"CITIT-MSIG-EQ","CITIT-MSIG-EQ",0,"N/A","N/A",0,null,"010",0,"MSIG-EQ*6075745",0,null,false,0,0,"00:00:00",null,"Local Listed Share","FVTPL","MYL1023OO000",1023,null,null,null,-9.2700000000000005E-2,0,"00:00:00",4842267.4000000004,44319,"cur",880732,"3288-02-10T22:48:00",508170,null,0]
["EQT*220300262","SS","EQT","MSIG-EQ","2022-03-03","2022-03-03","2022-03-07","3000-01-01","2022-03-03","SELL","MY","3000-01-01","MSS","MYR",6113429,1,0,-1060000,-1472201.97,-1472201.97,1028518,1024895.27,0,447306.7,2314.17,0,1000,0,0,0,-1472201.97,0,"NOMURA FOR MSIG INSURANCE (MALAYSIA)BHD (EQ)","MYR","MYR","V.S. INDUSTRY BERHAD",0,null,null,null,null,null,null,null,null,null,null,null,"MAYBANK INVESTMENT BANK",null,null,"Ringgit Malaysia","Ringgit Malaysia","MALAYSIA","V.S. INDUSTRY BERHAD",0.97030000000000005,"V.S. INDUSTRY BERHAD","NAMM",0,"EQT","XKLS","ORD",4520,"CITIT-MSIG-EQ","CITIT-MSIG-EQ",0,"N/A","N/A",0,null,"010",0,"MSIG-EQ*6113429",0,null,false,0,0,"00:00:00",null,"Local Listed Share","FVTPL","MYL6963OO002",6963,null,null,null,-1,0,"00:00:00",1472201.97,44322,"cur",0,"4706-01-24T06:28:48",1028518,null,0]
["EQC*220300045","SI","EQT","MSIG-EQ","2022-03-03","2022-03-03","2022-03-16","3000-01-01","2022-03-03","SI","MY","3000-01-01","N/A","MYR",6557997,1,0,0,0,0,24276,24276,0,-24276,0,24276,0,0,0,0,0,0,"NOMURA FOR MSIG INSURANCE (MALAYSIA)BHD (EQ)","MYR","MYR","MISC BHD",0,null,null,null,null,null,null,null,null,null,null,null,"NOT APPLICABLE",null,null,"Ringgit Malaysia","Ringgit Malaysia","MALAYSIA","MISC BHD",0.12,"MISC BHD","NAMM",0,"EQT","XKLS","ORD",2030,"CITIT-MSIG-EQ","CITIT-MSIG-EQ",0,"N/A","N/A",0,null,"010",0,"MSIG-EQ*6557997",0,"J004469481",false,0,0,"00:00:00",null,"Local Listed Share","FVTPL","MYL3816OO005",3816,null,null,null,0,0,"00:00:00",1299370.74,44319,"cur",202300,"1966-06-18","1966-06-18",null,0]
["EQC*220300039","SI","EQT","MSIG-EQ","2022-03-03","2022-03-03","2022-04-01","3000-01-01","2022-03-03","SI","MY","3000-01-01","N/A","MYR","BN4JBJ9",1,0,0,0,0,4329.8999999999996,4329.8999999999996,0,-4329.8999999999996,0,4329.8999999999996,0,0,0,0,0,0,"NOMURA FOR MSIG INSURANCE (MALAYSIA)BHD (EQ)","MYR","MYR","MR DIY GROUP M BHD",0,null,null,null,null,null,null,null,null,null,null,null,"NOT APPLICABLE",null,null,"Ringgit Malaysia","Ringgit Malaysia","MALAYSIA","MR DIY GROUP M BHD",8.9999999999999993E-3,"MR DIY GROUP M BHD","NAMM",0,"EQT","XKLS","ORD",2550,"CITIT-MSIG-EQ","CITIT-MSIG-EQ",0,"N/A","N/A",0,null,"010",0,"MSIG-EQ*BN4JBJ9",0,"J004469385",false,0,0,"00:00:00",null,"Local Listed Share","FVTPL","MYL5296OO008",5296,null,null,null,0,0,"00:00:00",1428704.43,44319,"cur",481100,"1911-11-07T21:36:00","1911-11-07T21:36:00",null,0]
["CSH*220300170","RM","CSH","MSIG-EQ","2022-03-03","2022-03-03","2022-03-03","3000-01-01","2022-03-03","RM","MY","2022-03-03","CBB","MYR","RPF*MYR*CBB",1,1.7000000000000001E-2,-15036000,-15036000,-15036000,15036700.310000001,15036700.310000001,0,0,0,0,0,0,0,-700.31,-15036000,0,"NOMURA FOR MSIG INSURANCE (MALAYSIA)BHD (EQ)","MYR","MYR","RPF*MYR*CBB",0,null,null,null,null,null,null,null,null,365,"CBB","RPF","CIMB BANK BERHAD","CBB","Short Term Placement","Ringgit Malaysia","Ringgit Malaysia","MALAYSIA","RPF*MYR*CBB",1,"RPF*MYR*CBB","NAMM",0,"CSH","XTKS","FXE",0,"CITIT-MSIG-EQ","CITIT-MSIG-EQ",0,"N/A","N/A",0," ","210",0,"CSH*220300105",0,"SOD Maturity",false,0,0,"00:00:00",null,"Local Money Market Placement","FVTPL","N/A",null,null,null,null,null,null,null,null,44622,"cur",0,15036700.310000001,15036700.310000001,"2022-03-02",0]
["CSH*220300196","RP","CSH","MSIG-EQ","2022-03-03","2022-03-03","2022-03-03","3000-01-01","2022-03-03","RP","MY","2022-03-04","CBB","MYR","RPF*MYR*CBB",1,1.7000000000000001E-2,15037000,15037000,15037000,-15037000,-15037000,0,0,0,0,0,0,0,0,15037000,0,"NOMURA FOR MSIG INSURANCE (MALAYSIA)BHD (EQ)","MYR","MYR","RPF*MYR*CBB",0,null,null,null,null,null,null,null,null,365,"CBB","RPF","CIMB BANK BERHAD","CBB","Short Term Placement","Ringgit Malaysia","Ringgit Malaysia","MALAYSIA","RPF*MYR*CBB",1,"RPF*MYR*CBB","NAMM",0,"CSH","XTKS","FXE",0,"CITIT-MSIG-EQ","CITIT-MSIG-EQ",0,"N/A","N/A",0," ","210",0,"CSH*220300196",0,null,false,0,0,"00:00:00",null,"Local Money Market Placement","FVTPL","N/A",null,null,null,null,null,null,null,null,44623,"cur",15037000,-15037000,-15037000,"2022-03-03",0]
[null,"SP",null,null,null,null,null,null,null,"BUY"]

{"sheet":"InFund","index":2,"n_rows":63,"n_cols":9,"rows_kept":63,"cut":false,"hidden":false,"merged":[]}
["qFundCode","FundName","qFundType","Islamic","FinanceYrStart","FinanceYrEnd","qCompanyID","RollEOYFlag","Fundcurrency"]
["AJC-MASHAREQ","ALJAZIRA JAPANESE EQUITY FUND",1,1,"2013-03-01","2020-12-31","NI",1,"USD"]
["BNM-ICLIF","IFM ICLIF SHARIAH EQUITY NOMURA-I",1,1,"2013-08-26","2020-12-31","NI",1,"MYR"]
["BNM-ICLIF-FI2","IFM ICLIF CORP BOND NOMURA",2,0,"2021-01-04","2020-12-31","NM",1,"MYR"]
["BNM-INCEIF","IFM INCEIF SHARIAH EQUITY NOMURA-I",1,1,"2013-08-26","2020-12-31","NI",1,"MYR"]
["BNM-INCEIF-FI","IFM INCEIF SUKUK NOMURA-I",2,1,"2016-11-28","2020-12-31","NI",1,"MYR"]
["BNM-MEDF-FI","IFM MEDF CORP BOND NOMURA",2,0,"2016-11-28","2020-12-31","NM",1,"MYR"]
["BNMMF","IFM MEDF CONV EQUITY NOMURA",1,0,"2011-08-08","2020-12-31","NM",1,"MYR"]
["BNM-NTF","IFM NTF CONV EQUITY NOMURA",1,0,"2020-09-17","2020-12-31","NM",1,"MYR"]
["BNM-NTF-FI","IFM NTF CORP BOND NOMURA",2,0,"2016-11-28","2020-12-31","NM",1,"MYR"]
{"$rows_left_out":54}
{"sheet":"InPortfolio","index":3,"n_rows":60,"n_cols":46,"rows_kept":60,"cut":false,"hidden":false,"merged":[]}
["qFundCode","qProductType","qStockCode","qMasterID","UnrealisedGainsStock","UnrealisedGainsExchg","MarketValueFC","MarketValueSC","MaturityDate","UnitFaceValue","PriceCurr","ExchgRate","AccruedInterest","AmortAccreation","CostFC","CostSC","ExPreAcq","ExPreAcqSC","fRefPrice","PurchaseYTM","PurchaseDate","ValueYTM","BookValue1Int","ValGains","MarketValueDate","PreAcqSC","PreAcqFC","LastMarketValue","LCD","NCD","Diminution","qInvType","CheckValReturn","AmortAccreationSC","TIncome","PercNAV","NAV","CountryName","StockCurrency","ISINCode","BursaCode","StockName","SectorName","DivReceivable","ProductGrp","qCountryID"]
["MSIG-EQ","CSH","RPF*MYR*CBB","CSH*220300196",0,0,15037700.35,15037700.35,"2022-03-04",15037000,0,1,700.35,0,15037000,15037000,15037700.35,15037700.35,1,1.7000000000000001E-2,"2022-03-03",0,15037700.35,0,"2022-03-03",0,0,0,"3000-01-01","3000-01-01",0,"FVTPL",0,0,0,14.801719637736181,101594279.03,"MALAYSIA","MYR","N/A",null,"RPF*MYR*CBB","UNKNOWN",0,"CSH","MY"]
["MSIG-EQ","EQT",6075745,"MSIG-EQ*6075745",534590.01,0,4491733.2,4491733.2,"3000-01-01",880732,5.0999999999999996,1,0,0,3957143.19,3957143.19,3957143.19,3957143.19,0,0,"2021-05-03",0,3957143.19,0,"2022-03-03",0,0,0,"3000-01-01","3000-01-01",0,"FVTPL",0,0,0,4.4212461989849112,101594279.03,"MALAYSIA","MYR","MYL1023OO000","1023","CIMB GROUP HOLDINGS BHD","FINANCIAL SERVICES",0,"EQT","MY"]
["MSIG-EQ","EQT",6086242,"MSIG-EQ*6086242",-98919.03,0,2648700,2648700,"3000-01-01",654000,4.05,1,0,0,2747619.03,2747619.03,2747619.03,2747619.03,0,0,"2021-05-06",0,2747619.03,52320,"2022-03-03",0,0,0,"3000-01-01","3000-01-01",0,"FVTPL",0,0,0,2.6071349935146046,101594279.03,"MALAYSIA","MYR","MYL6947OO005","6947","DIGI.COM BHD","TELECOMMUNICATIONS & MEDIA",25506,"EQT","MY"]
["MSIG-EQ","EQT",6188193,"MSIG-EQ*6188193",195244.56,0,2234490,2234490,"3000-01-01",353000,6.33,1,0,0,2039245.44,2039245.44,2039245.44,2039245.44,0,0,"2021-05-03",0,2039245.44,-10590,"2022-03-03",0,0,0,"3000-01-01","3000-01-01",0,"FVTPL",0,0,0,2.1994250279980552,101594279.03,"MALAYSIA","MYR","MYL5014OO005","5014","MALAYSIA AIRPORTS HLDGS BHD","TRANSPORTATION & LOGISTICS",0,"EQT","MY"]
["MSIG-EQ","EQT",6244675,"MSIG-EQ*6244675",181447.04000000001,0,2806057.7,2806057.7,"3000-01-01",475603,5.9,1,0,0,2624610.66,2624610.66,2624610.66,2624610.66,0,0,"2021-05-03",0,2624610.66,14268.09,"2022-03-03",0,0,0,"3000-01-01","3000-01-01",0,"FVTPL",0,0,0,2.7620233410696216,101594279.03,"MALAYSIA","MYR","MYL1066OO009","1066","RHB BANK BHD","FINANCIAL SERVICES",0,"EQT","MY"]
["MSIG-EQ","EQT",6336538,"MSIG-EQ*6336538",-18436.55,0,1708200,1708200,"3000-01-01",390000,4.38,1,0,0,1726636.55,1726636.55,1726636.55,1726636.55,0,0,"2021-11-09",0,1726636.55,3900,"2022-03-03",0,0,0,"3000-01-01","3000-01-01",0,"FVTPL",0,0,0,1.6813938898031668,101594279.03,"MALAYSIA","MYR","MYL5031OO009","5031","TIME DOTCOM BHD","TELECOMMUNICATIONS & MEDIA",0,"EQT","MY"]
["MSIG-EQ","EQT",6397803,"MSIG-EQ*6397803",-149436.28,0,1464620,1464620,"3000-01-01",67000,21.86,1,0,0,1614056.28,1614056.28,1614056.28,1614056.28,0,0,"2021-06-08",0,1614056.28,-1340,"2022-03-03",0,0,0,"3000-01-01","3000-01-01",0,"FVTPL",0,0,0,1.441636294862144,101594279.03,"MALAYSIA","MYR","MYL3255OO006","3255","HEINEKEN MALAYSIA BHD","CONSUMER PRODUCTS & SERVICES",0,"EQT","MY"]
["MSIG-EQ","EQT",6436892,"MSIG-EQ*6436892",302448.03000000003,0,3540992,3540992,"3000-01-01",172900,20.48,1,0,0,3238543.97,3238543.97,3238543.97,3238543.97,0,0,"2021-05-03",0,3238543.97,14632.59,"2022-03-03",0,0,0,"3000-01-01","3000-01-01",0,"FVTPL",0,0,0,3.4854246063938037,101594279.03,"MALAYSIA","MYR","MYL5819OO007","5819","HONG LEONG BANK BERHAD","FINANCIAL SERVICES",0,"EQT","MY"]
["MSIG-EQ","EQT",6497446,"MSIG-EQ*6497446",250838.14,0,1708100,1708100,"3000-01-01",58900,29,1,0,0,1457261.86,1457261.86,1457261.86,1457261.86,0,0,"2021-05-03",0,1457261.86,16594.189999999999,"2022-03-03",0,0,0,"3000-01-01","3000-01-01",0,"FVTPL",0,0,0,1.6812954590638036,101594279.03,"MALAYSIA","MYR","MYL2445OO004","2445","KUALA LUMPUR KEPONG BHD","PLANTATION",0,"EQT","MY"]
{"$rows_left_out":51}
{"sheet":"Hldg","index":4,"n_rows":44,"n_cols":34,"rows_kept":44,"cut":false,"hidden":false,"merged":[]}
[{"$f":"IF(W1=\"\",\"\",IF(W1=\"Grand Total\",\"NAML Equity Total\",\"NAML Equity\"))","v":""},{"$f":"IF(OR(W1=\"\",W1=\"Grand Total\"),\"\",IF(W1=\"EQT\",\"Stock\",\"Warrant\"))","v":""},{"$f":"IF(X1=\"\",\"\",IF(X1=\"MY\",\"MYS\",X1))","v":""},{"$f":"IF(Y1=\"\",\"\",Y1)","v":""},{"$f":"IF(AA1=\"\",\"\",AA1)","v":""},{"$f":"IF(AB1=\"\",\"\",AB1)","v":""},{"$f":"IF(AC1=\"\",\"\",AC1)","v":""},{"$f":"IF(AD1=\"\",\"\",AD1)","v":""},{"$f":"IF(Z1=\"\",\"\",Z1)","v":""},{"$f":"IF(OR(W1=\"\",W1=\"Grand Total\"),\"\",EndDate)","v":""},{"$f":"IF(AE1=\"\",\"\",AE1)","v":""},{"$f":"IF(OR(W1=\"\",W1=\"Grand Total\"),\"\",IF(AE1=0,0,ROUND(AF1/AE1,4)))","v":""},{"$f":"IF(AF1=\"\",\"\",AF1)","v":""},{"$f":"IF(OR(W1=\"\",W1=\"Grand Total\"),\"\",IF(AE1=0,0,ROUND(AG1/AE1,4)))","v":""},{"$f":"IF(AG1=\"\",\"\",AG1)","v":""},{"$f":"IF(AG1=\"\",\"\",AG1+AH1)","v":""},{"$f":"IF(AH1=\"\",\"\",AH1)","v":""},{"$f":"IF(O1=\"\",\"\",O1-M1)","v":""},{"$f":"IF(OR(O1=\"\",W1=\"Grand Total\"),\"\",IF(M1=0,0,ROUND((R1/M1)*100,2)))","v":""},{"$f":"IF(O1=\"\",\"\",IF(W1=\"Grand Total\",100,ROUND((O1/MAX(O:O))*100,2)))","v":""}]
["MSIG"]
["PORTFOLIO HOLDING AS OF",null,{"$f":"EndDate","v":"2022-03-03"},null,null,null,null,null,null,null,null,null,null,null,null,null,null,null,null,null,null,null,"qProductType","EQT"]
[]
["Classificatican","Category","Country","Currency","Sedol code","ISIN Code","Bursa Code","Issue name","Sector","Position Date","Quantity","Unit Cost","Book Cost","Market Price","Market Value","Market Value with Dividend Receivable","Dividend Receivable","Unrealised Gain/Loss","Unrealised Return \n(%)","Weight Market Value vs Asset Class\n(%)",null,null,"Row Labels","qCountryID","StockCurrency","SectorName","qStockCode","ISINCode","BursaCode","StockName","Sum of UnitFaceValue","Sum of CostFC","Sum of MarketValueFC","Sum of DivReceivable"]
["NAML Equity","Stock","MYS","MYR","BKRQ635","MYL5293OO005","5293","AME ELITE CONSORTIUM BHD","CONSTRUCTION","2022-03-03",426900,1.6980999999999999,724932.13,1.7,725730,725730,0,797.86999999999534,0.11,0.86,null,null,"EQT","MY","MYR","CONSTRUCTION","BKRQ635","MYL5293OO005","5293","AME ELITE CONSORTIUM BHD",426900,724932.13,725730,0]
["NAML Equity","Stock","MYS","MYR",6397803,"MYL3255OO006","3255","HEINEKEN MALAYSIA BHD","CONSUMER PRODUCTS & SERVICES","2022-03-03",67000,24.090399999999999,1614056.28,21.86,1464620,1464620,0,-149436.28000000003,-9.26,1.73,null,null,"EQT","MY","MYR","CONSUMER PRODUCTS & SERVICES",6397803,"MYL3255OO006","3255","HEINEKEN MALAYSIA BHD",67000,1614056.28,1464620,0]
["NAML Equity","Stock","MYS","MYR","B1VXJL8","MYL3182OO002","3182","GENTING BHD","CONSUMER PRODUCTS & SERVICES","2022-03-03",674400,4.4863999999999997,3025659.81,4.67,3149448,3149448,0,123788.18999999994,4.09,3.72,null,null,"EQT","MY","MYR","CONSUMER PRODUCTS & SERVICES","B1VXJL8","MYL3182OO002","3182","GENTING BHD",674400,3025659.81,3149448,0]
["NAML Equity","Stock","MYS","MYR","B29TTR1","MYL4197OO009","4197","SIME DARBY BERHAD","CONSUMER PRODUCTS & SERVICES","2022-03-03",1142200,2.2014,2514401.7200000002,2.34,2672748,2672748,0,158346.2799999998,6.3,3.15,null,null,"EQT","MY","MYR","CONSUMER PRODUCTS & SERVICES","B29TTR1","MYL4197OO009","4197","SIME DARBY BERHAD",1142200,2514401.7200000002,2672748,0]
["NAML Equity","Stock","MYS","MYR","B09FGC9","MYL2836OO004","2836","CARLSBERG BREWERY MALAYSIA B","CONSUMER PRODUCTS & SERVICES","2022-03-03",69000,22.5776,1557853.17,20.22,1395180,1395180,0,-162673.16999999993,-10.44,1.65,null,null,"EQT","MY","MYR","CONSUMER PRODUCTS & SERVICES","B09FGC9","MYL2836OO004","2836","CARLSBERG BREWERY MALAYSIA B",69000,1557853.17,1395180,0]
{"$rows_left_out":35}
{"sheet":"PortVal","index":5,"n_rows":53,"n_cols":34,"rows_kept":53,"cut":false,"hidden":false,"merged":[]}
[{"$f":"IF(W1=\"\",\"\",IF(RIGHT(W1,5)=\"Total\",\"NAML Equity Total\",\"NAML Equity\"))","v":""},{"$f":"IF(OR(W1=\"\",W1=\"Grand Total\"),\"\",IF(W1=\"EQT Total\",\"Stock Total\",IF(W1=\"WRT Total\",\"Warrant Total\",IF(W1=\"EQT\",\"Stock\",\"Warrant\"))))","v":""},{"$f":"IF(X1=\"\",\"\",IF(X1=\"MY\",\"MYS\",X1))","v":""},{"$f":"IF(Y1=\"\",\"\",Y1)","v":""},{"$f":"IF(AA1=\"\",\"\",AA1)","v":""},{"$f":"IF(AB1=\"\",\"\",AB1)","v":""},{"$f":"IF(AC1=\"\",\"\",AC1)","v":""},{"$f":"IF(AD1=\"\",\"\",AD1)","v":""},{"$f":"IF(Z1=\"\",\"\",Z1)","v":""},{"$f":"IF(OR(W1=\"\",RIGHT(W1,5)=\"Total\"),\"\",EndDate)","v":""},{"$f":"IF(AE1=\"\",\"\",AE1)","v":""},{"$f":"IF(OR(W1=\"\",RIGHT(W1,5)=\"Total\"),\"\",IF(AE1=0,0,ROUND(AF1/AE1,4)))","v":""},{"$f":"IF(AF1=\"\",\"\",AF1)","v":""},{"$f":"IF(OR(W1=\"\",RIGHT(W1,5)=\"Total\"),\"\",IF(AE1=0,0,ROUND(AG1/AE1,4)))","v":""},{"$f":"IF(AG1=\"\",\"\",AG1)","v":""},{"$f":"IF(AG1=\"\",\"\",AG1+AH1)","v":""},{"$f":"IF(AH1=\"\",\"\",AH1)","v":""},{"$f":"IF(O1=\"\",\"\",O1-M1)","v":""},{"$f":"IF(O1=\"\",\"\",ROUND((O1/MAX(O:O))*100,2))","v":""}]
["MSIG"]
["PORTFOLIO HOLDING AS OF",null,{"$f":"EndDate","v":"2022-03-03"},null,null,null,null,null,null,null,null,null,null,null,null,null,null,null,null,null,null,null,"qProductType","EQT"]
[]
["Classificatican","Category","Country","Currency","Sedol code","ISIN Code","Bursa Code","Issue name","Sector","Position Date","Quantity","Unit Cost","Book Cost","Market Price","Market Value","Market Value with Dividend Receivable","Dividend Receivable","Unrealised Gain/Loss","Weight Market Value vs Asset Class\n(%)",null,null,null,"Row Labels","qCountryID","StockCurrency","SectorName","qStockCode","ISINCode","BursaCode","StockName","Sum of UnitFaceValue","Sum of CostFC","Sum of MarketValueFC","Sum of DivReceivable"]
["NAML Equity","Stock","MYS","MYR","BKRQ635","MYL5293OO005","5293","AME ELITE CONSORTIUM BHD","CONSTRUCTION","2022-03-03",426900,1.6980999999999999,724932.13,1.7,725730,725730,0,797.86999999999534,0.71,null,null,null,"EQT","MY","MYR","CONSTRUCTION","BKRQ635","MYL5293OO005","5293","AME ELITE CONSORTIUM BHD",426900,724932.13,725730,0]
["NAML Equity","Stock","MYS","MYR",6397803,"MYL3255OO006","3255","HEINEKEN MALAYSIA BHD","CONSUMER PRODUCTS & SERVICES","2022-03-03",67000,24.090399999999999,1614056.28,21.86,1464620,1464620,0,-149436.28000000003,1.44,null,null,null,"EQT","MY","MYR","CONSUMER PRODUCTS & SERVICES",6397803,"MYL3255OO006","3255","HEINEKEN MALAYSIA BHD",67000,1614056.28,1464620,0]
["NAML Equity","Stock","MYS","MYR","B1VXJL8","MYL3182OO002","3182","GENTING BHD","CONSUMER PRODUCTS & SERVICES","2022-03-03",674400,4.4863999999999997,3025659.81,4.67,3149448,3149448,0,123788.18999999994,3.1,null,null,null,"EQT","MY","MYR","CONSUMER PRODUCTS & SERVICES","B1VXJL8","MYL3182OO002","3182","GENTING BHD",674400,3025659.81,3149448,0]
["NAML Equity","Stock","MYS","MYR","B29TTR1","MYL4197OO009","4197","SIME DARBY BERHAD","CONSUMER PRODUCTS & SERVICES","2022-03-03",1142200,2.2014,2514401.7200000002,2.34,2672748,2672748,0,158346.2799999998,2.63,null,null,null,"EQT","MY","MYR","CONSUMER PRODUCTS & SERVICES","B29TTR1","MYL4197OO009","4197","SIME DARBY BERHAD",1142200,2514401.7200000002,2672748,0]
["NAML Equity","Stock","MYS","MYR","B09FGC9","MYL2836OO004","2836","CARLSBERG BREWERY MALAYSIA B","CONSUMER PRODUCTS & SERVICES","2022-03-03",69000,22.5776,1557853.17,20.22,1395180,1395180,0,-162673.16999999993,1.37,null,null,null,"EQT","MY","MYR","CONSUMER PRODUCTS & SERVICES","B09FGC9","MYL2836OO004","2836","CARLSBERG BREWERY MALAYSIA B",69000,1557853.17,1395180,0]
{"$rows_left_out":44}
{"sheet":"Trade","index":6,"n_rows":12,"n_cols":40,"rows_kept":12,"cut":false,"hidden":false,"merged":[]}
[{"$f":"IF(W1=\"\",\"\",IF(AH1=\"COAC\",\"PYIN\",W1))","v":""},{"$f":"IF(OR(X1=\"\",X1=\"(blank)\"),\"\",X1)","v":""},{"$f":"IF(OR(Y1=\"\",Y1=\"(blank)\"),\"\",Y1)","v":""},{"$f":"IF(OR(Z1=\"\",Z1=\"(blank)\"),\"\",Z1)","v":""},{"$f":"IF(AA1=\"\",\"\",IF(AA1=\"(blank)\",\"\",AA1))","v":""},{"$f":"IF(OR(AB1=\"\",AB1=\"(blank)\"),\"\",AB1)","v":""},{"$f":"IF(OR(AC1=\"\",AC1=\"(blank)\"),\"\",AC1)","v":""},{"$f":"IF(OR(AD1=\"\",AD1=\"(blank)\"),\"\",AD1)","v":""},{"$f":"IF(OR(AE1=\"\",AE1=\"(blank)\"),\"\",IF(AE1=\"010\",\"Stocks\",\"Warrant\"))","v":""},{"$f":"IF(OR(AF1=\"\",AF1=\"(blank)\"),\"\",IF(AF1=\"MY\",\"MYS\",AF1))","v":""},{"$f":"IF(OR(AG1=\"\",AG1=\"(blank)\"),\"\",AG1)","v":""},{"$f":"IF(OR(W1=\"\",W1=\"(blank)\"),\"\",IF(RIGHT(W1,5)=\"Total\",\"\",W1))","v":""},{"$f":"IF(OR(AH1=\"\",AH1=\"(blank)\"),\"\",IF(AH1=\"COAC\",\"CORPORATE ACTION\",AH1))","v":""},{"$f":"IF(AJ1=\"\",\"\",ABS(AJ1))","v":""},{"$f":"IF(OR(AI1=\"\",AI1=\"(blank)\"),\"\",AI1)","v":""},{"$f":"IF(AK1=\"\",\"\",ABS(AK1))","v":""},{"$f":"IF(AL1=\"\",\"\",ABS(AL1))","v":""},{"$f":"IF(OR(W1=\"\",P1=\"\"),\"\",ROUND(IF(LEFT(W1,3)=\"BUY\",ABS(S1)-ABS(P1)-Q1,ABS(P1)-ABS(S1)-Q1),2))","v":""},{"$f":"IF(AM1=\"\",\"\",ABS(AM1))","v":""},{"$f":"IF(AN1=\"\",\"\",IF(LEFT(W1,3)=\"BUY\",0,ABS(AN1)))","v":""},{"$f":"IF(AM1=\"\",\"\",ABS(AM1)-ABS(AN1))","v":""}]
["MSIG"]
["TRANSACTION FROM ",null,{"$f":"ValueDate","v":"2022-03-03"},"TO",{"$f":"EndDate","v":"2022-03-03"},null,null,null,null,null,null,null,null,null,null,null,null,null,null,null,null,null,"qTrnCode","(Multiple Items)"]
[]
["Trade type","Sedol code","ISIN Code","Bursa Code","Issue Name","Trade Date","Settlement Date","prt_sname_e","SecType(2)","Country","Currency","TradeType Code","Execution_BRK_C(E)","Trade Quantity","Trade Price","Trade Amounts(BC)","commission(BC)","misc. Cost(BC)","Settlement Amounts","BookVal Transfer(BC)","Realized PL(BC)",null,"Row Labels","qStockCode","ISINCode","BursaCode","StockName","TradeDate","PayDate","qFundCode","qAssetAccType","qCountryID","StockCurrency","CPName","TranPrice","Sum of UnitFaceValue","Sum of FCGrossProceed","Sum of BrokerageFee","Sum of FCNetProceed","Sum of CostFC"]
["BUY","","","","","","","","","","","BUY","","","","","","","","","",null,"BUY","(blank)","(blank)","(blank)","(blank)","(blank)","(blank)","(blank)","(blank)","(blank)","(blank)","(blank)","(blank)"]
["BUY Total","","","","","","","","","","","","","","","","","","","","",null,"BUY Total"]
["","","","","","","","","","","","","","","","","","","","",""]
["SELL",6075745,"MYL1023OO000",1023,"CIMB GROUP HOLDINGS BHD","2022-03-03","2022-03-07","MSIG-EQ","Stocks","MYS","MYR","SELL","HONG LEONG INVESTMENT BANK",100000,5.0816999999999997,508170,254.09,915.96,506999.95,449301.63,57698.320000000007,null,"SELL",6075745,"MYL1023OO000",1023,"CIMB GROUP HOLDINGS BHD","2022-03-03","2022-03-07","MSIG-EQ","010","MY","MYR","HONG LEONG INVESTMENT BANK",5.0816999999999997,-100000,508170,254.09,506999.95,-449301.63]
["SELL",6113429,"MYL6963OO002",6963,"V.S. INDUSTRY BERHAD","2022-03-03","2022-03-07","MSIG-EQ","Stocks","MYS","MYR","SELL","MAYBANK INVESTMENT BANK",1060000,0.97030000000000005,1028518,2314.17,1308.56,1024895.27,1472201.97,-447306.69999999995,null,"SELL",6113429,"MYL6963OO002",6963,"V.S. INDUSTRY BERHAD","2022-03-03","2022-03-07","MSIG-EQ","010","MY","MYR","MAYBANK INVESTMENT BANK",0.97030000000000005,-1060000,1028518,2314.17,1024895.27,-1472201.97]
{"$rows_left_out":3}
{"sheet":"Depo","index":7,"n_rows":9,"n_cols":15,"rows_kept":9,"cut":false,"hidden":false,"merged":[]}
[{"$f":"IF(J1=\"\",\"\",IF(J1=\"Grand Total\",\"Total\",J1))","v":""},{"$f":"IF(K1=\"\",\"\",K1)","v":""},{"$f":"IF(L1=\"\",\"\",L1)","v":""},{"$f":"IF(L1=\"\",\"\",L1-J1)","v":""},{"$f":"IF(M1=\"\",\"\",M1*100)","v":""},{"$f":"IF(N1=\"\",\"\",N1)","v":""},{"$f":"IF(F1=\"\",\"\",F1+H1)","v":""},{"$f":"IF(N1=\"\",\"\",ROUND(IF(MONTH(DATE(YEAR(ValueDate),2,29))=2,((N1*M1)/366)*D1,((N1*M1)/365)*D1),2))","v":""}]
["MSIG"]
[]
["SHORT TERM MONEY MARKET PLACEMENT FROM            ",null,{"$f":"ValueDate","v":"2022-03-03"}," TO",{"$f":"EndDate","v":"2022-03-03"}]
[null,null,null,null,null,null,null,null,null,"qTrnCode","RP"]
["Placement Date","Counter Party","Maturity Date","Tenor","Interest Rate","Placement Amount","Maturity Amount","Interest Amount"]
[null,null,null,null,"%","RM","RM","RM",null,"Row Labels","CPName","PosTrnMatDt","TranYTM","Sum of UnitFaceValue","Sum of SCNetProceed"]
["2022-03-03","CIMB BANK BERHAD","2022-03-04",1,1.7000000000000002,15037000,15037700.35,700.35,null,"2022-03-03","CIMB BANK BERHAD","2022-03-04",1.7000000000000001E-2,15037000,-15037000]
["Total","","","","",15037000,15037700.35,700.35,null,"Grand Total",null,null,null,15037000,-15037000]