{"text_format":"1","workbook":"xlsx","n_sheets":12,"sheets":["Riskk","Login","InFund","Main","InDate","Quarter","Annual","InFundVSBench","InFundPerformance","InLstFundPerformance","InHolding","InLstHolding"],"not_rendered":{"charts":5,"images":2,"macros":1,"external_links":1,"defined_names":55,"comments":0,"pivot_tables":4},"unopened":[],"bounds":{"document_bytes":16777216,"sheet_cells":100000,"rows_first":2000,"rows_last":500,"rows_between":2000,"halvings":0,"cell_chars":16384,"cell_head_chars":4096},"cells_cut":0,"cells_raw":0,"read":"whole","date_system":"1900"}

{"sheet":"Riskk","index":0,"n_rows":6,"n_cols":11,"rows_kept":6,"cut":false,"hidden":true,"merged":[]}
["LSL","UPSW",null,null,null,null,null,{"$f":"COUNT(H3:H26)","v":0},false]
["LSL","Userid",null,null,null,null,null,"Main/sub","Caption","On Action","NewGroup"]
[3,"UserLevel"]
["2010-09-09T15:20:33","LoginTime"]
[null,"LogoutTime"]
["MYR","Global Ccy"]

{"sheet":"Login","index":1,"n_rows":24,"n_cols":11,"rows_kept":24,"cut":false,"hidden":false,"merged":[[23,10,23,12],[9,2,9,11]]}
[]
[]
[]
[]
[]
[]
[]
[]
{"$rows_left_out":17}
{"sheet":"InFund","index":2,"n_rows":6,"n_cols":6,"rows_kept":6,"cut":false,"hidden":true,"merged":[]}
["qFundCode","FundName","FinanceYrEnd","qCPCode","BusinessDate","FinanceYrStart"]
["IVCAP","i-VCAP Manangement Sdn Bhd - Investment","2014-12-31","N/A","2014-06-04","2014-01-01"]
["KWAP","KWAP (i-VCAP Syariah)","2014-12-31","N/A","2014-06-04","2014-01-01"]
["MMF1","i-VCAP Shariah Money Market Fund","2014-04-30","DTMB","2014-06-04","2011-03-15"]
["MYETFDJ","MyETF Dow Jones Islamic Market Malaysia Titans 25","2014-12-31","DTMB","2014-06-04","2008-01-31"]
["MYETFID","MyETF MSCI Malaysia Islamic Dividend","2014-12-31","DTMB","2014-06-04","2014-02-27"]

{"sheet":"Main","index":3,"n_rows":8,"n_cols":4,"rows_kept":8,"cut":false,"hidden":true,"merged":[[2,1,2,7]]}
[]
[]
[null,{"$f":"VLOOKUP(FundCode,InFund!A:E,2,0)","v":"i-VCAP Shariah Money Market Fund"}]
[]
[]
[null,"Fund Code","MMF1"]
[null,"Start Date",{"$f":"DATE(YEAR(VLOOKUP(FundCode,InFund!A:E,5,0))-1,MONTH(VLOOKUP(FundCode,InFund!A:E,3,0)+1),DAY(VLOOKUP(FundCode,InFund!A:E,3,0)+1))","v":"2013-05-01"},{"$f":"DATE(YEAR(VLOOKUP(FundCode,InFund!A:E,5,0))-1,MONTH(VLOOKUP(FundCode,InFund!A:E,3,0)+1),DAY(VLOOKUP(FundCode,InFund!A:E,3,0)+1))","v":41395}]
[null,"End Date","2014-04-30"]
{"$rows_left_out":1}
{"sheet":"InDate","index":4,"n_rows":38,"n_cols":1,"rows_kept":38,"cut":false,"hidden":true,"merged":[]}
["ValueDate"]
["2012-01-31"]
["2013-01-31"]
["2014-01-30"]
["2012-02-29"]
["2013-02-28"]
["2014-02-28"]
["2011-03-31"]
{"$rows_left_out":31}
{"sheet":"Quarter","index":5,"n_rows":112,"n_cols":17,"rows_kept":112,"cut":false,"hidden":true,"merged":[[30,1,30,2],[31,1,31,2],[40,1,40,2],[47,4,47,5],[48,4,48,5],[46,1,46,2],[52,4,52,5],[53,4,53,5],[47,2,47,3],[48,2,48,3],[80,1,80,9],[49,2,49,3],[50,2,50,3],[51,2,51,3],[56,1,56,5],[52,2,52,3],[53,2,53,3],[49,4,49,5],[50,4,50,5],[51,4,51,5]]}
[]
[null,"Key Statistics"]
[null,null,{"$f":"TEXT(EndDate,\"dd-MMM-yy\")","v":"30-Apr-14"},{"$f":"TEXT(StartDate-1,\"dd-MMM-yy\")","v":"30-Apr-13"},"Q-o-Q Return","Annualized Returm",null,{"$f":"StartDate","v":"2013-05-01"},{"$f":"EOMONTH(I4,-((YEAR(H4)-YEAR(H3))*12+MONTH(H4)-MONTH(H3))-1)+1","v":"2012-05-01"}]
[null,"Before Dividend Distribution",null,null,null,null,null,{"$f":"EndDate","v":"2014-04-30"},{"$f":"StartDate-1","v":"2013-04-30"}]
[]
[null,"Net Asset Value (NAV) (RM) *",{"$f":"SUMIF(InFundPerformance!A:A,Quarter!C3,InFundPerformance!B:B)","v":36949762.920000002},{"$f":"SUMIF(InLstFundPerformance!A:A,Quarter!D3,InLstFundPerformance!B:B)","v":40924354.719999999},{"$f":"(SUMIF(InFundPerformance!A:A,Quarter!C3,InFundPerformance!G:G)/SUMIF(InLstFundPerformance!A:A,Quarter!D3,InLstFundPerformance!G:G)-1)","v":3.0034370451365255E-2},{"$f":"(POWER((1+E6),365/(C3-D3))-1)","v":3.0034370451365255E-2},"Highest Value",{"$f":"MAX(InFundPerformance!E:E)","v":1.0121},{"$f":"MAX(InLstFundPerformance!E:E)","v":1.0156000000000001}]
[null,"Units in Circulation (Units)",{"$f":"SUMIF(InFundPerformance!A:A,Quarter!C3,InFundPerformance!C:C)","v":36789272.520000003},{"$f":"SUMIF(InLstFundPerformance!A:A,Quarter!D3,InLstFundPerformance!C:C)","v":0},null,null,"Highest Date",{"$f":"SUMIF(InFundPerformance!E:E,H6,InFundPerformance!A:A)","v":"2013-07-30"},{"$f":"SUMIF(InLstFundPerformance!E:E,I6,InLstFundPerformance!A:A)","v":"2012-11-29"}]
[null,"NAV Per Unit (RM)",{"$f":"IF(C7=0,0,C6/C7)","v":1.0043624238536586},{"$f":"IF(D7=0,0,D6/D7)","v":0}]
{"$rows_left_out":105}
{"sheet":"Annual","index":6,"n_rows":84,"n_cols":20,"rows_kept":84,"cut":false,"hidden":true,"merged":[[42,1,42,9],[62,1,62,9],[83,1,83,11],[1,1,1,2],[20,1,20,4],[38,1,38,2],[21,1,21,2],[1,7,1,8]]}
[]
[null,"Key Statistics – Yearly Performance",null,null,null,null,null,{"$f":"\"Fund’s Investments as at end-FY\" & TEXT(EndDate,\"yyyy\")","v":"Fund’s Investments as at end-FY2014"}]
[null,null,{"$f":"\"As at \" & TEXT(EndDate,\"dd MMM yyyy\")","v":"As at 30 Apr 2014"},{"$f":"\"As at \" & TEXT((StartDate)-1,\"dd MMM yyyy\")","v":"As at 30 Apr 2013"},null,null,null,"DEPOSIT CONCEPT","VALUE (RM)","TENURE","PROFIT SHARING RATE",null,null,"Sum of UnitFaceValue"]
[null,null,null,null,null,null,null,{"$f":"IF(N5=\"\",\"\",N5)","v":"Fixed Deposit Islamic"},{"$f":"IF(P5=\"\",\"\",P5)","v":18702360.52},{"$f":"IF(O5=\"\",\"\",O5)","v":"2-3 mths"},null,null,null,"CshTypeDesc","TenureCat","Total"]
[null,"Fund Performance",null,null,null,null,null,{"$f":"IF(N6=\"\",\"\",N6)","v":""},{"$f":"IF(P6=\"\",\"\",P6)","v":15462753.42},{"$f":"IF(O6=\"\",\"\",O6)","v":"3-4 mths"},null,null,null,"Fixed Deposit Islamic","2-3 mths",18702360.52]
[null,"Net Asset Value (NAV) (RM)",{"$f":"SUMIF(InFundPerformance!A:A,EndDate,InFundPerformance!B:B)","v":36949762.920000002},{"$f":"SUMIF(InLstFundPerformance!A:A,StartDate-1,InLstFundPerformance!B:B)","v":40924354.719999999},null,null,null,"",4260562.6500000004,"4-5 mths",null,null,null,null,"3-4 mths",15462753.42]
[null,"Units In Circulation (Units)",{"$f":"SUMIF(InFundPerformance!A:A,EndDate,InFundPerformance!D:D)","v":36834061.25},{"$f":"SUMIF(InLstFundPerformance!A:A,StartDate-1,InLstFundPerformance!D:D)","v":40596906.967699997},null,null,null,"",26425173.23,"5-6 mths",null,null,null,null,"4-5 mths",4260562.6500000004]
[null,"Dividend Distribution (RM) #",{"$f":"SUMIF(InFundPerformance!A:A,EndDate,InFundPerformance!F:F)","v":0},{"$f":"SUMIF(InLstFundPerformance!A:A,StartDate-1,InLstFundPerformance!F:F)","v":0},null,null,null,"",20156128.609999999,"6-7 mths",null,null,null,null,"5-6 mths",26425173.23]
{"$rows_left_out":77}
{"sheet":"InFundVSBench","index":7,"n_rows":32,"n_cols":6,"rows_kept":32,"cut":false,"hidden":true,"merged":[]}
["AnnualBenchmark","ValDt2","AnnualFundRtrn","tenor","BenchMark","TwrrRtrn"]
[2.8115057450742498,"2011-09-30",3.0280801123419021,943,7.4262770733558803E-2,8.0119009041556888E-2]
[2.8053375562532734,"2011-10-31",3.0349386096031994,912,7.1575310393473979E-2,7.756506918810846E-2]
[2.7992094061999317,"2011-11-30",3.0342390929516849,882,6.8987314094434815E-2,7.4902713631626039E-2]
[2.791728111516889,"2011-12-30",3.021465586752603,852,6.6383241144026606E-2,7.195485401633106E-2]
[2.7835712624904918,"2012-01-31",3.0305028278280188,820,6.3622456194479815E-2,6.9371708284129863E-2]
[2.7756298756063558,"2012-02-29",3.0316555599290362,791,6.112712101017248E-2,6.6863996085113175E-2]
[2.7670639237925343,"2012-03-30",3.008591698975227,761,5.8558030999863231E-2,6.3751684523522201E-2]
{"$rows_left_out":25}
{"sheet":"InFundPerformance","index":8,"n_rows":249,"n_cols":12,"rows_kept":249,"cut":false,"hidden":true,"merged":[]}
["qValDate","NAV","TotalUnitsBF","TotalUnits","BuyPrice","Distribution","TWRRPrice","AccDate","Amount","qIndexBenchmark","Indices","EndDate"]
["2013-05-02",40931204.810000002,0,40596906.967699997,1.0082,0,1.0502700823420561,null,null,"MBBGIA",10469.35,52013]
["2013-05-03",40941479.719999999,0,40596906.967699997,1.0085,0,1.0505337303490436,null,null,"MBBGIA",10470.129999999999,52013]
["2013-05-06",40944904.689999998,0,40596906.967699997,1.0085999999999999,0,1.0506216130180395,null,null,"MBBGIA",10472.469999999999,52013]
["2013-05-07",40948325.640000001,0,40596906.967699997,1.0086999999999999,0,1.0507093925362547,null,null,"MBBGIA",10473.25,52013]
["2013-05-08",40951755.18,0,40596906.967699997,1.0086999999999999,0,1.0507973924687004,null,null,"MBBGIA",10474.030000000001,52013]
["2013-05-09",40955184.710000001,0,40596906.967699997,1.0087999999999999,0,1.050885392144552,null,null,"MBBGIA",10474.81,52013]
["2013-05-10",40965473.109999999,0,40596906.967699997,1.0091000000000001,0,1.0511493862968213,null,null,"MBBGIA",10475.59,52013]
{"$rows_left_out":242}
{"sheet":"InLstFundPerformance","index":9,"n_rows":247,"n_cols":14,"rows_kept":247,"cut":false,"hidden":true,"merged":[]}
["qValDate","NAV","TotalUnitsBF","TotalUnits","BuyPrice","Distribution","TWRRPrice","AccDate","Amount","qIndexBenchmark","Indices","LstYrTwrrPrice","LstYrIndex","EndDate"]
["2012-05-02",40595433.869999997,0,40273339.351800002,1.008,0,1.0194738941600197,null,null,"MBBGIA",10187.75,1.0193069940415649,10186.11,52012]
["2012-05-03",40598756.859999999,0,40273339.351800002,1.0081,0,1.0195573444703772,null,null,"MBBGIA",10188.57,1.0193069940415649,10186.11,52012]
["2012-05-04",40608725.399999999,0,40273339.351800002,1.0083,0,1.0198076846028519,null,null,"MBBGIA",10189.39,1.0193069940415649,10186.11,52012]
["2012-05-07",40612048.189999998,0,40273339.351800002,1.0084,0,1.0198911298906059,null,null,"MBBGIA",10191.85,1.0193069940415649,10186.11,52012]
["2012-05-08",40615370.969999999,0,40273339.351800002,1.0085,0,1.0199745749272293,null,null,"MBBGIA",10192.67,1.0193069940415649,10186.11,52012]
["2012-05-09",40618693.719999999,0,40273339.351800002,1.0085999999999999,0,1.0200580192104625,null,null,"MBBGIA",10193.49,1.0193069940415649,10186.11,52012]
["2012-05-10",40622016.420000002,0,40273339.351800002,1.0086999999999999,0,1.0201414622380449,null,null,"MBBGIA",10194.31,1.0193069940415649,10186.11,52012]
{"$rows_left_out":240}
{"sheet":"InHolding","index":10,"n_rows":61,"n_cols":92,"rows_kept":61,"cut":false,"hidden":true,"merged":[]}
["qEventTrxID","qTrnCode","qProductType","Remarks","SettleID","SettleGroup","qVoucherID","MasterBuyID","qTranMethod","qFundCode","qCDSAcc","TradeDate","ValueDate","PayDate","MaturityDate","AccDate","RevDate","qAccType","qCPCode","TranPrice","fTranRefPrice","WSPrice","WSYTM","WSProfit","WSSettledValue","SettCurrency","qBankAccNo","PaymentEntity","qStockCode","ContractNote","ExchgRateSF","TranYTM","UnitFaceValue","CummFV","CostSC","CostFC","CummCost","SCGrossProceed","TranSCControl","AccSCControl","SCNetProceed","AccSCNetProceed","TranProceed","AccProceed","TranBuyCapital","AccCapital","TranIncome","AccTI","TranGains","AccGain","TranAmortAccre","AccAmortAccre","TranPreAcq","AccPreAcq","TranExpenses","AccExpenses","TranFXGnL","AccFXGnL","MarriedDeal","BrokerageFee","ClearingFee","StampDuty","VAT","CustodianFeeCC","CustodianFeeFC","CustodianCode","CustDebitGL","CustCreditGL","CustSettleID","CustCurrency","SettFlag","ReversalFlag","TrialBalanceRef","qMasterID","qEvtDeclareID","PurchaseDate","CapProcDate","ProcessDate","CrossTrade","LCD","NCD","ParcelID","CshRollOverFlag","ShortSellStatus","DealerKeyInDate","DealerKeyInBy","KeyInDate","KeyInBy","Tenure","CounterName","CshTypeDesc","TenureCat"]
["CSH*140300076M","RP","CSH","Convertion from CAMRA,F19091301",null,null,null,null,1,"MMF1","N/A","2013-05-07","2013-05-07","2013-05-07","2013-10-03","2013-05-07","3000-01-01","CSMM","F_RAJHI",1,1,0,0,0,0,"MYR","DF","IVCAP","FDI*MYR*RAJHI",null,1,3.3500000000000002E-2,1012000,0,1012000,1012000,0,-1012000,0,null,-1012000,"0-IVCAP-MYR-300100",0,null,1012000,"0-IVCAP-MYR-100210",0,null,0,null,0,null,0,null,0,null,0,null,"NO ",0,0,0,0,0,0,"N/A",null,null,null,"MYR",-1,0,null,"CSH*140300076M",null,"3000-01-01","2013-05-07","2013-05-07",0,"3000-01-01","3000-01-01",null,0,0,"2014-06-03","admin","2014-06-03","admin",149,"Al Rajhi Bank","Fixed Deposit Islamic","4-5 mths"]
["CSH*140300077M","RP","CSH","Convertion from CAMRA,F19091301",null,null,null,null,1,"MMF1","N/A","2013-05-07","2013-05-07","2013-05-07","2013-10-09","2013-05-07","3000-01-01","CSMM","F_RAJHI",1,1,0,0,0,0,"MYR","DF","IVCAP","FDI*MYR*RAJHI",null,1,3.3500000000000002E-2,1020923.12,0,1020923.12,1020923.12,0,-1020923.12,0,null,-1020923.12,"0-IVCAP-MYR-300100",0,null,1020923.12,"0-IVCAP-MYR-100210",0,null,0,null,0,null,0,null,0,null,0,null,"NO ",0,0,0,0,0,0,"N/A",null,null,null,"MYR",-1,0,null,"CSH*140300077M",null,"3000-01-01","2013-05-07","2013-05-07",0,"3000-01-01","3000-01-01",null,0,0,"2014-06-03","admin","2014-06-03","admin",155,"Al Rajhi Bank","Fixed Deposit Islamic","5-6 mths"]
["CSH*140300078M","RP","CSH","Convertion from CAMRA,F19091301",null,null,null,null,1,"MMF1","N/A","2013-05-14","2013-05-14","2013-05-14","2013-10-17","2013-05-14","3000-01-01","CSMM","F_BMMB",1,1,0,0,0,0,"MYR","DF","IVCAP","FDI*MYR*BMMB",null,1,3.3000000000000002E-2,1065778.2,0,1065778.2,1065778.2,0,-1065778.2,0,null,-1065778.2,"0-IVCAP-MYR-300100",0,null,1065778.2,"0-IVCAP-MYR-100210",0,null,0,null,0,null,0,null,0,null,0,null,"NO ",0,0,0,0,0,0,"N/A",null,null,null,"MYR",-1,0,null,"CSH*140300078M",null,"3000-01-01","2013-05-14","2013-05-14",0,"3000-01-01","3000-01-01",null,0,0,"2014-06-03","admin","2014-06-03","admin",156,"Bank Muamalat Malaysia Berhad","Fixed Deposit Islamic","5-6 mths"]
["CSH*140300079M","RP","CSH","Convertion from CAMRA,F19091301",null,null,null,null,1,"MMF1","N/A","2013-05-14","2013-05-14","2013-05-14","2013-10-30","2013-05-14","3000-01-01","CSMM","F_BMMB",1,1,0,0,0,0,"MYR","DF","IVCAP","FDI*MYR*BMMB",null,1,3.3000000000000002E-2,1100000,0,1100000,1100000,0,-1100000,0,null,-1100000,"0-IVCAP-MYR-300100",0,null,1100000,"0-IVCAP-MYR-100210",0,null,0,null,0,null,0,null,0,null,0,null,"NO ",0,0,0,0,0,0,"N/A",null,null,null,"MYR",-1,0,null,"CSH*140300079M",null,"3000-01-01","2013-05-14","2013-05-14",0,"3000-01-01","3000-01-01",null,0,0,"2014-06-03","admin","2014-06-03","admin",169,"Bank Muamalat Malaysia Berhad","Fixed Deposit Islamic","5-6 mths"]
["CSH*140300080M","RP","CSH","Convertion from CAMRA,F19091301",null,null,null,null,1,"MMF1","N/A","2013-06-05","2013-06-05","2013-06-05","2013-11-07","2013-06-05","3000-01-01","CSMM","F_BIMB",1,1,0,0,0,0,"MYR","DF","IVCAP","FDI*MYR*BIMB",null,1,3.3000000000000002E-2,1511695.46,0,1511695.46,1511695.46,0,-1511695.46,0,null,-1511695.46,"0-IVCAP-MYR-300100",0,null,1511695.46,"0-IVCAP-MYR-100210",0,null,0,null,0,null,0,null,0,null,0,null,"NO ",0,0,0,0,0,0,"N/A",null,null,null,"MYR",-1,0,null,"CSH*140300080M",null,"3000-01-01","2013-06-05","2013-06-05",0,"3000-01-01","3000-01-01",null,0,0,"2014-06-03","admin","2014-06-03","admin",155,"Bank Islam Malaysia Berhad","Fixed Deposit Islamic","5-6 mths"]
["CSH*140300081M","RP","CSH","Convertion from CAMRA,F19091301",null,null,null,null,1,"MMF1","N/A","2013-06-12","2013-06-12","2013-06-12","2013-11-12","2013-06-12","3000-01-01","CSMM","F_RAJHI",1,1,0,0,0,0,"MYR","DF","IVCAP","FDI*MYR*RAJHI",null,1,3.3000000000000002E-2,1854560.96,0,1854560.96,1854560.96,0,-1854560.96,0,null,-1854560.96,"0-IVCAP-MYR-300100",0,null,1854560.96,"0-IVCAP-MYR-100210",0,null,0,null,0,null,0,null,0,null,0,null,"NO ",0,0,0,0,0,0,"N/A",null,null,null,"MYR",-1,0,null,"CSH*140300081M",null,"3000-01-01","2013-06-12","2013-06-12",0,"3000-01-01","3000-01-01",null,0,0,"2014-06-03","admin","2014-06-03","admin",153,"Al Rajhi Bank","Fixed Deposit Islamic","5-6 mths"]
["CSH*140300082M","RP","CSH","Convertion from CAMRA,F19091301",null,null,null,null,1,"MMF1","N/A","2013-06-19","2013-06-19","2013-06-19","2013-11-27","2013-06-19","3000-01-01","CSMM","F_KFH",1,1,0,0,0,0,"MYR","DF","IVCAP","FDI*MYR*KFH",null,1,3.3000000000000002E-2,1093512.1599999999,0,1093512.1599999999,1093512.1599999999,0,-1093512.1599999999,0,null,-1093512.1599999999,"0-IVCAP-MYR-300100",0,null,1093512.1599999999,"0-IVCAP-MYR-100210",0,null,0,null,0,null,0,null,0,null,0,null,"NO ",0,0,0,0,0,0,"N/A",null,null,null,"MYR",-1,0,null,"CSH*140300082M",null,"3000-01-01","2013-06-19","2013-06-19",0,"3000-01-01","3000-01-01",null,0,0,"2014-06-03","admin","2014-06-03","admin",161,"Kuwait Finance House","Fixed Deposit Islamic","5-6 mths"]
{"$rows_left_out":54}
{"sheet":"InLstHolding","index":11,"n_rows":34,"n_cols":91,"rows_kept":34,"cut":false,"hidden":true,"merged":[]}
["qEventTrxID","qTrnCode","qProductType","Remarks","SettleID","SettleGroup","qVoucherID","MasterBuyID","qTranMethod","qFundCode","qCDSAcc","TradeDate","ValueDate","PayDate","MaturityDate","AccDate","RevDate","qAccType","qCPCode","TranPrice","fTranRefPrice","WSPrice","WSYTM","WSProfit","WSSettledValue","SettCurrency","qBankAccNo","PaymentEntity","qStockCode","ContractNote","ExchgRateSF","TranYTM","UnitFaceValue","CummFV","CostSC","CostFC","CummCost","SCGrossProceed","TranSCControl","AccSCControl","SCNetProceed","AccSCNetProceed","TranProceed","AccProceed","TranBuyCapital","AccCapital","TranIncome","AccTI","TranGains","AccGain","TranAmortAccre","AccAmortAccre","TranPreAcq","AccPreAcq","TranExpenses","AccExpenses","TranFXGnL","AccFXGnL","MarriedDeal","BrokerageFee","ClearingFee","StampDuty","VAT","CustodianFeeCC","CustodianFeeFC","CustodianCode","CustDebitGL","CustCreditGL","CustSettleID","CustCurrency","SettFlag","ReversalFlag","TrialBalanceRef","qMasterID","qEvtDeclareID","PurchaseDate","CapProcDate","ProcessDate","CrossTrade","LCD","NCD","ParcelID","CshRollOverFlag","ShortSellStatus","DealerKeyInDate","DealerKeyInBy","KeyInDate","KeyInBy","Tenure","CounterName","CounterName"]
["CSH*140300043M","RP","CSH","Convertion from CAMRA,F19091301",null,null,null,null,1,"MMF1","N/A","2012-05-11","2012-05-11","2012-05-11","2012-11-07","2012-05-11","3000-01-01","CSMM","F_RAJHI",1,1,0,0,0,0,"MYR","DF","IVCAP","FDI*MYR*RAJHI",null,1,3.3500000000000002E-2,4071695.92,0,4071695.92,4071695.92,0,-4071695.92,0,null,-4071695.92,"0-IVCAP-MYR-300100",0,null,4071695.92,"0-IVCAP-MYR-100210",0,null,0,null,0,null,0,null,0,null,0,null,"NO ",0,0,0,0,0,0,"N/A",null,null,null,"MYR",-1,0,null,"CSH*140300043M",null,"3000-01-01","2012-05-11","2012-05-11",0,"3000-01-01","3000-01-01",null,0,0,"2014-06-03","admin","2014-06-03","admin",180,"Al Rajhi Bank"]
["CSH*140300044M","RP","CSH","Convertion from CAMRA,F19091301",null,null,null,null,1,"MMF1","N/A","2012-05-14","2012-05-14","2012-05-14","2012-07-13","2012-05-14","3000-01-01","CSMM","F_BIMB",1,1,0,0,0,0,"MYR","DF","IVCAP","FDI*MYR*BIMB",null,1,3.15E-2,3016305.05,0,3016305.05,3016305.05,0,-3016305.05,0,null,-3016305.05,"0-IVCAP-MYR-300100",0,null,3016305.05,"0-IVCAP-MYR-100210",0,null,0,null,0,null,0,null,0,null,0,null,"NO ",0,0,0,0,0,0,"N/A",null,null,null,"MYR",-1,0,null,"CSH*140300044M",null,"3000-01-01","2012-05-14","2012-05-14",0,"3000-01-01","3000-01-01",null,0,0,"2014-06-03","admin","2014-06-03","admin",60,"Bank Islam Malaysia Berhad"]
["CSH*140300045M","RP","CSH","Convertion from CAMRA,F19091301",null,null,null,null,1,"MMF1","N/A","2012-06-27","2012-06-27","2012-06-27","2012-12-21","2012-06-27","3000-01-01","CSMM","F_RAJHI",1,1,0,0,0,0,"MYR","DF","IVCAP","FDI*MYR*RAJHI",null,1,3.3700000000000001E-2,4100252.94,0,4100252.94,4100252.94,0,-4100252.94,0,null,-4100252.94,"0-IVCAP-MYR-300100",0,null,4100252.94,"0-IVCAP-MYR-100210",0,null,0,null,0,null,0,null,0,null,0,null,"NO ",0,0,0,0,0,0,"N/A",null,null,null,"MYR",-1,0,null,"CSH*140300045M",null,"3000-01-01","2012-06-27","2012-06-27",0,"3000-01-01","3000-01-01",null,0,0,"2014-06-03","admin","2014-06-03","admin",177,"Al Rajhi Bank"]
["CSH*140300046M","RP","CSH","Convertion from CAMRA,F19091301",null,null,null,null,1,"MMF1","N/A","2012-07-04","2012-07-04","2012-07-04","2013-01-04","2012-07-04","3000-01-01","CSMM","F_KFH",1,1,0,0,0,0,"MYR","DF","IVCAP","FDI*MYR*KFH",null,1,3.3700000000000001E-2,9000000,0,9000000,9000000,0,-9000000,0,null,-9000000,"0-IVCAP-MYR-300100",0,null,9000000,"0-IVCAP-MYR-100210",0,null,0,null,0,null,0,null,0,null,0,null,"NO ",0,0,0,0,0,0,"N/A",null,null,null,"MYR",-1,0,null,"CSH*140300046M",null,"3000-01-01","2012-07-04","2012-07-04",0,"3000-01-01","3000-01-01",null,0,0,"2014-06-03","admin","2014-06-03","admin",184,"Kuwait Finance House"]
["CSH*140300047M","RP","CSH","Convertion from CAMRA,F19091301",null,null,null,null,1,"MMF1","N/A","2012-07-05","2012-07-05","2012-07-05","2012-09-03","2012-07-05","3000-01-01","CSMM","F_RAJHI",1,1,0,0,0,0,"MYR","DF","IVCAP","FDI*MYR*RAJHI",null,1,3.2500000000000001E-2,20000000,0,20000000,20000000,0,-20000000,0,null,-20000000,"0-IVCAP-MYR-300100",0,null,20000000,"0-IVCAP-MYR-100210",0,null,0,null,0,null,0,null,0,null,0,null,"NO ",0,0,0,0,0,0,"N/A",null,null,null,"MYR",-1,0,null,"CSH*140300047M",null,"3000-01-01","2012-07-05","2012-07-05",0,"3000-01-01","3000-01-01",null,0,0,"2014-06-03","admin","2014-06-03","admin",60,"Al Rajhi Bank"]
["CSH*140300048M","RP","CSH","Convertion from CAMRA,F19091301",null,null,null,null,1,"MMF1","N/A","2012-07-09","2012-07-09","2012-07-09","2012-09-03","2012-07-09","3000-01-01","CSMM","F_RAJHI",1,1,0,0,0,0,"MYR","DF","IVCAP","FDI*MYR*RAJHI",null,1,3.2500000000000001E-2,2032884.61,0,2032884.61,2032884.61,0,-2032884.61,0,null,-2032884.61,"0-IVCAP-MYR-300100",0,null,2032884.61,"0-IVCAP-MYR-100210",0,null,0,null,0,null,0,null,0,null,0,null,"NO ",0,0,0,0,0,0,"N/A",null,null,null,"MYR",-1,0,null,"CSH*140300048M",null,"3000-01-01","2012-07-09","2012-07-09",0,"3000-01-01","3000-01-01",null,0,0,"2014-06-03","admin","2014-06-03","admin",56,"Al Rajhi Bank"]
["CSH*140300049M","RP","CSH","Convertion from CAMRA,F19091301",null,null,null,null,1,"MMF1","N/A","2012-07-13","2012-07-13","2012-07-13","2012-09-03","2012-07-13","3000-01-01","CSMM","F_BIMB",1,1,0,0,0,0,"MYR","DF","IVCAP","FDI*MYR*BIMB",null,1,3.2000000000000001E-2,3031917.09,0,3031917.09,3031917.09,0,-3031917.09,0,null,-3031917.09,"0-IVCAP-MYR-300100",0,null,3031917.09,"0-IVCAP-MYR-100210",0,null,0,null,0,null,0,null,0,null,0,null,"NO ",0,0,0,0,0,0,"N/A",null,null,null,"MYR",-1,0,null,"CSH*140300049M",null,"3000-01-01","2012-07-13","2012-07-13",0,"3000-01-01","3000-01-01",null,0,0,"2014-06-03","admin","2014-06-03","admin",52,"Bank Islam Malaysia Berhad"]
{"$rows_left_out":26}