{"text_format":"1","workbook":"xlsx","n_sheets":11,"sheets":["Riskk","Login","InFund","Main","InFundPerformance","InLstHolding","InHolding","InFundVSBench","Quarter","Annual","InLstFundPerformance"],"not_rendered":{"charts":5,"images":4,"macros":1,"external_links":1,"defined_names":61,"comments":0,"pivot_tables":4},"unopened":[],"bounds":{"document_bytes":16777216,"sheet_cells":100000,"rows_first":2000,"rows_last":500,"rows_between":2000,"halvings":0,"cell_chars":16384,"cell_head_chars":4096},"cells_cut":0,"cells_raw":0,"read":"whole","date_system":"1900"}

{"sheet":"Riskk","index":0,"n_rows":6,"n_cols":11,"rows_kept":6,"cut":false,"hidden":true,"merged":[]}
["LSL","UPSW",null,null,null,null,null,{"$f":"COUNT(H3:H26)","v":0},false]
["LSL","Userid",null,null,null,null,null,"Main/sub","Caption","On Action","NewGroup"]
[3,"UserLevel"]
["2010-09-09T15:20:33","LoginTime"]
[null,"LogoutTime"]
["MYR","Global Ccy"]

{"sheet":"Login","index":1,"n_rows":24,"n_cols":11,"rows_kept":24,"cut":false,"hidden":false,"merged":[[23,10,23,12],[9,2,9,11]]}
[]
[]
[]
[]
[]
[]
[]
[]
{"$rows_left_out":17}
{"sheet":"InFund","index":2,"n_rows":7,"n_cols":6,"rows_kept":7,"cut":false,"hidden":true,"merged":[]}
["qFundCode","FundName","FinanceYrEnd","qCPCode","BusinessDate","FinanceYrStart"]
["KHAZANAH","KHAZANAH NASIONAL BERHAD (VCAM)","2015-12-31","CIMBT","2015-06-25","2014-12-22"]
["KWAP","KUMPULAN WANG PERSARAAN (DIPERBADANKAN)","2015-12-31","CITIT","2015-06-25","2014-12-15"]
["KWAPFI","KWAP (VCAP Fixed Income Fund)","2015-12-31","CITIT","2015-06-25","2015-04-30"]
["MEQESG","Malaysian ESG Opportunity Fund","2015-12-31","DBT","2015-06-25","2015-07-06"]
["VCAM","VCAP ASSET MANAGERS SDN BHD (INV)","2015-12-31","MBBT","2015-06-25","2014-04-11"]
["VCAMOPR","VCAP ASSET MANAGERS SDN BHD (OPR)","2015-12-31","MBBT","2015-06-25","2014-04-11"]

{"sheet":"Main","index":3,"n_rows":8,"n_cols":13,"rows_kept":8,"cut":false,"hidden":true,"merged":[[2,1,2,7]]}
[]
[]
[null,{"$f":"VLOOKUP(FundCode,InFund!A:E,2,0)","v":"Malaysian ESG Opportunity Fund"}]
[]
[]
[null,"Fund Code","MEQESG",null,null,"Sheet","Export"]
[null,"Start Date","2015-06-01",{"$f":"DATE(YEAR(VLOOKUP(FundCode,InFund!A:E,5,0))-1,MONTH(VLOOKUP(FundCode,InFund!A:E,3,0)+1),DAY(VLOOKUP(FundCode,InFund!A:E,3,0)+1))","v":41640},null,"Quarter","YES"]
[null,"End Date","2015-06-18",null,null,"Annual","YES",null,null,null,null,null,"18/Jun/15"]
{"$rows_left_out":1}
{"sheet":"InFundPerformance","index":4,"n_rows":14,"n_cols":177,"rows_kept":14,"cut":false,"hidden":true,"merged":[]}
["qValDate","qFundCode","LastValDate","Frequency","BuyPrice","SellPrice","ValPrice","ValPriceBF","ValPriceB4Dist","SecReturn","BenchReturn","PriceChange","PriceChangeChk","CshFXNGainBF","CshFXNGain","TranPnL","UnrealisedGains","NAVBF","ManJournal","CheckZero","FaceValueBF","FaceValue","FaceValueTran","SecCostBF","SecCost","SecCostTran","CheckZeroAll","CheckTB","CheckBS","CheckBFTB","TotalUnits","TotalUnitsBF","UnitsCreated","UnitsReInvest","UnitsRedeem","UnitsBonus","DollarCreated","DollarReinvest","DollarRedeem","DollarBonus","GAV","GAVx","NAV","NAVx","EquityLoc","EquityFXN","BondLoc","BondFXN","Trusts","Repo","DevMV","OthersMV","Cash","CashFX","TradeDebtor","TradeCreditor","MngtDebtor","MngtCreditor","DivAccrual","DivTaxRec","OthDebtor","OthCreditor","ProTax","ProDefTax","ProDistri","Others","SumCF","MngFeeBF","MngRebateBF","TrusteeFeeBF","AuditorFeeBF","CustodianFeeBF","BrokerageFeeBF","MngFee","MngRebate","OneDayMngRebate","Distribution","TrusteeFee","AuditorFee","CustodianFee","OneDayCustodianFee","BrokerageFee","OneDayBrokerageFee","TaxAllowExp","TaxGrossIncomeChrg","TaxAggregrateGrossInc","TaxInc","TaxIncToday","TaxDefToday","FXDivDebtors","FXDebtors","FXCreditors","TaxRate","MngFeeRate","TrusteeFeeRate","AuditorFeeAmt","CustodianFeeRate","BrokerageFeeRate","OtherFeeAmt","MinTrusteeFeeAmt","BenchmarkIndex","BuySellDiff","FeeCalcMethod","TaxCalcMethod","RebateMethod","UnitCreationMethod","UnitCreationSettLag","UnitCancellationSettLag","CloseFlag","PubPriceRnding","OvrMngFee","OvrMngRebate","OvrTrusteeFee","OvrCustodianFee","OvrTaxIncToday","OvrTaxDefToday","OvrDistribution","DistriStatus","LastCalculation","Remarks","KeyInDate","KeyInBy","qFundCode","ValueDate","LastValueDate","NAV","Cost","AccMV","Capital","LVNAV","LVCapital","TWRR","NetTWRR","TWRRPrice","Expenses","ImpExp","EAV","EVG","EAVLst","EAVTWRRPrice","BAV","BVG","BAVLst","BAVTWRRPrice","CAV","CVG","CAVLst","CAVTWRRPrice","DAV","DVG","DAVLst","DAVTWRRPrice","NetTWRRPrice","AccDate","Amount","qIndexBenchmark","Indices","EVG","EAVLst","EAVTWRRPrice","BAV","BVG","BAVLst","BAVTWRRPrice","CAV","CVG","CAVLst","CAVTWRRPrice","DAV","DVG","DAVLst","DAVTWRRPrice","NetTWRRPrice","AccDate","Amount","qIndexBenchmark","Indices"]
[null,null,null,null,null,null,null,null,null,null,null,null,null,null,null,null,null,null,null,null,null,null,null,null,null,null,null,null,null,null,null,null,null,null,null,null,null,null,null,null,null,null,null,null,null,null,null,null,null,null,null,null,null,null,null,null,null,null,null,null,null,null,null,null,null,null,null,null,null,null,null,null,null,null,null,null,null,null,null,null,null,null,null,null,null,null,null,null,null,null,null,null,null,null,null,null,null,null,null,null,null,null,null,null,null,null,null,null,null,null,null,null,null,null,null,null,null,null,null,null,null,null,null,null,null,null,null,null,null,null,null,null,null,null,null,null,null,null,null,null,null,null,null,null,null,null,null,null,null,null,null,null,null,null,null,null,null,"00:00:00",0,1,0,0,0,1,0,0,0,1,0,0,0,1,1.1633999999999844,null,null,"DJIMMT",1041.93]
[null,null,null,null,null,null,null,null,null,null,null,null,null,null,null,null,null,null,null,null,null,null,null,null,null,null,null,null,null,null,null,null,null,null,null,null,null,null,null,null,null,null,null,null,null,null,null,null,null,null,null,null,null,null,null,null,null,null,null,null,null,null,null,null,null,null,null,null,null,null,null,null,null,null,null,null,null,null,null,null,null,null,null,null,null,null,null,null,null,null,null,null,null,null,null,null,null,null,null,null,null,null,null,null,null,null,null,null,null,null,null,null,null,null,null,null,null,null,null,null,null,null,null,null,null,null,null,null,null,null,null,null,null,null,null,null,null,null,null,null,null,null,null,null,null,null,null,null,null,null,null,null,null,null,null,null,null,"00:00:00",0,1,0,0,0,1,0,0,0,1,0,0,0,1,1.1528999999999847,null,null,"DJIMMT",1032.48]
[null,null,null,null,null,null,null,null,null,null,null,null,null,null,null,null,null,null,null,null,null,null,null,null,null,null,null,null,null,null,null,null,null,null,null,null,null,null,null,null,null,null,null,null,null,null,null,null,null,null,null,null,null,null,null,null,null,null,null,null,null,null,null,null,null,null,null,null,null,null,null,null,null,null,null,null,null,null,null,null,null,null,null,null,null,null,null,null,null,null,null,null,null,null,null,null,null,null,null,null,null,null,null,null,null,null,null,null,null,null,null,null,null,null,null,null,null,null,null,null,null,null,null,null,null,null,null,null,null,null,null,null,null,null,null,null,null,null,null,null,null,null,null,null,null,null,null,null,null,null,null,null,null,null,null,null,null,37334225.530000001,0,1,0,0,0,1,484517.85,117.85,0,1,0,0,0,1,1.1603999999999848,null,null,"DJIMMT",1039.19]
[null,null,null,null,null,null,null,null,null,null,null,null,null,null,null,null,null,null,null,null,null,null,null,null,null,null,null,null,null,null,null,null,null,null,null,null,null,null,null,null,null,null,null,null,null,null,null,null,null,null,null,null,null,null,null,null,null,null,null,null,null,null,null,null,null,null,null,null,null,null,null,null,null,null,null,null,null,null,null,null,null,null,null,null,null,null,null,null,null,null,null,null,null,null,null,null,null,null,null,null,null,null,null,null,null,null,null,null,null,null,null,null,null,null,null,null,null,null,null,null,null,null,null,null,null,null,null,null,null,null,null,null,null,null,null,null,null,null,null,null,null,null,null,null,null,null,null,null,null,null,null,null,null,null,null,null,null,-1496170.33,295448450.58999997,0.99493593441762107,0,0,0,1,502600,39.28,484517.85,1.0000810702846139,0,0,0,1,1.154499999999985,null,null,"DJIMMT",1033.95]
[null,null,null,null,null,null,null,null,null,null,null,null,null,null,null,null,null,null,null,null,null,null,null,null,null,null,null,null,null,null,null,null,null,null,null,null,null,null,null,null,null,null,null,null,null,null,null,null,null,null,null,null,null,null,null,null,null,null,null,null,null,null,null,null,null,null,null,null,null,null,null,null,null,null,null,null,null,null,null,null,null,null,null,null,null,null,null,null,null,null,null,null,null,null,null,null,null,null,null,null,null,null,null,null,null,null,null,null,null,null,null,null,null,null,null,null,null,null,null,null,null,null,null,null,null,null,null,null,null,null,null,null,null,null,null,null,null,null,null,null,null,null,null,null,null,null,null,null,null,null,null,null,null,null,null,null,null,"4569-07-30T10:48:00",293952280.25999999,0.99823615632791673,0,0,0,1,723750.35,40.35,502600,1.0001613593239813,0,0,0,1,1.1582999999999848,null,null,"DJIMMT",1037.3599999999999]
[null,null,null,null,null,null,null,null,null,null,null,null,null,null,null,null,null,null,null,null,null,null,null,null,null,null,null,null,null,null,null,null,null,null,null,null,null,null,null,null,null,null,null,null,null,null,null,null,null,null,null,null,null,null,null,null,null,null,null,null,null,null,null,null,null,null,null,null,null,null,null,null,null,null,null,null,null,null,null,null,null,null,null,null,null,null,null,null,null,null,null,null,null,null,null,null,null,null,null,null,null,null,null,null,null,null,null,null,null,null,null,null,null,null,null,null,null,null,null,null,null,null,null,null,null,null,null,null,null,null,null,null,null,null,null,null,null,null,null,null,null,null,null,null,null,null,null,null,null,null,null,null,null,null,null,null,null,"5582-10-08T22:04:48",294927325.70999998,1.0027889164365378,0,0,0,1,720000,57.91,723750.35,1.0002413860131822,0,0,0,1,1.1634999999999847,null,null,"DJIMMT",1042.0899999999999]
[null,null,null,null,null,null,null,null,null,null,null,null,null,null,null,null,null,null,null,null,null,null,null,null,null,null,null,null,null,null,null,null,null,null,null,null,null,null,null,null,null,null,null,null,null,null,null,null,null,null,null,null,null,null,null,null,null,null,null,null,null,null,null,null,null,null,null,null,null,null,null,null,null,null,null,null,null,null,null,null,null,null,null,null,null,null,null,null,null,null,null,null,null,null,null,null,null,null,null,null,null,null,null,null,null,null,null,null,null,null,null,null,null,null,null,null,null,null,null,null,null,null,null,null,null,null,null,null,null,null,null,null,null,null,null,null,null,null,null,null,null,null,null,null,null,null,null,null,null,null,null,null,null,null,null,null,null,-761004.09,296272431.63,1.0002131571510167,0,0,0,1,720057.8,57.8,720000,1.0003216831688928,0,0,0,1,1.1604999999999848,null,null,"DJIMMT",1039.3499999999999]
{"$rows_left_out":7}
{"sheet":"InLstHolding","index":5,"n_rows":1,"n_cols":91,"rows_kept":1,"cut":false,"hidden":true,"merged":[]}
["qEventTrxID","qTrnCode","qProductType","Remarks","SettleID","SettleGroup","qVoucherID","MasterBuyID","qTranMethod","qFundCode","qCDSAcc","TradeDate","ValueDate","PayDate","MaturityDate","AccDate","RevDate","qAccType","qCPCode","TranPrice","fTranRefPrice","WSPrice","WSYTM","WSProfit","WSSettledValue","SettCurrency","qBankAccNo","PaymentEntity","qStockCode","ContractNote","ExchgRateSF","TranYTM","UnitFaceValue","CummFV","CostSC","CostFC","CummCost","SCGrossProceed","TranSCControl","AccSCControl","SCNetProceed","AccSCNetProceed","TranProceed","AccProceed","TranBuyCapital","AccCapital","TranIncome","AccTI","TranGains","AccGain","TranAmortAccre","AccAmortAccre","TranPreAcq","AccPreAcq","TranExpenses","AccExpenses","TranFXGnL","AccFXGnL","MarriedDeal","BrokerageFee","ClearingFee","StampDuty","VAT","CustodianFeeCC","CustodianFeeFC","CustodianCode","CustDebitGL","CustCreditGL","CustSettleID","CustCurrency","SettFlag","ReversalFlag","TrialBalanceRef","qMasterID","qEvtDeclareID","PurchaseDate","CapProcDate","ProcessDate","CrossTrade","LCD","NCD","ParcelID","CshRollOverFlag","ShortSellStatus","DealerKeyInDate","DealerKeyInBy","KeyInDate","KeyInBy","Tenure","CounterName","CounterName"]

{"sheet":"InHolding","index":6,"n_rows":1,"n_cols":92,"rows_kept":1,"cut":false,"hidden":true,"merged":[]}
["qEventTrxID","qTrnCode","qProductType","Remarks","SettleID","SettleGroup","qVoucherID","MasterBuyID","qTranMethod","qFundCode","qCDSAcc","TradeDate","ValueDate","PayDate","MaturityDate","AccDate","RevDate","qAccType","qCPCode","TranPrice","fTranRefPrice","WSPrice","WSYTM","WSProfit","WSSettledValue","SettCurrency","qBankAccNo","PaymentEntity","qStockCode","ContractNote","ExchgRateSF","TranYTM","UnitFaceValue","CummFV","CostSC","CostFC","CummCost","SCGrossProceed","TranSCControl","AccSCControl","SCNetProceed","AccSCNetProceed","TranProceed","AccProceed","TranBuyCapital","AccCapital","TranIncome","AccTI","TranGains","AccGain","TranAmortAccre","AccAmortAccre","TranPreAcq","AccPreAcq","TranExpenses","AccExpenses","TranFXGnL","AccFXGnL","MarriedDeal","BrokerageFee","ClearingFee","StampDuty","VAT","CustodianFeeCC","CustodianFeeFC","CustodianCode","CustDebitGL","CustCreditGL","CustSettleID","CustCurrency","SettFlag","ReversalFlag","TrialBalanceRef","qMasterID","qEvtDeclareID","PurchaseDate","CapProcDate","ProcessDate","CrossTrade","LCD","NCD","ParcelID","CshRollOverFlag","ShortSellStatus","DealerKeyInDate","DealerKeyInBy","KeyInDate","KeyInBy","Tenure","CounterName","CshTypeDesc","TenureCat"]

{"sheet":"InFundVSBench","index":7,"n_rows":1,"n_cols":3,"rows_kept":1,"cut":false,"hidden":true,"merged":[]}
["BenchMark","ValDt2","TwrrRtrn"]

{"sheet":"Quarter","index":8,"n_rows":81,"n_cols":15,"rows_kept":81,"cut":false,"hidden":true,"merged":[[52,4,52,5],[53,4,53,5],[47,2,47,3],[48,2,48,3],[80,1,80,9],[49,2,49,3],[50,2,50,3],[51,2,51,3],[56,1,56,5],[52,2,52,3],[53,2,53,3],[49,4,49,5],[50,4,50,5],[51,4,51,5],[30,1,30,2],[31,1,31,2],[40,1,40,2],[47,4,47,5],[48,4,48,5],[46,1,46,2]]}
[]
[null,"Key Statistics"]
[null,null,{"$f":"TEXT(EndDate,\"dd-MMM-yy\")","v":"18-Jun-15"},{"$f":"TEXT(StartDate-1,\"dd-MMM-yy\")","v":"31-May-15"},"Q-o-Q Return","Annualized Returm",null,{"$f":"StartDate","v":"2015-06-01"},{"$f":"EOMONTH(I4,-(MONTH(H4)-MONTH(H3)))+1","v":"2015-06-01"}]
[null,"Before Dividend Distribution",null,null,null,null,null,{"$f":"EndDate","v":"2015-06-18"},{"$f":"StartDate-1","v":"2015-05-31"}]
[]
[null,"Net Asset Value (NAV) (RM) *",{"$f":"SUMIF(InFundPerformance!A:A,CurEnd,InFundPerformance!AQ:AQ)","v":0},{"$f":"SUMIF(InLstFundPerformance!A:A,LstEnd,InLstFundPerformance!AQ:AQ)","v":0},{"$f":"(SUMIF(InFundPerformance!A:A,CurEnd,InFundPerformance!ED:ED)/SUMIF(InLstFundPerformance!A:A,LstEnd,InLstFundPerformance!ED:ED)-1)","v":{"$error":"#DIV/0!"}},{"$f":"(POWER((1+E6),365/(C3-D3))-1)","v":{"$error":"#DIV/0!"}},"Highest Value",{"$f":"MAX(InFundPerformance!E:E)","v":0},{"$f":"MAX(InLstFundPerformance!E:E)","v":0}]
[null,"Units in Circulation (Units)",{"$f":"SUMIF(InFundPerformance!A:A,CurEnd,InFundPerformance!AF:AF)","v":0},{"$f":"SUMIF(InLstFundPerformance!A:A,LstEnd,InLstFundPerformance!AF:AF)","v":0},null,null,"Highest Date",{"$f":"MAX(IF(InFundPerformance!E:E,InFundPerformance!A:A))","v":"00:00:00"},{"$f":"MAX(IF(InLstFundPerformance!E:E,InLstFundPerformance!A:A))","v":"00:00:00"}]
[null,"NAV Per Unit (RM)",{"$f":"IF(C7=0,0,C6/C7)","v":0},{"$f":"IF(D7=0,0,D6/D7)","v":0}]
{"$rows_left_out":74}
{"sheet":"Annual","index":9,"n_rows":84,"n_cols":20,"rows_kept":84,"cut":false,"hidden":true,"merged":[[62,1,62,9],[83,1,83,11],[1,1,1,2],[1,7,1,8],[20,1,20,4],[21,1,21,2],[38,1,38,2],[42,1,42,9]]}
[]
[null,"Key Statistics – Yearly Performance",null,null,null,null,null,{"$f":"\"Fund’s Investments as at end-FY\" & TEXT(EndDate,\"yyyy\")","v":"Fund’s Investments as at end-FY2015"}]
[null,null,{"$f":"\"As at \" & TEXT(EndDate,\"dd MMM yyyy\")","v":"As at 18 Jun 2015"},{"$f":"\"As at \" & TEXT((StartDate)-1,\"dd MMM yyyy\")","v":"As at 31 May 2015"},null,null,null,"DEPOSIT CONCEPT","VALUE (RM)","TENURE","PROFIT SHARING RATE",null,null,"Sum of UnitFaceValue"]
[null,null,null,null,null,null,null,{"$f":"IF(N5=\"\",\"\",N5)","v":"Grand Total"},{"$f":"IF(P5=\"\",\"\",P5)","v":""},{"$f":"IF(O5=\"\",\"\",O5)","v":""},null,null,null,"CshTypeDesc","TenureCat","Total"]
[null,"Fund Performance",null,null,null,null,null,{"$f":"IF(N6=\"\",\"\",N6)","v":""},{"$f":"IF(P6=\"\",\"\",P6)","v":""},{"$f":"IF(O6=\"\",\"\",O6)","v":""},null,null,null,"Grand Total"]
[null,"Net Asset Value (NAV) (RM)",{"$f":"SUMIF(InFundPerformance!A:A,CurEnd,InFundPerformance!DV:DV)","v":0},{"$f":"SUMIF(InLstFundPerformance!A:A,LstEnd,InLstFundPerformance!DV:DV)","v":0},null,null,null,"","",""]
[null,"Units In Circulation (Units)",{"$f":"SUMIF(InFundPerformance!A:A,CurEnd,InFundPerformance!AE:AE)","v":0},{"$f":"SUMIF(InLstFundPerformance!A:A,LstEnd,InLstFundPerformance!AE:AE)","v":0},null,null,null,"","",""]
[null,"Dividend Distribution (RM) #",{"$f":"SUMIF(InFundPerformance!A:A,CurEnd,InFundPerformance!BY:BY)","v":0},{"$f":"SUMIF(InLstFundPerformance!A:A,LstEnd,InLstFundPerformance!BY:BY)","v":0},null,null,null,"","",""]
{"$rows_left_out":77}
{"sheet":"InLstFundPerformance","index":10,"n_rows":251,"n_cols":179,"rows_kept":251,"cut":false,"hidden":true,"merged":[]}
["qValDate","qFundCode","LastValDate","Frequency","BuyPrice","SellPrice","ValPrice","ValPriceBF","ValPriceB4Dist","SecReturn","BenchReturn","PriceChange","PriceChangeChk","CshFXNGainBF","CshFXNGain","TranPnL","UnrealisedGains","NAVBF","ManJournal","CheckZero","FaceValueBF","FaceValue","FaceValueTran","SecCostBF","SecCost","SecCostTran","CheckZeroAll","CheckTB","CheckBS","CheckBFTB","TotalUnits","TotalUnitsBF","UnitsCreated","UnitsReInvest","UnitsRedeem","UnitsBonus","DollarCreated","DollarReinvest","DollarRedeem","DollarBonus","GAV","GAVx","NAV","NAVx","EquityLoc","EquityFXN","BondLoc","BondFXN","Trusts","Repo","DevMV","OthersMV","Cash","CashFX","TradeDebtor","TradeCreditor","MngtDebtor","MngtCreditor","DivAccrual","DivTaxRec","OthDebtor","OthCreditor","ProTax","ProDefTax","ProDistri","Others","SumCF","MngFeeBF","MngRebateBF","TrusteeFeeBF","AuditorFeeBF","CustodianFeeBF","BrokerageFeeBF","MngFee","MngRebate","OneDayMngRebate","Distribution","TrusteeFee","AuditorFee","CustodianFee","OneDayCustodianFee","BrokerageFee","OneDayBrokerageFee","TaxAllowExp","TaxGrossIncomeChrg","TaxAggregrateGrossInc","TaxInc","TaxIncToday","TaxDefToday","FXDivDebtors","FXDebtors","FXCreditors","TaxRate","MngFeeRate","TrusteeFeeRate","AuditorFeeAmt","CustodianFeeRate","BrokerageFeeRate","OtherFeeAmt","MinTrusteeFeeAmt","BenchmarkIndex","BuySellDiff","FeeCalcMethod","TaxCalcMethod","RebateMethod","UnitCreationMethod","UnitCreationSettLag","UnitCancellationSettLag","CloseFlag","PubPriceRnding","OvrMngFee","OvrMngRebate","OvrTrusteeFee","OvrCustodianFee","OvrTaxIncToday","OvrTaxDefToday","OvrDistribution","DistriStatus","LastCalculation","Remarks","KeyInDate","KeyInBy","qFundCode","ValueDate","LastValueDate","NAV","Cost","AccMV","Capital","LVNAV","LVCapital","TWRR","NetTWRR","TWRRPrice","Expenses","ImpExp","EAV","EVG","EAVLst","EAVTWRRPrice","BAV","BVG","BAVLst","BAVTWRRPrice","CAV","CVG","CAVLst","CAVTWRRPrice","DAV","DVG","DAVLst","DAVTWRRPrice","NetTWRRPrice","AccDate","Amount","qIndexBenchmark","Indices","LstYrTwrrPrice","LstYrIndex","EAVTWRRPrice","BAV","BVG","BAVLst","BAVTWRRPrice","CAV","CVG","CAVLst","CAVTWRRPrice","DAV","DVG","DAVLst","DAVTWRRPrice","NetTWRRPrice","AccDate","Amount","qIndexBenchmark","Indices","LstYrTwrrPrice","LstYrIndex"]
[null,null,null,null,null,null,null,null,null,null,null,null,null,null,null,null,null,null,null,null,null,null,null,null,null,null,null,null,null,null,null,null,null,null,null,null,null,null,null,null,null,null,null,null,null,null,null,null,null,null,null,null,null,null,null,null,null,null,null,null,null,null,null,null,null,null,null,null,null,null,null,null,null,null,null,null,null,null,null,null,null,null,null,null,null,null,null,null,null,null,null,null,null,null,null,null,null,null,null,null,null,null,null,null,null,null,null,null,null,null,null,null,null,null,null,null,null,null,null,null,null,null,null,null,null,null,null,null,null,null,null,null,null,null,null,null,null,null,null,null,null,null,null,null,null,null,null,null,null,null,null,null,null,null,null,null,null,null,994.11]
[null,null,null,null,null,null,null,null,null,null,null,null,null,null,null,null,null,null,null,null,null,null,null,null,null,null,null,null,null,null,null,null,null,null,null,null,null,null,null,null,null,null,null,null,null,null,null,null,null,null,null,null,null,null,null,null,null,null,null,null,null,null,null,null,null,null,null,null,null,null,null,null,null,null,null,null,null,null,null,null,null,null,null,null,null,null,null,null,null,null,null,null,null,null,null,null,null,null,null,null,null,null,null,null,null,null,null,null,null,null,null,null,null,null,null,null,null,null,null,null,null,null,null,null,null,null,null,null,null,null,null,null,null,null,null,null,null,null,null,null,null,null,null,null,null,null,null,null,null,null,null,null,null,null,null,null,null,null,994.11]
[null,null,null,null,null,null,null,null,null,null,null,null,null,null,null,null,null,null,null,null,null,null,null,null,null,null,null,null,null,null,null,null,null,null,null,null,null,null,null,null,null,null,null,null,null,null,null,null,null,null,null,null,null,null,null,null,null,null,null,null,null,null,null,null,null,null,null,null,null,null,null,null,null,null,null,null,null,null,null,null,null,null,null,null,null,null,null,null,null,null,null,null,null,null,null,null,null,null,null,null,null,null,null,null,null,null,null,null,null,null,null,null,null,null,null,null,null,null,null,null,null,null,null,null,null,null,null,null,null,null,null,null,null,null,null,null,null,null,null,null,null,null,null,null,null,null,null,null,null,null,null,null,null,null,null,null,null,null,994.11]
[null,null,null,null,null,null,null,null,null,null,null,null,null,null,null,null,null,null,null,null,null,null,null,null,null,null,null,null,null,null,null,null,null,null,null,null,null,null,null,null,null,null,null,null,null,null,null,null,null,null,null,null,null,null,null,null,null,null,null,null,null,null,null,null,null,null,null,null,null,null,null,null,null,null,null,null,null,null,null,null,null,null,null,null,null,null,null,null,null,null,null,null,null,null,null,null,null,null,null,null,null,null,null,null,null,null,null,null,null,null,null,null,null,null,null,null,null,null,null,null,null,null,null,null,null,null,null,null,null,null,null,null,null,null,null,null,null,null,null,null,null,null,null,null,null,null,null,null,null,null,null,null,null,null,null,null,null,null,994.11]
[null,null,null,null,null,null,null,null,null,null,null,null,null,null,null,null,null,null,null,null,null,null,null,null,null,null,null,null,null,null,null,null,null,null,null,null,null,null,null,null,null,null,null,null,null,null,null,null,null,null,null,null,null,null,null,null,null,null,null,null,null,null,null,null,null,null,null,null,null,null,null,null,null,null,null,null,null,null,null,null,null,null,null,null,null,null,null,null,null,null,null,null,null,null,null,null,null,null,null,null,null,null,null,null,null,null,null,null,null,null,null,null,null,null,null,null,null,null,null,null,null,null,null,null,null,null,null,null,null,null,null,null,null,null,null,null,null,null,null,null,null,null,null,null,null,null,null,null,null,null,null,null,null,null,null,null,null,null,994.11]
[null,null,null,null,null,null,null,null,null,null,null,null,null,null,null,null,null,null,null,null,null,null,null,null,null,null,null,null,null,null,null,null,null,null,null,null,null,null,null,null,null,null,null,null,null,null,null,null,null,null,null,null,null,null,null,null,null,null,null,null,null,null,null,null,null,null,null,null,null,null,null,null,null,null,null,null,null,null,null,null,null,null,null,null,null,null,null,null,null,null,null,null,null,null,null,null,null,null,null,null,null,null,null,null,null,null,null,null,null,null,null,null,null,null,null,null,null,null,null,null,null,null,null,null,null,null,null,null,null,null,null,null,null,null,null,null,null,null,null,null,null,null,null,null,null,null,null,null,null,null,null,null,null,null,null,null,null,null,994.11]
[null,null,null,null,null,null,null,null,null,null,null,null,null,null,null,null,null,null,null,null,null,null,null,null,null,null,null,null,null,null,null,null,null,null,null,null,null,null,null,null,null,null,null,null,null,null,null,null,null,null,null,null,null,null,null,null,null,null,null,null,null,null,null,null,null,null,null,null,null,null,null,null,null,null,null,null,null,null,null,null,null,null,null,null,null,null,null,null,null,null,null,null,null,null,null,null,null,null,null,null,null,null,null,null,null,null,null,null,null,null,null,null,null,null,null,null,null,null,null,null,null,null,null,null,null,null,null,null,null,null,null,null,null,null,null,null,null,null,null,null,null,null,null,null,null,null,null,null,null,null,null,null,null,null,null,null,null,null,994.11]
{"$rows_left_out":243}