{"text_format":"1","workbook":"xlsx","n_sheets":21,"sheets":["Main","InPortfolio","InTrn","InFund","InSett","InJournal","InTB","InPricing","BS","PL","CashFlow","FVTPL","Equities","CIS","BND","CSH&Deposit","TotalEQT","Transaction","Segment","Segment2","FinancialInst"],"not_rendered":{"charts":0,"images":7,"macros":1,"external_links":1,"defined_names":139,"comments":0,"pivot_tables":4},"unopened":[],"bounds":{"document_bytes":16777216,"sheet_cells":100000,"rows_first":2000,"rows_last":500,"rows_between":2000,"halvings":0,"cell_chars":16384,"cell_head_chars":4096},"cells_cut":0,"cells_raw":0,"read":"whole","date_system":"1900"}

{"sheet":"Main","index":0,"n_rows":18,"n_cols":9,"rows_kept":18,"cut":false,"hidden":false,"merged":[[2,5,2,8]]}
[]
[null,"Interim","Report"]
[null,null,null,null,null,"Report Sheet Control Table"]
[null,null,null,null,null,"* Please sheet(s) to print"]
[null,null,null,null,null,"Sheet","YES/NO","Start Row","Last Col"]
[null,"Company :","NOMURA ASSET MANAGEMENT MALAYSIA SDN BHD",{"$f":"VLOOKUP(FundCode,InFund!A:I,7,0)","v":"NM"},null,"BS","YES"]
[null,"Fund :","SOCSO",{"$f":"VLOOKUP(FundCode,InFund!A:I,6,0)","v":"2020-12-31"},null,"PL","YES"]
[null,"Fund Name : ",{"$f":"VLOOKUP(FundCode,InFund!A:I,2,0)","v":"PERTUBUHAN KESELAMATAN SOCIAL(SOCSO)"},{"$f":"DATE(YEAR(ValueDate)-1,MONTH(ValueDate),DAY(ValueDate))","v":"2020-04-30"},null,"CashFlow","YES"]
{"$rows_left_out":11}
{"sheet":"InPortfolio","index":1,"n_rows":67,"n_cols":92,"rows_kept":67,"cut":false,"hidden":false,"merged":[]}
["qProductType","qFundCode","qStockCode","UnitFaceValue","MarketValueSC","MarketValueFC","qFundGrpCode","ExchangeRate","LCD","NCD","MaturityDateCSH","CostFC","CostSC","AccruedInterestFC","AccruedInterestSC","UnrealisedGainsStock","UnrealisedGainsExchg","PriceCurr","FundName","FundCurrency","MaxTenor","qCompanyID","StockName","StockCurrency","qAssetClass","AssetClassDesc","SectorName","Frequency","ExcelBasis","Coupon","MaturityDateBND","Term","qCPCode","CPName","CurrencyName","ProductTypeDesc","EQTSource","AmortAccreation","SecDesc","ExPreAcq","ExPreAcqSC","IssuedSize","Exchange","IslamicFlag","qStockType","Board","qBondType","BndDesc","qManagerCode","qCountryID","FundDesc","Rating","NAV","qCshType","CshTypeDesc","ValuationGL","UTFlag","qIntSector","ValuationMethod","fPercNAV","PurchaseYTM","PurchaseDate","MarketValueDate","BookValue","ValueYTM","ValGains","PreAcqSC","PreAcqFC","FundGrpName","LastMarketValue","Basis","fRefPrice","Diminution","qAssetAccType","Islamic","TradeDate","RatingAgency","qRank","qIssuerCode","qInvType","ISINCode","BursaCode","TrnTradeDate","LocalStockCode","IssueDate","Callabledate","LstAccIntSC","LstAmortAcc","LstBookValue","qMasterID","TrnLCD","CountryName"]
["CSH","SOCSO","RPF*MYR*PBK",6800000,6800326.0300000003,6800326.0300000003,"sFundCode",1,"3000-01-01","3000-01-01","2021-05-03",6800000,6800000,326.02999999999997,326.02999999999997,0,0,0,"PERTUBUHAN KESELAMATAN SOCIAL(SOCSO)","MYR",365,"NM","RPF*MYR*PBK","MYR","CSH","Cash","OTHERS",null,null,null,null,null,"PBK","PUBLIC BANK","Ringgit Malaysia","MONEY MARKET",1,0,"RPF*MYR*PBK",6800978.0800000001,6800978.0800000001,0,null,0,null,null,null,null,"NAMM","MY","PERTUBUHAN KESELAMATAN SOCIAL(SOCSO)",null,184713469.94,"RPF","Short Term Placement",false,0,"0",0,3.6815539398447403,1.7500000000000002E-2,"2021-04-30","2021-04-30",6800326.0300000003,0,978.08,0,0,"PERTUBUHAN KESELAMATAN SOCIAL(SOCSO)",0,365,1,0,210,0,"2021-04-30",null,null,"N/A","FVTPL","N/A",null,44313,null,null,null,null,null,null,"CSH*210401027",null,"MALAYSIA"]
["EQT","SOCSO",6575740,792590,5777981.0999999996,5777981.0999999996,"sFundCode",1,"3000-01-01","3000-01-01","3000-01-01",3611204.47,3611204.47,0,0,2166776.63,0,7.29,"PERTUBUHAN KESELAMATAN SOCIAL(SOCSO)","MYR",365,"NM","MEGA FIRST CORP BHD","MYR","EQT","Equity","UTILITIES",null,null,null,null,null,null,null,"Ringgit Malaysia","EQUITY",1,0,"MEGA FIRST CORP BHD",3611204.47,3611204.47,473678751,"XKLS",0,"ORD","MB",null,null,"NAMM","MY","PERTUBUHAN KESELAMATAN SOCIAL(SOCSO)",null,184713469.94,null,null,false,0,"13",0,3.1280778287998414,0,"2020-12-31","2021-04-30",3611204.47,0,-39629.5,0,0,"PERTUBUHAN KESELAMATAN SOCIAL(SOCSO)",0,null,0,0,10,0,"2020-12-31",null,null,"N/A","FVTPL","MYL3069OO001","3069",44194,null,null,null,0,0,3611204.47,"SOCSO*6575740",null,"MALAYSIA"]
["EQT","SOCSO",6658317,600000,3498000,3498000,"sFundCode",1,"3000-01-01","3000-01-01","3000-01-01",3185014.68,3185014.68,0,0,312985.32,0,5.83,"PERTUBUHAN KESELAMATAN SOCIAL(SOCSO)","MYR",365,"NM","PENTAMASTER CORP BHD","MYR","EQT","Equity","TECHNOLOGY",null,null,null,null,null,null,null,"Ringgit Malaysia","EQUITY",1,0,"PENTAMASTER CORP BHD",3185014.68,3185014.68,712317149,"XKLS",0,"ORD","MB",null,null,"NAMM","MY","PERTUBUHAN KESELAMATAN SOCIAL(SOCSO)",null,184713469.94,null,null,false,0,"10",0,1.8937438623919773,0,"2020-12-31","2021-04-30",3185014.68,0,-102000,0,0,"PERTUBUHAN KESELAMATAN SOCIAL(SOCSO)",0,null,0,0,10,0,"2020-12-31",null,null,"N/A","FVTPL","MYL7160OO004","7160",44194,null,null,null,0,0,3185014.68,"SOCSO*6658317",null,"MALAYSIA"]
["EQT","SOCSO",6703972,163000,2565620,2565620,"sFundCode",1,"3000-01-01","3000-01-01","3000-01-01",2819929.99,2819929.99,0,0,-254309.99,0,15.74,"PERTUBUHAN KESELAMATAN SOCIAL(SOCSO)","MYR",365,"NM","PETRONAS GAS BHD","MYR","EQT","Equity","UTILITIES",null,null,null,null,null,null,null,"Ringgit Malaysia","EQUITY",1,0,"PETRONAS GAS BHD",2819929.99,2819929.99,1978731915,"XKLS",0,"ORD","MB",null,null,"NAMM","MY","PERTUBUHAN KESELAMATAN SOCIAL(SOCSO)",null,184713469.94,null,null,false,0,"13",0,1.3889728782819053,0,"2020-12-31","2021-04-30",2819929.99,0,-6520,0,0,"PERTUBUHAN KESELAMATAN SOCIAL(SOCSO)",0,null,0,0,10,0,"2020-12-31",null,null,"N/A","FVTPL","MYL6033OO004","6033",44194,null,null,null,0,0,2819929.99,"SOCSO*6703972",null,"MALAYSIA"]
["EQT","SOCSO",6868398,780000,4453800,4453800,"sFundCode",1,"3000-01-01","3000-01-01","3000-01-01",3586394.96,3586394.96,0,0,867405.04,0,5.71,"PERTUBUHAN KESELAMATAN SOCIAL(SOCSO)","MYR",365,"NM","TELEKOM MALAYSIA BHD","MYR","EQT","Equity","TELECOMMUNICATIONS & MEDIA",null,null,null,null,null,null,null,"Ringgit Malaysia","EQUITY",1,0,"TELEKOM MALAYSIA BHD",3586394.96,3586394.96,3773700923,"XKLS",0,"ORD","MB",null,null,"NAMM","MY","PERTUBUHAN KESELAMATAN SOCIAL(SOCSO)",null,184713469.94,null,null,false,0,"11",0,2.4111939434881045,0,"2020-12-31","2021-04-30",3586394.96,0,-7800,0,0,"PERTUBUHAN KESELAMATAN SOCIAL(SOCSO)",0,null,0,0,10,0,"2020-12-31",null,null,"N/A","FVTPL","MYL4863OO006","4863",44194,null,null,null,0,0,3586394.96,"SOCSO*6868398",null,"MALAYSIA"]
["EQT","SOCSO",6904612,1135525,11309829,11309829,"sFundCode",1,"3000-01-01","3000-01-01","3000-01-01",11832170.5,11832170.5,0,0,-522341.5,0,9.9600000000000009,"PERTUBUHAN KESELAMATAN SOCIAL(SOCSO)","MYR",365,"NM","TENAGA NASIONAL BHD","MYR","EQT","Equity","UTILITIES",null,null,null,null,null,null,null,"Ringgit Malaysia","EQUITY",1,0,"TENAGA NASIONAL BHD",11832170.5,11832170.5,5704653871,"XKLS",0,"ORD","MB",null,null,"NAMM","MY","PERTUBUHAN KESELAMATAN SOCIAL(SOCSO)",null,184713469.94,null,null,false,0,"13",0,6.1229043034456243,0,"2020-12-31","2021-04-30",11832170.5,0,-34065.75,0,0,"PERTUBUHAN KESELAMATAN SOCIAL(SOCSO)",0,null,0,0,10,0,"2020-12-31",null,null,"N/A","FVTPL","MYL5347OO009","5347",44194,null,null,null,0,0,11832170.5,"SOCSO*6904612",null,"MALAYSIA"]
["EQT","SOCSO",6986717,980000,5115600,5115600,"sFundCode",1,"3000-01-01","3000-01-01","3000-01-01",5733703.4800000004,5733703.4800000004,0,0,-618103.48,0,5.22,"PERTUBUHAN KESELAMATAN SOCIAL(SOCSO)","MYR",365,"NM","YINSON HOLDINGS BHD","MYR","EQT","Equity","ENERGY",null,null,null,null,null,null,null,"Ringgit Malaysia","EQUITY",1,0,"YINSON HOLDINGS BHD",5733703.4800000004,5733703.4800000004,1065383373,"XKLS",0,"ORD","MB",null,null,"NAMM","MY","PERTUBUHAN KESELAMATAN SOCIAL(SOCSO)",null,184713469.94,null,null,false,0,"3",0,2.7694785884655229,0,"2020-12-31","2021-04-30",5733703.4800000004,0,-68600,0,0,"PERTUBUHAN KESELAMATAN SOCIAL(SOCSO)",0,null,0,0,10,0,"2020-12-31",null,null,"N/A","FVTPL","MYL7293OO003","7293",44194,null,null,null,0,0,5733703.4800000004,"SOCSO*6986717",null,"MALAYSIA"]
{"$rows_left_out":60}
{"sheet":"InTrn","index":2,"n_rows":86,"n_cols":44,"rows_kept":86,"cut":false,"hidden":false,"merged":[]}
["sPeriod","qEventTrxID","qTrnCode","qProductType","qFundCode","TradeDate","ValueDate","PayDate","RevDate","AccDate","PosTrnMatDt","qCPCode","SettCurrency","qStockCode","ExchgRateSF","TranYTM","UnitFaceValue","CostSC","CostFC","SCGrossProceed","SCNetProceed","TranProceed","TranGains","BrokerageFee","ClearingFee","StampDuty","CustodianFeeCC","CustodianFeeFC","TranIncome","TranBuyCapital","TranFXGnL","CrossTrade","ContractNote","qAssetAccType","TranPreAcq","qMasterID","TranAmortAccre","Remarks","qInvType","PurchaseDate","CummFV","FCNetProceed","FCGrossProceed","CPName"]
["Cur","EQT*210400849","SS","EQT","SOCSO","2021-04-13","2021-04-13","2021-04-15","3000-01-01","2021-04-13","01/01/3000",7,"MYR","B0KLDR0",1,0,-33600,-514637.31,-514637.31,542928.96,541702.82999999996,0,-27065.52,814.39,0,200,0,0,0,-514637.31,0,0,null,10,0,"SOCSO*B0KLDR0",0,null,"FVTPL","2020-12-31",281200,541702.82999999996,542928.96,"NOMURA SECURITIES"]
["Cur","EQT*210400921","SS","EQT","SOCSO","2021-04-14","2021-04-14","2021-04-16","3000-01-01","2021-04-14","01/01/3000",7,"MYR","B0KLDR0",1,0,-9700,-148570.89000000001,-148570.89000000001,154126.21,153679.91,0,-5109.0200000000004,231.19,0,155,0,0,0,-148570.89000000001,0,0,null,10,0,"SOCSO*B0KLDR0",0,null,"FVTPL","2020-12-31",271500,153679.91,154126.21,"NOMURA SECURITIES"]
["Cur","EQT*210401008","SS","EQT","SOCSO","2021-04-15","2021-04-15","2021-04-19","3000-01-01","2021-04-15","01/01/3000",7,"MYR","B0KLDR0",1,0,-6700,-102621.13,-102621.13,106111.92,105804.36,0,-3183.23,159.16999999999999,0,107,0,0,0,-102621.13,0,0,null,10,0,"SOCSO*B0KLDR0",0,null,"FVTPL","2020-12-31",264800,105804.36,106111.92,"NOMURA SECURITIES"]
["Cur","EQT*210400667","SP","EQT","SOCSO","2021-04-09","2021-04-09","2021-04-13","3000-01-01","2021-04-09","01/01/3000","CIGK","MYR",6086242,1,0,63900,267749.21000000002,267749.21000000002,-267044.49,-267749.21000000002,0,0,400.57,0,200,0,0,0,267749.21000000002,0,0,null,10,0,"SOCSO*6086242",0,null,"FVTPL","2021-04-09",63900,-267749.21000000002,-267044.49,"CIMB-GK"]
["Cur","EQT*210400848","SP","EQT","SOCSO","2021-04-13","2021-04-13","2021-04-15","3000-01-01","2021-04-13","01/01/3000","CLS","MYR",6086242,1,0,19700,84949.19,84949.19,-84704.09,-84949.19,0,0,127.06,0,85,0,0,0,84949.19,0,0,null,10,0,"SOCSO*6086242",0,null,"FVTPL","2021-04-09",308700,-84949.19,-84704.09,"CLSA"]
["Cur","EQT*210400920","SP","EQT","SOCSO","2021-04-14","2021-04-14","2021-04-16","3000-01-01","2021-04-14","01/01/3000","CLS","MYR",6086242,1,0,174100,746110.96,746110.96,-744503.83,-746110.96,0,0,1116.76,0,200,0,0,0,746110.96,0,0,null,10,0,"SOCSO*6086242",0,null,"FVTPL","2021-04-09",482800,-746110.96,-744503.83,"CLSA"]
["Cur","EQT*210401006","SP","EQT","SOCSO","2021-04-15","2021-04-15","2021-04-19","3000-01-01","2021-04-15","01/01/3000","CLS","MYR",6086242,1,0,117200,496575.95,496575.95,-495439.56,-496575.95,0,0,743.16,0,200,0,0,0,496575.95,0,0,null,10,0,"SOCSO*6086242",0,null,"FVTPL","2021-04-09",600000,-496575.95,-495439.56,"CLSA"]
{"$rows_left_out":79}
{"sheet":"InFund","index":3,"n_rows":57,"n_cols":9,"rows_kept":57,"cut":false,"hidden":false,"merged":[]}
["qFundCode","FundName","qFundType","Islamic","FinanceYrStart","FinanceYrEnd","qCompanyID","RollEOYFlag","FundCurrency"]
["AJC-MASHAREQ","ALJAZIRA JAPANESE EQUITY FUND",1,1,"2013-03-01","2020-12-31","NI",1,"USD"]
["BNM-ICLIF","IFM ICLIF SHARIAH EQUITY NOMURA-I",1,1,"2013-08-26","2020-12-31","NI",1,"MYR"]
["BNM-ICLIF-FI2","IFM ICLIF CORP BOND NOMURA",2,0,"2021-01-04","2020-12-31","NM",1,"MYR"]
["BNM-INCEIF","IFM INCEIF SHARIAH EQUITY NOMURA-I",1,1,"2013-08-26","2020-12-31","NI",1,"MYR"]
["BNM-INCEIF-FI","IFM INCEIF SUKUK NOMURA-I",2,1,"2016-11-28","2020-12-31","NI",1,"MYR"]
["BNM-MEDF-FI","IFM MEDF CORP BOND NOMURA",2,0,"2016-11-28","2020-12-31","NM",1,"MYR"]
["BNMMF","IFM MEDF CONV EQUITY NOMURA",1,0,"2011-08-08","2020-12-31","NM",1,"MYR"]
{"$rows_left_out":50}
{"sheet":"InSett","index":4,"n_rows":91,"n_cols":22,"rows_kept":91,"cut":false,"hidden":false,"merged":[]}
["sPeriod","qSettleID","AccDate","qEventTrxID","qFundCode","qCurrencyCode","BankedAmt","BankGL","FXGainsAmt","qTrnCode","TranProceed","TranBuyCapital","TranIncome","TranGains","TranAmortAccre","TranPreAcq","TranExpenses","TranFXGnL","SCNetProceed","UnitFaceValue","SPeriod1","StockName"]
["Cur","STM*210402450","2021-04-27","CSH*210400922","SOCSO","MYR",-6800000,"SOCSO-MYR000-500000",0,"RP",0,6800000,0,0,0,0,0,0,-6800000,6800000,"cur","RPF*MYR*PBK"]
["Cur","STM*210402540","2021-04-28","CSH*210400965","SOCSO","MYR",6800326.0300000003,"SOCSO-MYR000-500000",0,"RM",0,-6800000,-326.02999999999997,0,0,0,0,0,6800326.0300000003,-6800000,"cur","RPF*MYR*PBK"]
["Cur","STM*210402563","2021-04-28","CSH*210400972","SOCSO","MYR",-6700000,"SOCSO-MYR000-500000",0,"RP",0,6700000,0,0,0,0,0,0,-6700000,6700000,"cur","RPF*MYR*PBK"]
["Cur","STM*210402670","2021-04-30","CSH*210401020","SOCSO","MYR",6700642.4699999997,"SOCSO-MYR000-500000",0,"RM",0,-6700000,-642.47,0,0,0,0,0,6700642.4699999997,-6700000,"cur","RPF*MYR*PBK"]
["Cur","STM*210402683","2021-04-30","CSH*210401027","SOCSO","MYR",-6800000,"SOCSO-MYR000-500000",0,"RP",0,6800000,0,0,0,0,0,0,-6800000,6800000,"cur","RPF*MYR*PBK"]
["Cur","STM*210402344","2021-04-26","EQT*210401440","SOCSO","MYR",105575.7,"SOCSO-MYR000-500000",0,"SS",0,-101089.47,0,-4486.2299999999996,0,0,0,0,105575.7,-6600,"cur","VITROX CORP BHD"]
["Cur","STM*210402467","2021-04-27","EQT*210401522","SOCSO","MYR",462814.52,"SOCSO-MYR000-500000",0,"SS",0,-434991.06,0,-27823.46,0,0,0,0,462814.52,-28400,"cur","VITROX CORP BHD"]
{"$rows_left_out":84}
{"sheet":"InJournal","index":5,"n_rows":1,"n_cols":18,"rows_kept":1,"cut":false,"hidden":false,"merged":[]}
["SPeriod","GLKey","JournalID","GLCode","qFundCode","qCurrencyCode","AccDate","Description","Amount","TrialBalanceRef","UnitPricingFlag","ApprovalStatus","AppDtTime","AppOrRejBy","AutoPostFlag","FirstGL","ShortGL","CPName"]

{"sheet":"InTB","index":6,"n_rows":56,"n_cols":13,"rows_kept":56,"cut":false,"hidden":false,"merged":[]}
["qFundCode","TBDate","qAssetRptGrp","qCurrencyCode","GLCode","qAssetAccType","ShortGL","CreditAmt","DebitAmt","ExRate","ValuationGL","TBType","SumDrCr"]
["SOCSO","2021-03-31","EQT","MYR","SOCSO-MYR010-100000","010","100000",-71214614.950000003,248226091.33000001,1,false,"BS ",177011476.38]
["SOCSO","2021-03-31","MM","MYR","SOCSO-MYR210-100000","210","100000",-268005322.03,277105322.02999997,1,false,"BS ",9100000]
["SOCSO","2021-03-31","EQT","MYR","SOCSO-MYR010-101000","010","101000",-7675134.04,0,1,false,"BS ",-7675134.04]
["SOCSO","2021-03-31","MM","MYR","SOCSO-MYR210-139000","210","139000",0,436.3,1,true,"BS ",436.3]
["SOCSO","2021-03-31","EQT","MYR","SOCSO-MYR010-189000","010","189000",-4292760.1900000004,12546894.83,1,true,"BS ",8254134.6399999997]
["SOCSO","2021-03-31","EQT","MYR","SOCSO-MYR010-200000","010","200000",-5846143.8300000001,6841322.6399999997,1,false,"BS ",995178.81]
["SOCSO","2021-03-31","EQT","MYR","SOCSO-MYR010-299000","010","299000",-1888460.06,2711123.37,1,false,"BS ",822663.31]
{"$rows_left_out":49}
{"sheet":"InPricing","index":7,"n_rows":2,"n_cols":11,"rows_kept":2,"cut":false,"hidden":false,"merged":[]}
["UTFlag","TotalUnits","StartTotalUnits","LastUnits","LstStartTotalUnits","FundName","qFundCode","BuyPrice","StartBuyPrice","LstBuyPrice","LstStartBuyPrice"]
[0,0,0,0,0,"PERTUBUHAN KESELAMATAN SOCIAL(SOCSO)","SOCSO",0,0,0,0]

{"sheet":"BS","index":8,"n_rows":106,"n_cols":9,"rows_kept":106,"cut":false,"hidden":false,"merged":[[1,0,1,3],[2,0,2,1],[3,0,3,1]]}
[]
[{"$f":"UPPER(CompanyName)","v":"NOMURA ASSET MANAGEMENT MALAYSIA SDN BHD"}]
["Condensed Statement of Financial Position"]
[{"$f":"\"as at \" & (TEXT(ValueDate,\"DD.MM.YYYY\"))","v":"as at 30.04.2021"}]
[]
[null,null,{"$f":"TEXT(ValueDate,\"dd.mm.yyyy\")","v":"30.04.2021"},{"$f":"TEXT(LstValueDt,\"dd.mm.yyyy\")","v":"30.04.2020"}]
[null,null,"RM","RM"]
["ASSETS"]
{"$rows_left_out":99}
{"sheet":"PL","index":9,"n_rows":97,"n_cols":11,"rows_kept":97,"cut":false,"hidden":false,"merged":[[1,0,1,3],[2,0,2,1],[3,0,3,1]]}
[]
[{"$f":"UPPER(CompanyName)","v":"NOMURA ASSET MANAGEMENT MALAYSIA SDN BHD"}]
["Condensed Statement of Comprehensive Income"]
[{"$f":"\"for the six-month period from\" & (TEXT(StartDate,\"DD MMMM YYYY\")) & \" to \" & (TEXT(ValueDate,\"DD MMMM YYYY\"))","v":"for the six-month period from01 April 2021 to 30 April 2021"}]
[]
[null,null,{"$f":" (TEXT(StartDate,\"DD.MM.YYYY\")) & \" to \" &  (TEXT(ValueDate,\"DD.MM.YYYY\"))","v":"01.04.2021 to 30.04.2021"},{"$f":" (TEXT(LstStartDt,\"DD.MM.YYYY\")) & \" to \" &  (TEXT(LstValueDt,\"DD.MM.YYYY\"))","v":"01.04.2020 to 30.04.2020"},"Reference",null,{"$f":"ValueDate","v":"2021-04-30"},{"$f":"StartDate-1","v":"2021-03-31"},{"$f":"LstValueDt","v":"2020-04-30"},{"$f":"LstStartDt-1","v":"2020-03-31"}]
[null,"Note",{"$f":"FundCur","v":"MYR"},{"$f":"FundCur","v":"MYR"}]
[null,null,null,null,"Asset","ShortGL"]
{"$rows_left_out":90}
{"sheet":"CashFlow","index":10,"n_rows":61,"n_cols":7,"rows_kept":61,"cut":false,"hidden":false,"merged":[[1,0,1,3]]}
[]
[{"$f":"UPPER(CompanyName)","v":"NOMURA ASSET MANAGEMENT MALAYSIA SDN BHD"}]
["Condensed Statement of Cash Flows"]
[{"$f":"\" from \" & TEXT(StartDate,\"dd mmmm yyyy\") & \" to \" & TEXT(ValueDate,\"dd mmmm yyyy\")","v":" from 01 April 2021 to 30 April 2021"}]
[]
[null,null,{"$f":" (TEXT(StartDate,\"DD.MM.YYYY\")) & \" to \" &  (TEXT(ValueDate,\"DD.MM.YYYY\"))","v":"01.04.2021 to 30.04.2021"},{"$f":" (TEXT(LstStartDt,\"DD.MM.YYYY\")) & \" to \" &  (TEXT(LstValueDt,\"DD.MM.YYYY\"))","v":"01.04.2020 to 30.04.2020"}]
[null,"Note",{"$f":"FundCur","v":"MYR"},{"$f":"FundCur","v":"MYR"}]
[]
{"$rows_left_out":54}
{"sheet":"FVTPL","index":11,"n_rows":43,"n_cols":3,"rows_kept":43,"cut":false,"hidden":false,"merged":[[1,0,1,2]]}
[]
[{"$f":"UPPER(CompanyName)","v":"NOMURA ASSET MANAGEMENT MALAYSIA SDN BHD"}]
[]
["MANAGEMENT FEE"]
[]
[null,{"$f":"TEXT(ValueDate,\"YYYY\")","v":"2021"},{"$f":"TEXT(LstValueDt,\"YYYY\")","v":"2020"}]
[null,{"$f":"FundCur","v":"MYR"},{"$f":"FundCur","v":"MYR"}]
[]
{"$rows_left_out":36}
{"sheet":"Equities","index":12,"n_rows":82,"n_cols":23,"rows_kept":82,"cut":false,"hidden":false,"merged":[[1,0,1,11],[5,4,5,6],[5,7,5,9]]}
[{"$f":"IF(O1=\"Grand Total\",\"QUOTED EQUITIES TOTAL\",O1)","v":0},{"$f":"P1","v":0},{"$f":"Q1","v":0},{"$f":"U1","v":0},{"$f":"S1","v":0},{"$f":"IF(LEN(C1)>1,G1/D1,\"\")","v":""},{"$f":"V1","v":0},{"$f":"T1","v":0},{"$f":"IF(LEN(C1)>1,J1/D1,\"\")","v":""},{"$f":"W1","v":0},{"$f":"(J1/MAX(J:J))*100","v":0},{"$f":"J1-G1","v":0}]
[{"$f":"FundName","v":"PERTUBUHAN KESELAMATAN SOCIAL(SOCSO)"}]
[]
["(a) QUOTED EQUITIES"]
[]
[null,"Counter","Stock Code","Quantity","Historic Cost",null,null,"Market Value",null,null,null,null,null,null,"qProductType","EQT"]
[null,null,null,null,"Cost","Cost Price","Total Cost","Current Value","Closing Price","Current Value","% of Total Fund","Unrealised Profit / (Loss)",null,null,"qAssetClass","(Multiple Items)"]
[null,null,null,null,"SC",{"$f":"FundCur","v":"MYR"},{"$f":"FundCur","v":"MYR"},"SC",{"$f":"FundCur","v":"MYR"},{"$f":"FundCur","v":"MYR"},null,{"$f":"FundCur","v":"MYR"}]
{"$rows_left_out":75}
{"sheet":"CIS","index":13,"n_rows":10,"n_cols":23,"rows_kept":10,"cut":false,"hidden":false,"merged":[[1,0,1,11],[5,4,5,6],[5,7,5,9]]}
[{"$f":"IF(O1=\"Grand Total\",\"COLLECTIVE INVESTMENT SCHEMES TOTAL\",O1)","v":0},{"$f":"P1","v":0},{"$f":"Q1","v":0},{"$f":"U1","v":0},{"$f":"S1","v":0},{"$f":"IF(LEN(C1)>1,G1/D1,\"\")","v":""},{"$f":"V1","v":0},{"$f":"T1","v":0},{"$f":"IF(LEN(C1)>1,J1/D1,\"\")","v":""},{"$f":"W1","v":0},{"$f":"IF(ISERROR((J1/MAX(J:J))*100)=TRUE,\"\",(J1/MAX(J:J))*100)","v":""},{"$f":"J1-G1","v":0}]
[{"$f":"FundName","v":"PERTUBUHAN KESELAMATAN SOCIAL(SOCSO)"}]
[]
["(b) COLLECTIVE INVESTMENT SCHEMES"]
[]
[null,"Counter","Stock Code","Quantity","Historic Cost",null,null,"Market Value",null,null,null,null,null,null,"qProductType","EQT"]
[null,null,null,null,"Cost","Cost Price","Total Cost","Current Value","Closing Price","Current Value","% of Total Fund","Unrealised Profit / (Loss)",null,null,"qAssetClass","(Multiple Items)"]
[null,null,null,null,"SC",{"$f":"FundCur","v":"MYR"},{"$f":"FundCur","v":"MYR"},"SC",{"$f":"FundCur","v":"MYR"},{"$f":"FundCur","v":"MYR"},null,{"$f":"FundCur","v":"MYR"}]
{"$rows_left_out":3}
{"sheet":"BND","index":14,"n_rows":10,"n_cols":32,"rows_kept":10,"cut":false,"hidden":false,"merged":[[1,0,1,14]]}
[{"$f":"IF(R1=\"Grand Total\",IF(BNDSUKUK=1,\"UNQUOTED SUKUK TOTAL\",\"UNQUOTED BOND TOTAL\"),R1)","v":0},{"$f":"S1","v":0},{"$f":"T1","v":"00:00:00"},{"$f":"AA1","v":0},{"$f":"U1","v":"00:00:00"},{"$f":"V1","v":"00:00:00"},{"$f":"W1","v":0},{"$f":"X1","v":0},{"$f":"Y1","v":0},{"$f":"IF(D1=0,0,K1/D1)","v":0},{"$f":"AB1","v":0},{"$f":"Z1-AD1-AE1","v":0},{"$f":"IF(D1=0,0,N1/D1)","v":0},{"$f":"AC1-AD1-AE1","v":0},{"$f":"AF1","v":0}]
[{"$f":"FundName","v":"PERTUBUHAN KESELAMATAN SOCIAL(SOCSO)"}]
[]
[{"$f":"\"UNQUOTED  \" & UPPER(BNDSUKUK)","v":"UNQUOTED  BOND"}]
[]
[null,"Issuer","Code"," Nominal Value","Issue Date","Maturity Date","Coupon","PurchaseYTM","ValueYTM","Purchase Price","Principal Cost","Book Value","Market Price","Market Value","UnRealised Profit /(Loss)"]
[null,null,null,null,null,null,null,null,null,{"$f":"FundCur","v":"MYR"},"MYR","MYR","MYR","MYR","MYR",null,null,"qProductType","BND"]
[]
{"$rows_left_out":3}
{"sheet":"CSH&Deposit","index":15,"n_rows":28,"n_cols":7,"rows_kept":28,"cut":false,"hidden":false,"merged":[[1,0,1,2]]}
[]
[{"$f":"UPPER(CompanyName)","v":"NOMURA ASSET MANAGEMENT MALAYSIA SDN BHD"}]
["DEPOSITS WITH FINANCIAL INSTITUTIONS"]
[]
[null,{"$f":"ValueDate","v":"2021-04-30"},{"$f":"LstValueDt","v":"2020-04-30"},"Reference",null,{"$f":"ValueDate","v":"2021-04-30"},{"$f":"LstValueDt","v":"2020-04-30"}]
[null,{"$f":"FundCur","v":"MYR"},{"$f":"FundCur","v":"MYR"},"Asset","ShortGL"]
[]
["A licensed banks related to the Manager",{"$f":"F8","v":6800000},{"$f":"G8","v":0},"2**","10000*",{"$f":"SUM(SUMIFS(InTB!M:M,InTB!B:B,ValueDate,InTB!F:F,D8,InTB!G:G,E8))","v":6800000},{"$f":"SUM(SUMIFS(InTB!M:M,InTB!B:B,LstValueDt,InTB!F:F,D8,InTB!G:G,E8))","v":0}]
{"$rows_left_out":21}
{"sheet":"TotalEQT","index":16,"n_rows":23,"n_cols":5,"rows_kept":23,"cut":false,"hidden":false,"merged":[[1,0,1,4],[15,1,15,2],[15,3,15,4]]}
[]
[{"$f":"UPPER(CompanyName)","v":"NOMURA ASSET MANAGEMENT MALAYSIA SDN BHD"}]
["TOTAL EQUITY"]
[]
[null,null,null,{"$f":"ValueDate","v":"2021-04-30"},{"$f":"LstValueDt","v":"2020-04-30"}]
[null,null,"Note",{"$f":"FundCur","v":"MYR"},{"$f":"FundCur","v":"MYR"}]
["NAV attributable to unitholders is represented by:"]
["    Unitholders' capital",null,null,{"$f":"BS!C95","v":68376649.209999993},{"$f":"BS!D95","v":0}]
{"$rows_left_out":16}
{"sheet":"Transaction","index":17,"n_rows":17,"n_cols":11,"rows_kept":17,"cut":false,"hidden":false,"merged":[[1,0,1,4],[4,1,4,2],[4,3,4,4]]}
[{"$f":"G1","v":"00:00:00"},{"$f":"ABS(H1)","v":0},{"$f":"ABS(J1)","v":0},{"$f":"I1","v":0},{"$f":"K1","v":0}]
[{"$f":"UPPER(CompanyName)","v":"NOMURA ASSET MANAGEMENT MALAYSIA SDN BHD"}]
["TRANSACTIONS WITH STOCKBROKING COMPANIES"]
[null,null,null,null,null,null,"sPeriod","Cur"]
[null,"Value of Trade",null,"Net brokerage commision and fees",null,null,"qTrnCode","(Multiple Items)"]
[null,{"$f":"FundCur","v":"MYR"},"%",{"$f":"FundCur","v":"MYR"},"%"]
[null,null,null,null,null,null,"Row Labels","Sum of FCGrossProceed","Sum of Fee","Sum of FCGrossProceed2","Sum of Fee2"]
["CIMB-GK",267044.49,0.31924541570322695,704.72000000003027,3.6141322046607353E-2,null,"CIMB-GK",-267044.49,704.72000000003027,0.31924541570322695,3.6141322046607353E-2]
{"$rows_left_out":10}
{"sheet":"Segment","index":18,"n_rows":41,"n_cols":5,"rows_kept":41,"cut":false,"hidden":false,"merged":[[1,0,1,4]]}
[]
[{"$f":"UPPER(CompanyName)","v":"NOMURA ASSET MANAGEMENT MALAYSIA SDN BHD"}]
["SEGMENT INFORMATION"]
[]
[null,"Quoted Shariah-compliant equity  securities and Shariah-based collective investment scheme",{"$f":"\"Unquoted  \" & BNDSUKUK","v":"Unquoted  bond"}," Deposits ","Total"]
[null,{"$f":"FundCur","v":"MYR"},{"$f":"FundCur","v":"MYR"},{"$f":"FundCur","v":"MYR"},{"$f":"FundCur","v":"MYR"}]
[{"$f":"TEXT(StartDate,\"dd.mm.yyyy\") & \" - \" & TEXT(ValueDate,\"dd.mm.yyyy\")","v":"01.04.2021 - 30.04.2021"}]
["Profit from bank balances and deposits",null,null,{"$f":"PL!C11+PL!C12","v":10466.509999999995},{"$f":"SUM(B8:D8)","v":10466.509999999995}]
{"$rows_left_out":34}
{"sheet":"Segment2","index":19,"n_rows":25,"n_cols":5,"rows_kept":25,"cut":false,"hidden":false,"merged":[[0,0,0,4]]}
[{"$f":"UPPER(CompanyName)","v":"NOMURA ASSET MANAGEMENT MALAYSIA SDN BHD"}]
["SEGMENT INFORMATION (continued)"]
[]
[null,null,null,{"$f":"TEXT(StartDate,\"dd.mm.yyyy\") & \" to \" & TEXT(ValueDate,\"dd.mm.yyyy\")","v":"01.04.2021 to 30.04.2021"},{"$f":"TEXT(LstStartDt,\"dd.mm.yyyy\") & \" to \" & TEXT(LstValueDt,\"dd.mm.yyyy\")","v":"01.04.2020 to 30.04.2020"}]
[null,null,null,{"$f":"FundCur","v":"MYR"},{"$f":"FundCur","v":"MYR"}]
["Net reportable segment operating income",null,null,{"$f":"PL!C32","v":-452445.97999999928},{"$f":"PL!D32","v":0}]
["Expenses",null,null,{"$f":"-PL!C75","v":0},{"$f":"-PL!D75","v":0}]
["Net income before taxation",null,null,{"$f":"D6+D7","v":-452445.97999999928},{"$f":"E6+E7","v":0}]
{"$rows_left_out":18}
{"sheet":"FinancialInst","index":20,"n_rows":33,"n_cols":5,"rows_kept":33,"cut":false,"hidden":false,"merged":[[1,0,1,4]]}
[]
[{"$f":"UPPER(CompanyName)","v":"NOMURA ASSET MANAGEMENT MALAYSIA SDN BHD"}]
["FINANCIAL INSTRUMENTS"]
["(a) Classification of financial instruments"]
[null,"Financial assets at FVTPL","Other receivables","Financial liabilities at amortised cost","Total"]
[null,{"$f":"FundCur","v":"MYR"},{"$f":"FundCur","v":"MYR"},{"$f":"FundCur","v":"MYR"},{"$f":"FundCur","v":"MYR"}]
["Assets"]
["Quoted investments",{"$f":"BS!C48-BS!C42","v":177720512.78},null,null,{"$f":"B8+C8+D8","v":177720512.78}]
{"$rows_left_out":25}