{"text_format":"1","workbook":"xlsx","n_sheets":9,"sheets":["Main","BS","PL","Label","InUP","InUPFee","InTB","InTBBase","InFund"],"not_rendered":{"charts":0,"images":1,"macros":1,"external_links":2,"defined_names":73,"comments":0,"pivot_tables":0},"unopened":[],"bounds":{"document_bytes":16777216,"sheet_cells":100000,"rows_first":2000,"rows_last":500,"rows_between":2000,"halvings":0,"cell_chars":16384,"cell_head_chars":4096},"cells_cut":0,"cells_raw":0,"read":"whole","date_system":"1900"}

{"sheet":"Main","index":0,"n_rows":17,"n_cols":13,"rows_kept":17,"cut":false,"hidden":false,"merged":[]}
["Total Class",{"$f":"MAX(K:K)","v":10}]
["Start",{"$f":"ADDRESS(ROW(K8),COLUMN(K8)+1,4)","v":"L8"}]
["End",{"$f":"ADDRESS(ROW(K8)+10-1,COLUMN(M8),4)","v":"M17"},null,null,null,null,null,"Multi Class Financial Statement"]
["Col Start",{"$f":"COLUMN(INDIRECT(ClassStart))","v":12}]
["Col End",{"$f":"COLUMN(INDIRECT(ClassEnd))","v":13}]
["Row Start",{"$f":"ROW(INDIRECT(ClassStart))","v":8},null,null,null,null,null,null,null,null,{"$f":"\"Class Details: \" & FundCode","v":"Class Details: BAPAC"}]
["Row End",{"$f":"ROW(INDIRECT(ClassEnd))","v":17},null,null,null,"Report Details",null,null,null,null,"No","Class","Currency"]
[null,null,null,null,null,null,null,null,null,null,1,"BAPACMYR","MYR"]
[null,null,null,null,null,"Company Name:","BIMB Investment Management Berhad",null,null,null,2,"BAPACUSD","USD"]
[null,null,null,null,null,"Company ID:","BI",null,null,null,3]
[null,null,null,null,null,"Fund Code:","BAPAC",null,null,null,4]
[null,null,null,null,null,"Fund Name:",{"$f":"VLOOKUP($G$11,InFund!$A:$I,MATCH(\"FundName\",InFund!$2:$2,0),0)","v":"BIMB-ARABESQUE ASIA PACIFIC SHARIAH-ESG EQUITY"},null,null,null,5]
[null,null,null,null,null,"Fund Currency:",{"$f":"VLOOKUP($G$11,InFund!$A:$I,MATCH(\"FundCurrency\",InFund!$2:$2,0),0)","v":"USD"},null,null,null,6]
[null,null,null,null,null,"Islamic Flag",{"$f":"VLOOKUP($G$11,InFund!$A:$I,MATCH(\"Islamic\",InFund!$2:$2,0),0)","v":1},null,null,null,7]
[null,null,null,null,null,"Last Financial Year End:",{"$f":"VLOOKUP(FundCode,InFund!A:G,7,0)","v":"2020-10-30"},null,null,null,8]
{"$rows_left_out":3}
{"sheet":"BS","index":1,"n_rows":122,"n_cols":21,"rows_kept":122,"cut":false,"hidden":false,"merged":[]}
[null,null,null,null,null,null,null,null,"GD1",{"$f":"Class1","v":"BAPACMYR"},{"$f":"Class2","v":"BAPACUSD"},{"$f":"Class3","v":0},{"$f":"Class4","v":0},{"$f":"Class5","v":0},{"$f":"Class6","v":0},{"$f":"Class7","v":0},{"$f":"Class8","v":0},{"$f":"Class9","v":0},{"$f":"Class10","v":0},{"$f":"FundCode","v":"BAPAC"}]
[]
[]
[null,null,"Balance Check",{"$f":"I101-I122","v":0}]
[null,null,null,null,null,{"$f":"CompanyName","v":"BIMB Investment Management Berhad"}]
[null,null,null,null,null,{"$f":"Main!$G$12","v":"BIMB-ARABESQUE ASIA PACIFIC SHARIAH-ESG EQUITY"}]
[null,null,null,null,null,"Balance Sheet"]
[null,null,null,null,null,{"$f":"\"For The Financial Period Ended \" & TEXT(ValueDate,\"dd mmmm yyyy\")","v":"For The Financial Period Ended 30 October 2020"}]
[]
[null,null,null,null,null,null,null,null,{"$f":"ValueDate","v":"2020-10-30"},"2020-10-30","2020-10-30","2020-10-30","2020-10-30","2020-10-30","2020-10-30","2020-10-30","2020-10-30","2020-10-30","2020-10-30","2020-10-30"]
[null,null,"AssetRptGrp","qCurrencyCode",null,null,null,null,{"$f":"FundCurrency","v":"USD"},{"$f":"\"Class \" & IF(ISNA(VLOOKUP(J$1,InUP!$A:$P,MATCH(BS!$D11,InUP!$2:$2,0),0)),\"\",VLOOKUP(J$1,InUP!$A:$P,MATCH(BS!$D11,InUP!$2:$2,0),0))","v":"Class MYR"},{"$f":"\"Class \" & IF(ISNA(VLOOKUP(K$1,InUP!$A:$P,MATCH(BS!$D11,InUP!$2:$2,0),0)),\"\",VLOOKUP(K$1,InUP!$A:$P,MATCH(BS!$D11,InUP!$2:$2,0),0))","v":"Class USD"},{"$f":"\"Class \" & IF(ISNA(VLOOKUP(L$1,InUP!$A:$P,MATCH(BS!$D11,InUP!$2:$2,0),0)),\"\",VLOOKUP(L$1,InUP!$A:$P,MATCH(BS!$D11,InUP!$2:$2,0),0))","v":"Class "},{"$f":"\"Class \" & IF(ISNA(VLOOKUP(M$1,InUP!$A:$P,MATCH(BS!$D11,InUP!$2:$2,0),0)),\"\",VLOOKUP(M$1,InUP!$A:$P,MATCH(BS!$D11,InUP!$2:$2,0),0))","v":"Class "},{"$f":"\"Class \" & IF(ISNA(VLOOKUP(N$1,InUP!$A:$P,MATCH(BS!$D11,InUP!$2:$2,0),0)),\"\",VLOOKUP(N$1,InUP!$A:$P,MATCH(BS!$D11,InUP!$2:$2,0),0))","v":"Class "},{"$f":"\"Class \" & IF(ISNA(VLOOKUP(O$1,InUP!$A:$P,MATCH(BS!$D11,InUP!$2:$2,0),0)),\"\",VLOOKUP(O$1,InUP!$A:$P,MATCH(BS!$D11,InUP!$2:$2,0),0))","v":"Class "},{"$f":"\"Class \" & IF(ISNA(VLOOKUP(P$1,InUP!$A:$P,MATCH(BS!$D11,InUP!$2:$2,0),0)),\"\",VLOOKUP(P$1,InUP!$A:$P,MATCH(BS!$D11,InUP!$2:$2,0),0))","v":"Class "},{"$f":"\"Class \" & IF(ISNA(VLOOKUP(Q$1,InUP!$A:$P,MATCH(BS!$D11,InUP!$2:$2,0),0)),\"\",VLOOKUP(Q$1,InUP!$A:$P,MATCH(BS!$D11,InUP!$2:$2,0),0))","v":"Class "},{"$f":"\"Class \" & IF(ISNA(VLOOKUP(R$1,InUP!$A:$P,MATCH(BS!$D11,InUP!$2:$2,0),0)),\"\",VLOOKUP(R$1,InUP!$A:$P,MATCH(BS!$D11,InUP!$2:$2,0),0))","v":"Class "},{"$f":"\"Class \" & IF(ISNA(VLOOKUP(S$1,InUP!$A:$P,MATCH(BS!$D11,InUP!$2:$2,0),0)),\"\",VLOOKUP(S$1,InUP!$A:$P,MATCH(BS!$D11,InUP!$2:$2,0),0))","v":"Class "},{"$f":"FundCurrency","v":"USD"}]
[null,null,null,null,null,null,null,null,null,{"$f":"FundCurrency","v":"USD"},"USD","USD","USD","USD","USD","USD","USD","USD","USD"]
[]
[null,null,null,"ASSET",null,{"$f":"OFFSET(Label!$E$1,MATCH(BS!D14,Label!$E:$E,0)-1,Main!$G$14+1)","v":"Assets"}]
[null,null,null,"INV",null,{"$f":"OFFSET( Label!$E$1,MATCH(BS!D15, Label!$E:$E,0)-1, Main!$G$14+1)","v":"Investments"}]
{"$rows_left_out":108}
{"sheet":"PL","index":2,"n_rows":98,"n_cols":22,"rows_kept":98,"cut":false,"hidden":false,"merged":[]}
[null,null,null,null,null,null,null,null,"GD1",{"$f":"Class1","v":"BAPACMYR"},{"$f":"Class2","v":"BAPACUSD"},{"$f":"Class3","v":0},{"$f":"Class4","v":0},{"$f":"Class5","v":0},{"$f":"Class6","v":0},{"$f":"Class7","v":0},{"$f":"Class8","v":0},{"$f":"Class9","v":0},{"$f":"Class10","v":0}]
[null,null,null,null,null,null,null,null,null,{"$f":"BS!J108","v":0.98721685424361505},{"$f":"BS!K108","v":1.2783145756384956E-2},{"$f":"BS!L108","v":0},{"$f":"BS!M108","v":0},{"$f":"BS!N108","v":0},{"$f":"BS!O108","v":0},{"$f":"BS!P108","v":0},{"$f":"BS!Q108","v":0},{"$f":"BS!R108","v":0},{"$f":"BS!S108","v":0}]
[]
[null,null,"Balance Check",{"$f":"I83-I98","v":0}]
[null,null,null,null,null,{"$f":"CompanyName","v":"BIMB Investment Management Berhad"}]
[null,null,null,null,null,{"$f":"Main!$G$12","v":"BIMB-ARABESQUE ASIA PACIFIC SHARIAH-ESG EQUITY"}]
[null,null,null,null,null,"Income Statement"]
[null,null,null,null,null,{"$f":" \"For The Financial  Period Ended \" & TEXT(Main!$G$17,\"dd mmmm yyyy\")","v":"For The Financial  Period Ended 30 October 2020"}]
[]
[null,null,null,null,null,null,null,null,{"$f":"ValueDate","v":"2020-10-30"},"2020-10-30","2020-10-30","2020-10-30","2020-10-30","2020-10-30","2020-10-30","2020-10-30","2020-10-30","2020-10-30","2020-10-30","2020-10-30"]
[null,null,null,null,null,null,null,null,"Year To Date","Year To Date","Year To Date","Year To Date","Year To Date","Year To Date","Year To Date","Year To Date","Year To Date","Year To Date","Year To Date","Year To Date"]
[null,null,null,null,null,null,null,null,null,{"$f":"BS!J11","v":"Class MYR"},{"$f":"BS!K11","v":"Class USD"},{"$f":"BS!L11","v":"Class "},{"$f":"BS!M11","v":"Class "},{"$f":"BS!N11","v":"Class "},{"$f":"BS!O11","v":"Class "},{"$f":"BS!P11","v":"Class "},{"$f":"BS!Q11","v":"Class "},{"$f":"BS!R11","v":"Class "},{"$f":"BS!S11","v":"Class "}]
[null,null,null,null,null,null,null,null,{"$f":"FundCurrency","v":"USD"},{"$f":"BS!J12","v":"USD"},{"$f":"BS!K12","v":"USD"},{"$f":"BS!L12","v":"USD"},{"$f":"BS!M12","v":"USD"},{"$f":"BS!N12","v":"USD"},{"$f":"BS!O12","v":"USD"},{"$f":"BS!P12","v":"USD"},{"$f":"BS!Q12","v":"USD"},{"$f":"BS!R12","v":"USD"},{"$f":"BS!S12","v":"USD"},{"$f":"FundCurrency","v":"USD"}]
[null,null,null,"INVINC",null,{"$f":"OFFSET(Label!$A$1,MATCH(D14,Label!$A$1:$A$65537,0)-1,Main!$G$14+1)","v":"INCOME"}]
[null,null,null,"INTINCOME",null,{"$f":"OFFSET(Label!$A$1,MATCH(D15,Label!$A$1:$A$65537,0)-1,Main!$G$14+1)","v":"PROFIT SHARING"},null,null,{"$f":"SUM(I16:I19)","v":193.74},191.26,2.48,0,0,0,{"$f":"SUM(O16:O19)","v":0},0,0,{"$f":"SUM(R16:R19)","v":0},{"$f":"SUM(S16:S19)","v":0},193.74,null,{"$f":"ROUND(I15-SUM(J15:S15),1)","v":0}]
{"$rows_left_out":84}
{"sheet":"Label","index":3,"n_rows":121,"n_cols":7,"rows_kept":121,"cut":false,"hidden":true,"merged":[]}
[]
[]
[]
[]
[]
[]
[]
[]
[null,"Income Statement",null,null,null,"Balance Sheet"]
[null,"Conventional Fund","Islamic Fund",null,null,"Conventional Fund","Islamic Fund"]
["INVINC","INCOME","INCOME",null,"ASSET","ASSETS","Assets"]
["INTINCOME","INTEREST INCOME","PROFIT SHARING",null,"INV","INVESTMENTS","Investments"]
["INTINCOME1",{"$f":"UPPER(\"Interest Income - Money Market Placement\")","v":"INTEREST INCOME - MONEY MARKET PLACEMENT"},"Profit Sharing - Shariah-based deposits and placements",null,"UFISCP","UNQUOTED FIXED INCOME SECURITIES -COMMERCIAL PAPER","Unquoted Fixed Income Securities - Islamic Commercial Paper"]
["INTINCOME2","Interest Income - Commercial Bond","Profit Sharing - Commercial Bond",null,"UFISCP1","Investment Cost -CP","Investment Cost -CP"]
["INTINCOME3","Interest Income - Bank","Profit Sharing - Bank",null,"UFISCP2","Accretion of Discount- CP","Accreation of Discount- CP"]
{"$rows_left_out":107}
{"sheet":"InUP","index":4,"n_rows":5,"n_cols":23,"rows_kept":5,"cut":false,"hidden":true,"merged":[]}
[null,null,null,null,null,null,null,null,null,null,null,null,null,null,null,null,null,null,{"$f":"IF(Q1=4,IF(A1=L1,0,K1/O1/R1),IF(ROW()=MATCH(MAX($H:$H),$H:$H,0),1-SUMIF(A:A,\"<>\"&OFFSET($A$1,MATCH(MAX($H:$H),$H:$H,0)-1,0),P:P),P1))","v":0},{"$f":"IF(ROW()=MATCH(MAX($H:$H),$H:$H,0),1-SUMIF($A:$A,\"<>\"&OFFSET($A$1,MATCH(MAX($H:$H),$H:$H,0)-1,0),S:S),S1)","v":0},{"$f":"R1-SUM(J:J)/2","v":0},{"$f":"IF(L1=A1,0,(K1/O1-J1)/U1)","v":0},{"$f":"IF(ROW()=MATCH(MAX($H:$H),$H:$H,0),1-SUMIF($A:$A,\"<>\"&OFFSET($A$1,MATCH(MAX($H:$H),$H:$H,0)-1,0),V:V),V1)","v":0}]
["qFundCode","qValDate","LastValDate","NAVBC","BuyPrice","SellPrice","ValPrice","TotalUnits","TotalUnitsBF","ClassNAVBC","NAV","RefFundCode","qCurrencyCode","UnitRatio","ExchgRate","MCR","UPMethod","BaseNAV","MCRCalc","MCRRpt","BaseNAVxClsNAV","MCRCalcH","MCRCalcHAdj"]
["BAPAC","2020-10-30","2020-10-28",3632394.63,0,0,0,0,0,0,3632394.63,"BAPAC","USD",1,1,0,4,3632394.63,0,0,3632394.63,0,0]
["BAPACMYR","2020-10-30","2020-10-28",3585961.2037999998,0.2215,0.2215,5.3330203280000002E-2,67240720.659999996,67286178.469999999,0,14892496.890000001,"BAPAC","MYR",0.98722539533865772,4.1529999999999996,0,4,3632394.63,0.98721685599365916,0.98721685424361505,3632394.63,0.98721685599365916,0.98721685424361505]
["BAPACUSD","2020-10-30","2020-10-28",46433.426200000002,0.21010000000000001,0.21010000000000001,0.21007345377799999,221034.23999999999,221034.23999999999,0,46433.43,"BAPAC","USD",1.2774604661342372E-2,1,0,4,3632394.63,1.2783145756384956E-2,1.2783145756384956E-2,3632394.63,1.2783145756384956E-2,1.2783145756384956E-2]

{"sheet":"InUPFee","index":5,"n_rows":2,"n_cols":13,"rows_kept":2,"cut":false,"hidden":true,"merged":[]}
[]
["qFundCode","qValDate","MngFee","MngRebate","TrusteeFee","LicensesFees","PerfFee","ExchgRate","MngFeeBC","MngRebateBC","TrusteeFeeBC","LicenseFeeBC","PerfFeeBC"]

{"sheet":"InTB","index":6,"n_rows":73,"n_cols":17,"rows_kept":73,"cut":false,"hidden":true,"merged":[]}
[]
["TBDate","GLCode","qFundCode","qCurrencyCode","ShortGL","qAssetAccType","DebitAmt","CreditAmt","TBValue","ExRate","TBValueFC","Description","qRptGrp1ID","qAssetRptGrp","TBType","CashFlag","ValuationGL"]
["2020-10-30","BAPAC-USD015-100000","BAPAC","USD",100000,"015",25613045.489999998,-21984280.640000001,3628764.85,1,3628764.85,"Cost: Investment","BICOST","BICOST_O-EQT","BS ",0,false]
["2020-10-30","BAPAC-USD015-189000","BAPAC","USD",189000,"015",133831.84,-235616.17,-101784.33,1,-101784.33,"Unrealised GnL - Investment","BIURGL","BIURGL_O-EQT","BS ",0,true]
["2020-10-30","BAPAC-USD015-199000","BAPAC","USD",199000,"015",44699.99,-20037.509999999998,24662.48,1,24662.48,"Unrealised FX GnL - Investment","BIURFX","BIURFX_O-EQT","BS ",0,true]
["2020-10-30","BAPAC-MYR000-200800","BAPAC","MYR",200800,"000",178639.54,-5950.51,172689.03,4.1529999999999996,41581.760000000002,"Debtor: Amount Due From Manager (Creation)","BOAMNG","BOAMNG_CSH","BS ",10,false]
["2020-10-30","BAPAC-HKD015-299000","BAPAC","HKD",299000,"015",179801.05,-178011.85,1789.2,7.7512999999999996,230.83,"DivDebtor: Dividend Receivable","BOADVL","BOADVL_O-EQT","BS ",3,false]
["2020-10-30","BAPAC-JPY015-299000","BAPAC","JPY",299000,"015",30356370.91,-29612841.91,743529,104.6,7108.31,"DivDebtor: Dividend Receivable","BOADVL","BOADVL_O-EQT","BS ",3,false]
["2020-10-30","BAPAC-KRW015-299000","BAPAC","KRW",299000,"015",271979,0,271979,1134.4100000000001,239.75,"DivDebtor: Dividend Receivable","BOADVL","BOADVL_O-EQT","BS ",3,false]
["2020-10-30","BAPAC-MYR000-300800","BAPAC","MYR",300800,"000",0,-30542.73,-30542.73,4.1529999999999996,-7354.38,"Creditor: Amount Due to Manager (Cancellation)","BLMNGT","BLMNGT_CSH","BS ",11,false]
["2020-10-30","BAPAC-USD000-320103","BAPAC","USD",320103,"000",350999.26,-356626.39,-5627.13,1,-5627.13,"Creditor: Amount Due to Managers(Mngt Fee)","BLMNGT","BLMNGT_CSH","BS ",15,false]
["2020-10-30","BAPAC-USD000-320104","BAPAC","USD",320104,"000",15305.91,-15789.52,-483.61,1,-483.61,"Creditor: Amount Due to Trustee","BLTRUS","BLTRUS_CSH","BS ",17,false]
["2020-10-30","BAPAC-USD000-320105","BAPAC","USD",320105,"000",8141.9,-12533.3,-4391.3999999999996,1,-4391.3999999999996,"Creditor: Audit Fees Payable","BLAUDP","BLAUDP_CSH","BS ",18,false]
["2020-10-30","BAPAC-USD000-320107","BAPAC","USD",320107,"000",4904.82,-7280.51,-2375.69,1,-2375.69,"Creditor: Tax Agent's fees payable","BLTXFP","BLTXFP_CSH","BS ",21,false]
["2020-10-30","BAPAC-USD000-320209","BAPAC","USD",320209,"000",34839.269999999997,-52136.06,-17296.79,1,-17296.79,"Creditor: Other Charges 2","BLSUNA","BLSUNA_CSH","BS ",22,false]
{"$rows_left_out":59}
{"sheet":"InTBBase","index":7,"n_rows":73,"n_cols":17,"rows_kept":73,"cut":false,"hidden":true,"merged":[]}
[]
["TBDate","GLCode","qFundCode","qCurrencyCode","ShortGL","qAssetAccType","DebitAmt","CreditAmt","TBValue","ExRate","TBValueFC","Description","qRptGrp1ID","qAssetRptGrp","TBType","CashFlag","ValuationGL"]
["2020-10-30","BAPAC-USD015-100000","BAPAC","USD",100000,"015",25613045.489999998,-21984280.640000001,3628764.85,1,3628764.85,"Cost: Investment","BICOST","BICOST_O-EQT","BS ",0,false]
["2020-10-30","BAPAC-USD015-189000","BAPAC","USD",189000,"015",133831.84,-235616.17,-101784.33,1,-101784.33,"Unrealised GnL - Investment","BIURGL","BIURGL_O-EQT","BS ",0,true]
["2020-10-30","BAPAC-USD015-199000","BAPAC","USD",199000,"015",44699.99,-20037.509999999998,24662.48,1,24662.48,"Unrealised FX GnL - Investment","BIURFX","BIURFX_O-EQT","BS ",0,true]
["2020-10-30","BAPAC-MYR000-200800","BAPAC","MYR",200800,"000",178639.54,-5950.51,172689.03,4.1529999999999996,41581.760000000002,"Debtor: Amount Due From Manager (Creation)","BOAMNG","BOAMNG_CSH","BS ",10,false]
["2020-10-30","BAPAC-HKD015-299000","BAPAC","HKD",299000,"015",179801.05,-178011.85,1789.2,7.7512999999999996,230.83,"DivDebtor: Dividend Receivable","BOADVL","BOADVL_O-EQT","BS ",3,false]
["2020-10-30","BAPAC-JPY015-299000","BAPAC","JPY",299000,"015",30356370.91,-29612841.91,743529,104.6,7108.31,"DivDebtor: Dividend Receivable","BOADVL","BOADVL_O-EQT","BS ",3,false]
["2020-10-30","BAPAC-KRW015-299000","BAPAC","KRW",299000,"015",271979,0,271979,1134.4100000000001,239.75,"DivDebtor: Dividend Receivable","BOADVL","BOADVL_O-EQT","BS ",3,false]
["2020-10-30","BAPAC-MYR000-300800","BAPAC","MYR",300800,"000",0,-30542.73,-30542.73,4.1529999999999996,-7354.38,"Creditor: Amount Due to Manager (Cancellation)","BLMNGT","BLMNGT_CSH","BS ",11,false]
["2020-10-30","BAPAC-USD000-320103","BAPAC","USD",320103,"000",350999.26,-356626.39,-5627.13,1,-5627.13,"Creditor: Amount Due to Managers(Mngt Fee)","BLMNGT","BLMNGT_CSH","BS ",15,false]
["2020-10-30","BAPAC-USD000-320104","BAPAC","USD",320104,"000",15305.91,-15789.52,-483.61,1,-483.61,"Creditor: Amount Due to Trustee","BLTRUS","BLTRUS_CSH","BS ",17,false]
["2020-10-30","BAPAC-USD000-320105","BAPAC","USD",320105,"000",8141.9,-12533.3,-4391.3999999999996,1,-4391.3999999999996,"Creditor: Audit Fees Payable","BLAUDP","BLAUDP_CSH","BS ",18,false]
["2020-10-30","BAPAC-USD000-320107","BAPAC","USD",320107,"000",4904.82,-7280.51,-2375.69,1,-2375.69,"Creditor: Tax Agent's fees payable","BLTXFP","BLTXFP_CSH","BS ",21,false]
["2020-10-30","BAPAC-USD000-320209","BAPAC","USD",320209,"000",34839.269999999997,-52136.06,-17296.79,1,-17296.79,"Creditor: Other Charges 2","BLSUNA","BLSUNA_CSH","BS ",22,false]
{"$rows_left_out":59}
{"sheet":"InFund","index":8,"n_rows":8,"n_cols":9,"rows_kept":8,"cut":false,"hidden":true,"merged":[]}
[1,2,3,4,5,6,7,8,9]
["qFundCode","FundPrefix","FundName","FundDesc","FundCurrency","FinanceYrStart","FinanceYrEnd","NomFinanceYrEnd","Islamic"]
["BAPAC","BAPAC","BIMB-ARABESQUE ASIA PACIFIC SHARIAH-ESG EQUITY","BIMB-ARABESQUE ASIA PACIFIC SHARIAH-ESG EQUITY FUND","USD","2015-11-05","2020-10-30","2016-10-31",1]
["BGSEF","BGSEF","Bimb-Arabesque Global Shariah Sustainable Equity","Bimb-Arabesque Global Shariah Sustainable Equity Fund","USD","2020-04-01","2021-03-31","2021-03-31",1]
["BMSEF","BMSEF","BIMB-Arabesque Malaysia Shariah-ESG Equity Fund","BIMB-Arabesque Malaysia Shariah-ESG Equity Fund","MYR","2017-03-09","2020-05-29","2017-05-31",1]
["BSF","BSF","BIMB ESG SUKUK FUND","BIMB ESG SUKUK FUND","MYR","2018-08-01","2020-10-30","2019-10-31",1]
["GD1","GD1","BIMB-Arabesque i Global Dividend Fund 1","BIMB-Arabesque i Global Dividend Fund 1","USD","2015-11-05","2021-03-31","2016-03-31",1]
["MWF","MWF","Makmur myWakaf Fund","Makmur myWakaf Fund","MYR","2021-01-01","2020-12-31","2021-12-31",1]