{"text_format":"1","workbook":"xlsx","n_sheets":7,"sheets":["Main","NAVPrice","InUP","FIMM","InPricePM","Setting","MYR upload-BIMB Migration"],"not_rendered":{"charts":0,"images":1,"macros":1,"external_links":0,"defined_names":11,"comments":1,"pivot_tables":0},"unopened":[],"bounds":{"document_bytes":16777216,"sheet_cells":100000,"rows_first":2000,"rows_last":500,"rows_between":2000,"halvings":0,"cell_chars":16384,"cell_head_chars":4096},"cells_cut":0,"cells_raw":0,"read":"whole","date_system":"1900"}

{"sheet":"Main","index":0,"n_rows":27,"n_cols":12,"rows_kept":27,"cut":false,"hidden":false,"merged":[[4,1,4,11],[9,5,9,6],[10,5,10,6]]}
[]
[]
[]
[]
[null,"EXPORT NAV PRICE"]
[]
[null,null,null,null,null,null,null,null,null,null,null,"Note:"]
[null,null,"Report Details:"]
[null,null,null,null,null,null,null,null,null,null,null,"1. Press Login to connect to database"]
[null,null,null,null,"Company Name:","BIMB Investment Management Berhad",null,null,null,null,null,"2. Select Fund Group Code and Value Date, then click on the button Import to import data."]
{"$rows_left_out":18}
{"sheet":"NAVPrice","index":1,"n_rows":36,"n_cols":13,"rows_kept":36,"cut":false,"hidden":false,"merged":[]}
["Fund Code",{"$f":"VLOOKUP(A1,Setting!A:D,4,0)","v":"Bloomberg Code"},"Fund Name",null,{"$f":"IF(H1=0,0,G1/H1)","v":0},{"$f":"OFFSET(InUP!$I$1,MATCH(A1,InUP!B:B,0)-1,0)","v":{"$error":"#N/A"}},{"$f":"ROUND(IF(ISERROR(OFFSET(InUP!$V$1,MATCH(A1,InUP!B:B,0)-1,0)),0,OFFSET(InUP!$V$1,MATCH(A1,InUP!B:B,0)-1,0)),2)","v":0},null,null,null,null,{"$f":"M1/G1","v":{"$error":"#N/A"}},{"$f":"OFFSET(InUP!$U$1,MATCH(A1,InUP!B:B,0)-1,0)","v":{"$error":"#N/A"}}]
["Fund Code","Bloomberg Code","Fund Name","Value Date","Value Price","Currency","NAV","UIC","DividendAmount","Distribution Amount","UIC (Before Reinvest)","Exchange Rate","NAV (RM)"]
["BAPACMYR","BIAAMYR MK","BAPAC (MYR)","2021-11-11",0.22975371294948974,"MYR",11816293.34,51430260.640000001,0,0,51430260.640000001,1,11816293.34]
["BAPACUSD","BIAAUSD MK","BAPAC (USD)","2021-11-11",0.2171877985962718,"USD",48005.94,221034.23999999999,0,0,221034.23999999999,4.1689999195932836,200136.76]
["BGSEFAUD","BISSESC MK","Bimb-Arabesque Global Shariah Sustainable Equity","2021-11-11",0.28686500000000004,"AUD",1147.46,4000,0,0,4000,3.0421888344691754,3490.79]
["BGSEFMYR","BISSEBG MK","Bimb-Arabesque Global Shariah Sustainable Equity","2021-11-11",0.27738350171543191,"MYR",24059422.530000001,86737035.120000005,0,0,86737035.120000005,1,24059422.530000001]
["BGSEFRMH","BISSERH MK ","Bimb-Arabesque Global Shariah Sustainable Equity","2021-11-11",0.27610484416106368,"MYR",634193.44999999995,2296929.8199999998,0,0,2296929.8199999998,1,634193.44999999995]
["BGSEFSGD","BISSEBA MK ","Bimb-Arabesque Global Shariah Sustainable Equity","2021-11-11",0.27747000000000005,"SGD",1109.8800000000001,4000,0,0,4000,3.0801708292788406,3418.62]
["BGSEFUSD","BISSEUC MK ","Bimb-Arabesque Global Shariah Sustainable Equity","2021-11-11",0.27565578300420468,"USD",11382.34,41291.86,0,0,41291.86,4.1690003988635027,47452.98]
["BIPF",0,"Bank Islam Premier Fund","2021-11-11",1.0581475775856226,"MYR",3720890.49,3516419.23,0,0,3516419.23,1,3720890.49]
{"$rows_left_out":27}
{"sheet":"InUP","index":2,"n_rows":42,"n_cols":22,"rows_kept":42,"cut":false,"hidden":false,"merged":[]}
[null,null,null,null,null,null,null,null,null,null,null,null,null,null,null,null,null,null,{"$f":"ROUND(IF(OR(N1=2,N1=0),0,IF(AND(L1=2,N1<>2),E1/J1/Q1*R1,(G1/K1))),2)","v":0},{"$f":"ROUND(IF(N1=2,R1-SUMIFS(S:S,H:H,H1),IF(L1=2,E1/Q1/J1*R1,IF(K1=0,0,G1/K1))),2)","v":0},{"$f":"ROUND(IF(M1=\"USD\",T1*O1,IF(P1=0,0,T1/P1)),2)","v":0},{"$f":"T1*K1","v":0}]
["qValDate","qFundCode","BuyPrice","ValPrice","TotalUnits","TotalUnitsBF","NAV","RefFundCode","qCurrencyCode","UnitRatio","ExchgRate","UPMethod","BaseCurrency","RowNo","ExRateFCMYR","ExRateMYRFC","BaseTotUnits","BaseNAV","CalcMax","NAVBC","NAVRM","NAVFC"]
["2021-11-11","BAPAC",0,0,0,0,2882329.12,"BAPAC","USD",1,1,4,"USD",0,4.1689999999999996,0.23980000000000001,0,2882329.12,0,2882329.12,12016430.1,2882329.12]
["2021-11-11","BAPACMYR",0.2298,5.5110061760000002E-2,51430260.640000001,51629621.770000003,11816293.32,"BAPAC","MYR",0.98340802244102909,4.1689999999999996,4,"USD",2,4.1689999999999996,0.23980000000000001,0,2882329.12,0,2834323.18,11816293.34,11816293.33742]
["2021-11-11","BAPACUSD",0.2172,0.21718782845500001,221034.23999999999,221034.23999999999,48005.94,"BAPAC","USD",1.6591977558971009E-2,1,4,"USD",3,4.1689999999999996,0.23980000000000001,0,2882329.12,48005.94,48005.94,200136.76,48005.94]
["2021-11-11","BGSEF",0,0,0,0,5936190.54,"BGSEF","USD",1,1,4,"USD",0,4.1689999999999996,0.23980000000000001,0,5936190.54,0,5936190.54,24747978.359999999,5936190.54]
["2021-11-11","BGSEFMYR",0.27739999999999998,6.6534780809999999E-2,86737035.120000005,86769555.480000004,24059422.420000002,"BGSEF","MYR",0.97211319859053547,4.1689999999999996,4,"USD",2,4.1689999999999996,0.23980000000000001,0,5936190.54,0,5771029.6299999999,24059422.530000001,24059422.527469996]
["2021-11-11","BGSEFRMH",0.27610000000000001,6.6228073698000003E-2,2296929.8199999998,2296929.8199999998,634193.43999999994,"BGSEF","MYR",2.5691127874884711E-2,4.1689999999999996,4,"USD",3,4.1689999999999996,0.23980000000000001,0,5936190.54,152121.24,152121.24,634193.44999999995,634193.44955999986]
["2021-11-11","BGSEFUSD",0.2757,0.27565584112699998,41291.86,41291.86,11382.34,"BGSEF","USD",1.9166041437241428E-3,1,4,"USD",4,4.1689999999999996,0.23980000000000001,0,5936190.54,11382.34,11382.34,47452.98,11382.34]
["2021-11-11","BGSEFAUD",0.28689999999999999,0.2093323,4000,4000,1147.47,"BGSEF","AUD",1.4099279870579047E-4,1.3704000000000001,4,"USD",5,4.1689999999999996,0.23980000000000001,0,5936190.54,837.32,837.32,3490.79,1147.463328]
{"$rows_left_out":33}
{"sheet":"FIMM","index":3,"n_rows":36,"n_cols":4,"rows_kept":36,"cut":false,"hidden":false,"merged":[]}
[{"$f":"OFFSET(InPricePM!$A$1,ROW()-1,MATCH(\"qFundCode2\",InPricePM!$2:$2,0)-1)","v":0},{"$f":"VLOOKUP($A1,Setting!$A:$C,3,0)","v":{"$error":"#N/A"}},{"$f":"OFFSET(InPricePM!$A$1,ROW()-1,MATCH(\"BuyPrice\",InPricePM!$2:$2,0)-1)","v":0},{"$f":"TEXT(OFFSET(InPricePM!$A$1,ROW()-1,MATCH(\"qValDate\",InPricePM!$2:$2,0)-1),\"DD/MM/YYYY\")","v":"00/01/1900"}]
["qFundCode","FUND_CODE","NAV","VALDT"]
["BAPACMYR","BAPAC-RM",0.2303,"10/11/2021"]
["BAPACUSD","BAPAC-USD",0.2185,"10/11/2021"]
["BGSEFAUD","BGSEF-AUD",0.28949999999999998,"10/11/2021"]
["BGSEFMYR","BGSEF-RM",0.27989999999999998,"10/11/2021"]
["BGSEFRMH","BGSEF-RM-HEDGED",0.27950000000000003,"10/11/2021"]
["BGSEFSGD","BGSEF-SGD",0.28089999999999998,"10/11/2021"]
["BGSEFUSD","BGSEF-USD",0.27929999999999999,"10/11/2021"]
["BIPF","BIPF",1.0651999999999999,"10/11/2021"]
{"$rows_left_out":27}
{"sheet":"InPricePM","index":4,"n_rows":36,"n_cols":204,"rows_kept":36,"cut":false,"hidden":false,"merged":[]}
[]
["qFundCode","FundPrefix","FundPrefixMap","FundName","FundDesc","BNDSource","EQTSource","FXSource","FundCurrency","PaymentEntityLoc","PaymentEntityFor","ForeignLiquidityCurr","qManagerCode","qCPCode","ADI","ADINo","EqtMonitorFlag","BndMonitorFlag","FundPaidUpCapital","MgsFlag","qCDSAcc","FinanceYrStart","FinanceYrEnd","NomFinanceYrEnd","PlaceFlag","qCshCPGroup","MaxTenor","SMFIslamic","LimitGrp","PrintPageFlag","7DLimit","31DLimit","CreditLimit","qFundType","BndInLimit","Inactive","qCompanyID","FundSortIndex","SpecialValuation","ManagementFee","TrusteeFee","ForeignFlag","UTFlag","FG1","FG2","ContactPerson","Address","qCity","PostCode","qState","qCountry","Email","Website","Tel","Fax","IC","KWSPCode","qIndexBenchmark","qIndexBenchmarkPlus","StampDutyFlag","Islamic","ValuationMethod","FundCycle","qModalCode","BondProcess","ExtBnkAcc","PayMgtFeeFlag","PayOthFeeFlag","HiddenName1","HiddenName2","HiddenAdd1","HiddenAdd2","HiddenAdd3","UPCapSettLeg","KeyInDate","KeyInBy","ExpFlag","MonitorFlag","RollEOYFlag","UPMultiClassType","qFundCode1","FundCategory","IcssGroup","Internal","LipperCode","Purpose","ValuationFundGrp","ClientType","ClientRegion","FundServiceChg","SkipAmortAccre","qValDate","qFundCode2","LastValDate","Frequency","BuyPrice","SellPrice","ValPrice","ValPriceBF","ValPriceB4Dist","SecReturn","BenchReturn","PriceChange","PriceChangeChk","CshFXNGainBF","CshFXNGain","TranPnL","UnrealisedGains","NAVBF","ManJournal","CheckZero","FaceValueBF","FaceValue","FaceValueTran","SecCostBF","SecCost","SecCostTran","CheckZeroAll","CheckTB","CheckBS","CheckBFTB","TotalUnits","TotalUnitsBF","UnitsCreated","UnitsReInvest","UnitsRedeem","UnitsBonus","DollarCreated","DollarReinvest","DollarRedeem","DollarBonus","GAV","NAV","EquityLoc","EquityFXN","BondLoc","BondFXN","Trusts","Repo","DevMV","OthersMV","Cash","CashFX","TradeDebtor","TradeCreditor","MngtDebtor","MngtCreditor","DivAccrual","DivTaxRec","OthDebtor","OthCreditor","ProTax","ProDefTax","ProDistri","Others","SumCF","MngFeeBF","MngRebateBF","TrusteeFeeBF","AuditorFeeBF","CustodianFeeBF","BrokerageFeeBF","MngFee","MngRebate","TrusteeFee1","AuditorFee","CustodianFee","BrokerageFee","TaxAllowExp","TaxGrossIncomeChrg","TaxAggregrateGrossInc","TaxInc","TaxIncToday","TaxDefToday","FXDivDebtors","FXDebtors","FXCreditors","TaxRate","MngFeeRate","TrusteeFeeRate","AuditorFeeAmt","CustodianFeeRate","BrokerageFeeRate","OtherFeeAmt","MinTrusteeFeeAmt","BenchmarkIndex","BuySellDiff","FeeCalcMethod","TaxCalcMethod","RebateMethod","UnitCreationMethod","UnitCreationSettLag","CloseFlag","PubPriceRnding","OvrMngFee","OvrMngRebate","OvrTrusteeFee","OvrCustodianFee","OvrTaxIncToday","OvrTaxDefToday","DistriStatus","Cycle2Date","FundServiceChg1","MngFeeRateC"]
["BAPACMYR","BPCMYR","BAPACMYR","BAPAC (MYR)","BIMB-ARABESQUE ASIA PACIFIC SHARIAH-ESG EQUITY (MYR)",1,1,1,"MYR","SCBMBBAPAC","SCBMBBAPAC","MYR","arazaks","SCBMB","N/A","N/A",1,1,0,0,"N/A","2015-11-05","2021-10-29","2016-10-31",3,"ALL",365,0,0,0,7,31,2,1,0,0,"BI",1,0,"MF04","TR02",1,1,null,null,null,"Level 19, Menara Bank Islam, No 2, Jalan Perak, 50450 KL","WPKL",50450,"WLP","MY",null,null,"                                                                                                                                                      ","                                                                                                                                                      ",null,null,"FBMKLCI",0,0,1,0,1,null,0,"N/A",0,0,"N/A","N/A","N/A","N/A","N/A",0,"2020-07-21T12:27:43","Riskk",false,1,1,5,"BAPACMYR","N/A","N/A",0,"N/A","N/A","N/A","N/A","N/A",0,0,"2021-11-10","BAPACMYR","2021-11-09",1,0.2303,0.2303,5.5453729388E-2,5.5855904541999998E-2,5.5453729388E-2,0,0,-1.5999899999999999E-3,0,0,0,0,0,11964559.550000001,0,0,0,0,0,0,0,0,0,0,0,0,51629621.770000003,51640314.659999996,0,0,-10692.89,0,0,0,-2462.5700000000002,0,11889488.5,11888836.02,0,0,0,0,0,0,0,0,0,0,0,0,0,0,0,0,0,0,0,0,0,0,0,0,0,0,0,0,0,-586.33000000000004,0,-66.150000000000006,0,0,0,0,0,0,0,0,0,0,0,0,0,1.7999999999999999E-2,5.0000000000000001E-4,0,0,0,0,66.150000000000006,"KLCI",0,"B","MYT","X","B",99,"T",4,0,0,0,0,0,0,null,"2021-11-10",0,1.7999999999999999E-2]
["BAPACUSD","BPCUSD","BAPACUSD","BAPAC (USD)","BIMB-ARABESQUE ASIA PACIFIC SHARIAH-ESG EQUITY (USD)",1,1,1,"USD","SCBMBBAPAC","SCBMBBAPAC","MYR","arazaks","SCBMB","N/A","N/A",1,1,0,0,"N/A","2015-11-05","2021-10-29","2016-10-31",3,"ALL",365,0,0,0,7,31,2,1,0,0,"BI",1,0,"MF04","TR02",1,1,null,null,null,"Level 19, Menara Bank Islam, No 2, Jalan Perak, 50450 KL","WPKL",50450,"WLP","MY",null,null,"                                                                                                                                                      ","                                                                                                                                                      ",null,null,"FBMKLCI",0,0,1,0,1,null,0,"N/A",0,0,"N/A","N/A","N/A","N/A","N/A",0,"2020-07-21T12:27:43","Riskk",false,1,1,5,"BAPACUSD","N/A","N/A",0,"N/A","N/A","N/A","N/A","N/A",0,0,"2021-11-10","BAPACUSD","2021-11-09",1,0.2185,0.2185,0.218541815512,0.2201263768,0.218541815512,0,0,-1.5999899999999999E-3,0,0,0,0,0,48655.47,0,0,0,0,0,0,0,0,0,0,0,0,221034.23999999999,221034.23999999999,0,0,0,0,0,0,0,0,48307.79,48305.23,0,0,0,0,0,0,0,0,0,0,0,0,0,0,0,0,0,0,0,0,0,0,0,0,0,0,0,0,0,-2.38,0,-0.18,0,0,0,0,0,0,0,0,0,0,0,0,0,1.7999999999999999E-2,5.0000000000000001E-4,0,0,0,0,0.18,"KLCI",0,"B","MYT","X","B",99,"T",4,0,0,0,0,0,0,null,"2021-11-10",0,1.7999999999999999E-2]
["BGSEFAUD","GSEAUD","BGSEFAUD","Bimb-Arabesque Global Shariah Sustainable Equity","Bimb-Arabesque Global Shariah Sustainable Equity Fund (AUD)",1,1,1,"AUD","DTMBBGSEF","DTMBBGSEF","MYR","arazaks","DTMB","N/A","N/A",1,1,0,0,"N/A","2020-04-01","2021-03-31","2021-03-31",3,"ALL",365,0,0,0,7,31,2,1,0,0,"BI",1,0,"MF03","TR02",1,1,null,null,null,"Level 19, Menara Bank Islam, No 2, Jalan Perak, 50450 KL","WPKL",50450,"WLP","MY",null,null,"                                                                                                                                                      ","                                                                                                                                                      ",null,null,"MSCIACWIII",0,0,1,0,1,null,0,"N/A",0,0,"N/A","N/A","N/A","N/A","N/A",0,"2021-06-02T16:02:24","nasim",false,1,1,5,"BGSEFAUD","Islamic-ESG Global Equity","N/A",0,"N/A","N/A","N/A","N/A","N/A",0,0,"2021-11-10","BGSEFAUD","2021-11-09",1,0.28949999999999998,0.28949999999999998,0.21210032500000001,0.211893475,0.21210032500000001,0,0,2.3999899999999998E-3,0,0,0,0,0,1148.54,0,0,0,0,0,0,0,0,0,0,0,0,4000,4000,0,0,0,0,0,0,0,0,1157.8399999999999,1157.8,0,0,0,0,0,0,0,0,0,0,0,0,0,0,0,0,0,0,0,0,0,0,0,0,0,0,0,0,0,-0.06,0.02,0,0,0,0,0,0,0,0,0,0,0,0,0,0,1.7999999999999999E-2,3.5E-4,0,0,0,0,0,"KLCI",0,"A","MYT","X","B",99,"T",4,0,0,0,0,0,0,null,"2021-11-10",0,1.7999999999999999E-2]
["BGSEFMYR","GSEMYR","BGSEFMYR","Bimb-Arabesque Global Shariah Sustainable Equity","Bimb-Arabesque Global Shariah Sustainable Equity Fund (MYR)",1,1,1,"MYR","DTMBBGSEF","DTMBBGSEF","MYR","arazaks","DTMB","N/A","N/A",1,1,0,0,"N/A","2020-04-01","2021-03-31","2021-03-31",3,"ALL",365,0,0,0,7,31,2,1,0,0,"BI",1,0,"MF03","TR02",1,1,null,null,null,"Level 19, Menara Bank Islam, No 2, Jalan Perak, 50450 KL","WPKL",50450,"WLP","MY",null,null,"                                                                                                                                                      ","                                                                                                                                                      ",null,null,"MSCIACWIII",0,0,1,0,1,null,0,"N/A",0,0,"N/A","N/A","N/A","N/A","N/A",0,"2021-04-07T10:29:01","zulfazly",false,1,1,5,"BGSEFMYR","Islamic-ESG Global Equity","N/A",0,"N/A","N/A","N/A","N/A","N/A",0,0,"2021-11-10","BGSEFMYR","2021-11-09",1,0.27989999999999998,0.27989999999999998,6.7414538863000001E-2,6.7349238727999999E-2,6.7414538863000001E-2,0,0,6.9999000000000005E-4,0,0,0,0,0,24326718.25,0,0,0,0,0,0,0,0,0,0,0,0,86769555.480000004,87078756.030000001,0,0,-309200.55,0,0,0,-86545.23,0,24290934.530000001,24290187.920000002,0,0,0,0,0,0,0,0,0,0,0,0,0,0,0,0,0,0,0,0,0,0,0,0,0,0,0,0,0,-1197.9100000000001,474.59,-23.29,0,0,0,0,0,0,0,0,0,0,0,0,0,1.7999999999999999E-2,3.5E-4,0,0,0,0,0,"KLCI",0,"A","MYT","X","B",99,"T",4,0,0,0,0,0,0,null,"2021-11-10",0,1.7999999999999999E-2]
["BGSEFRMH","GSERMH","BGSEFRMH","Bimb-Arabesque Global Shariah Sustainable Equity","Bimb-Arabesque Global Shariah Sustainable Equity Fund (MYR H)",1,1,1,"MYR","DTMBBGSEF","DTMBBGSEF","MYR","arazaks","DTMB","N/A","N/A",1,1,0,0,"N/A","2020-04-01","2021-03-31","2021-03-31",3,"ALL",365,0,0,0,7,31,2,1,0,0,"BI",1,0,"MF03","TR02",1,1,null,null,null,"Level 19, Menara Bank Islam, No 2, Jalan Perak, 50450 KL","WPKL",50450,"WLP","MY",null,null,"                                                                                                                                                      ","                                                                                                                                                      ",null,null,"MSCIACWIII",0,0,1,0,1,null,0,"N/A",0,0,"N/A","N/A","N/A","N/A","N/A",0,"2021-06-01T16:28:08","Yusmafaz",false,1,1,5,"BGSEFRMH","Islamic-ESG Global Equity","N/A",0,"N/A","N/A","N/A","N/A","N/A",0,0,"2021-11-10","BGSEFRMH","2021-11-09",1,0.27950000000000003,0.27950000000000003,6.7303839261000004E-2,6.7297422957000003E-2,6.7303839261000004E-2,0,0,2.9999999999999997E-4,0,0,0,0,0,641187.31999999995,0,0,0,0,0,0,0,0,0,0,0,0,2296929.8199999998,2296929.8199999998,0,0,0,0,0,0,0,0,641963.87,641944.1,0,0,0,0,0,0,3077.67,0,0,0,0,0,0,0,0,0,-1347.33,0,0,0,0,0,-1347.33,0,0,0,0,0,0,-31.66,12.51,-0.62,0,0,0,0,0,0,0,0,0,0,0,0,0,1.7999999999999999E-2,3.5E-4,0,0,0,0,0,"KLCI",0,"A","MYT","X","B",99,"T",4,0,0,0,0,0,0,null,"2021-11-10",0,1.7999999999999999E-2]
["BGSEFSGD","GSESGD","BGSEFSGD","Bimb-Arabesque Global Shariah Sustainable Equity","Bimb-Arabesque Global Shariah Sustainable Equity Fund (SGD)",1,1,1,"SGD","DTMBBGSEF","DTMBBGSEF","MYR","arazaks","DTMB","N/A","N/A",1,1,0,0,"N/A","2020-04-01","2021-03-31","2021-03-31",3,"ALL",365,0,0,0,7,31,2,1,0,0,"BI",1,0,"MF03","TR02",1,1,null,null,null,"Level 19, Menara Bank Islam, No 2, Jalan Perak, 50450 KL","WPKL",50450,"WLP","MY",null,null,"                                                                                                                                                      ","                                                                                                                                                      ",null,null,"MSCIACWIII",0,0,1,0,1,null,0,"N/A",0,0,"N/A","N/A","N/A","N/A","N/A",0,"2021-04-02T16:44:28","nasim",false,1,1,5,"BGSEFSGD","Islamic-ESG Global Equity","N/A",0,"N/A","N/A","N/A","N/A","N/A",0,0,"2021-11-10","BGSEFSGD","2021-11-09",1,0.28089999999999998,0.28089999999999998,0.20771337500000001,0.207511325,0.20771337500000001,0,0,1.5E-3,0,0,0,0,0,1117.6500000000001,0,0,0,0,0,0,0,0,0,0,0,0,4000,4000,0,0,0,0,0,0,0,0,1123.76,1123.72,0,0,0,0,0,0,0,0,0,0,0,0,0,0,0,0,0,0,0,0,0,0,0,0,0,0,0,0,0,-0.06,0.02,0,0,0,0,0,0,0,0,0,0,0,0,0,0,1.7999999999999999E-2,3.5E-4,0,0,0,0,0,"KLCI",0,"A","MYT","X","B",99,"T",4,0,0,0,0,0,0,null,"2021-11-10",0,1.7999999999999999E-2]
["BGSEFUSD","GSEUSD","BGSEFUSD","Bimb-Arabesque Global Shariah Sustainable Equity","Bimb-Arabesque Global Shariah Sustainable Equity Fund (USD)",1,1,1,"USD","DTMBBGSEF","DTMBBGSEF","MYR","arazaks","DTMB","N/A","N/A",1,1,0,0,"N/A","2020-04-01","2021-03-31","2021-03-31",3,"ALL",365,0,0,0,7,31,2,1,0,0,"BI",1,0,"MF03","TR02",1,1,null,null,null,"Level 19, Menara Bank Islam, No 2, Jalan Perak, 50450 KL","WPKL",50450,"WLP","MY",null,null,"                                                                                                                                                      ","                                                                                                                                                      ",null,null,"MSCIACWIII",0,0,1,0,1,null,0,"N/A",0,0,"N/A","N/A","N/A","N/A","N/A",0,"2021-04-02T16:44:38","nasim",false,1,1,5,"BGSEFUSD","Islamic-ESG Global Equity","N/A",0,"N/A","N/A","N/A","N/A","N/A",0,0,"2021-11-10","BGSEFUSD","2021-11-09",1,0.27929999999999999,0.27929999999999999,0.279300922748,0.27903040696100001,0.279300922748,0,0,2.9998999999999998E-4,0,0,0,0,0,11521.68,0,0,0,0,0,0,0,0,0,0,0,0,41291.86,41291.86,0,0,0,0,0,0,0,0,11533.21,11532.85,0,0,0,0,0,0,0,0,0,0,0,0,0,0,0,0,0,0,0,0,0,0,0,0,0,0,0,0,0,-0.56999999999999995,0.22,-0.01,0,0,0,0,0,0,0,0,0,0,0,0,0,1.7999999999999999E-2,3.5E-4,0,0,0,0,0,"KLCI",0,"A","MYT","X","B",99,"T",4,0,0,0,0,0,0,null,"2021-11-10",0,1.7999999999999999E-2]
["BIPF","BIPF","BANK ISLAM PREMIER","Bank Islam Premier Fund","Bank Islam Premier Fund",1,1,1,"MYR","DTMBIPF","DTMBIPF","MYR","arazaks","DTMB","N/A","N/A",1,1,0,0,"N/A","2020-10-20","2021-05-31","2021-05-31",3,"ALL",365,0,0,0,0,0,2,1,0,0,"BI",1,0,"MF03","TR02",1,1,null,null,null,"Level 19, Menara Bank Islam, No 2, Jalan Perak, 50450 KL","WPKL",50450,"WLP","MY",null,null,"                                                                                                                                                      ","                                                                                                                                                      ",null,null,"FBMSHA",0,0,1,0,0,null,0,"N/A",0,0,"N/A","N/A","N/A","N/A","N/A",0,"2021-01-06T16:48:03","nasim",false,1,1,0,"BIPF","Islamic Malaysia Balanced","N/A",0,"N/A","N/A","N/A","N/A","N/A",0,0,"2021-11-10","BIPF","2021-11-09",1,1.0651999999999999,1.0651999999999999,1.065228195217,1.0633984602540001,1.065228195217,1.72065E-3,0,1.8E-3,1.8E-3,0,0,51.37,6414.04,3739358.2,0,0,5033785.47,5033785.47,0,3812979.13,3812979.13,0,0,0,0,0,3516419.23,3516419.23,0,0,0,0,0,0,0,0,3745823.61,3745788.91,0,0,0,0,2799788.09,1171964.99,0,0,8731.14,0,0,0,0,-210346.53,0,0,0,0,0,0,0,0,-225929.47,-1392.77,991.85,-40.630000000000003,-14953.62,0,0,-123.15,92.04,-3.59,0,0,0,-92.04,0,1098.23,0,0,0,-225929.47,-225929.47,0,0.08,1.2E-2,3.5E-4,0,0,0,0,0,"KLCI",0,"A","MYT","X","B",99,"T",4,0,0,0,0,0,0,null,"2021-11-10",0,1.2E-2]
{"$rows_left_out":27}
{"sheet":"Setting","index":5,"n_rows":42,"n_cols":4,"rows_kept":42,"cut":false,"hidden":false,"merged":[]}
["PORTFOLIO CODE",null,"PORTFOLIO CODE END"]
["Fund SDF"]
["Fund Code","Fund Description","FIMM Fund Code","Bloomberg Code"]
["BICMF3","BIMB I Cash Management Fund 3","BIMB I CASH 3","BICMF3 MK"]
["BIW","BIMB Invest Wafiyah","BIMB INVEST WAFIYAH"]
["BSF-Class A","BSF-Class A","BSF-A","BIMESSA MK"]
["BSF-Class B","BSF-Class B","BSF-B","BIMESSB MK"]
["BSF-Class C","BSF-Class C","BSF-C","BIMESSC MK"]
["BSF-Class D","BSF-Class D","BSF-D","BIMESSD MK"]
["BSF-Class E","BSF-Class E","BSF-E","BIMESSE MK"]
{"$rows_left_out":33}
{"sheet":"MYR upload-BIMB Migration","index":6,"n_rows":36,"n_cols":37,"rows_kept":36,"cut":false,"hidden":true,"merged":[]}
[null,null,null,null,null,{"$f":"\"MIGRATION\" & ROW()-2","v":"MIGRATION-1"}]
["Sender BIC","Trade Date","SettlementDate","OrderType","Func","OrderRef (client ref)","Related Reference","SCAId","Cash Account","SecId","SchemeNum (ISIN)","CounterpartyBic1","CounterpartyBic2","CounterPartyAcct","PSetDet","ClntType","SLBCpty","SettIndicator","BuyrSellBic","Participantid","BuyrSellAcc (CDS)","RtgsIndicator","BeneIndicator","StamIndicator","QuantityQual","Quantity","SettCurrency","SettAmount","TradePlaceCode","TradePlaceNarrative","SettIndicatorDSS","LinkType","RefNumber","FXCCY","SPRO","isAdjustment","RelatedTMID"]
["SCBLMYKXXXXX",20170630,20170630,540,null,"MIGRATION1",null,132267100053,null,"MYQ0021OO004","ISIN",null,null,null,"MCDSMYK1",null,null,"TRAD",null,null,null,null,null,null,114000,114000,"MYR",171058.46]
["SCBLMYKXXXXX",20170630,20170630,540,null,"MIGRATION2",null,132267100053,null,"MYQ0069OO003","ISIN",null,null,null,"MCDSMYK1",null,null,"TRAD",null,null,null,null,null,null,3635000,3635000,"MYR",901899.64]
["SCBLMYKXXXXX",20170630,20170630,540,null,"MIGRATION3",null,132267100053,null,"MYQ0166OO007","ISIN",null,null,null,"MCDSMYK1",null,null,"TRAD",null,null,null,null,null,null,134000,134000,"MYR",274936.40999999997]
["SCBLMYKXXXXX",20170630,20170630,540,null,"MIGRATION4",null,132267100053,null,"MYL3867OO008","ISIN",null,null,null,"MCDSMYK1",null,null,"TRAD",null,null,null,null,null,null,44000,44000,"MYR",532875.66]
["SCBLMYKXXXXX",20170630,20170630,540,null,"MIGRATION5",null,132267100053,null,"MYL4588OO009","ISIN",null,null,null,"MCDSMYK1",null,null,"TRAD",null,null,null,null,null,null,52000,52000,"MYR",455803.29]
["SCBLMYKXXXXX",20170630,20170630,540,null,"MIGRATION6",null,132267100053,null,"MYL5005OO003","ISIN",null,null,null,"MCDSMYK1",null,null,"TRAD",null,null,null,null,null,null,129000,129000,"MYR",410761.14]
["SCBLMYKXXXXX",20170630,20170630,540,null,"MIGRATION7",null,132267100053,null,"MYL5020OO002","ISIN",null,null,null,"MCDSMYK1",null,null,"TRAD",null,null,null,null,null,null,99900,99900,"MYR",125446.08]
["SCBLMYKXXXXX",20170630,20170630,540,null,"MIGRATION8",null,132267100053,null,"MYL5095OO004","ISIN",null,null,null,"MCDSMYK1",null,null,"TRAD",null,null,null,null,null,null,232000,232000,"MYR",347573.8]
{"$rows_left_out":26}