{"text_format":"1","workbook":"xlsx","n_sheets":14,"sheets":["Main","Template","InTrn","InFund","InIntRec","InHolding","Descriptions","1) List of Reclassed Securities","2) ITM Reclassed Securities","3) OTM Reclassed Securities","4) Reclassed Sec Not Disposed","5) Cash Account Interest","BNYM_NAV_HistCost_RCdate","BNYM_NAV_HistCost_MonthEnd"],"not_rendered":{"charts":0,"images":8,"macros":1,"external_links":0,"defined_names":75,"comments":0,"pivot_tables":5},"unopened":[],"bounds":{"document_bytes":16777216,"sheet_cells":100000,"rows_first":2000,"rows_last":500,"rows_between":2000,"halvings":0,"cell_chars":16384,"cell_head_chars":4096},"cells_cut":0,"cells_raw":0,"read":"whole","date_system":"1900"}

{"sheet":"Main","index":0,"n_rows":16,"n_cols":9,"rows_kept":16,"cut":false,"hidden":false,"merged":[[1,0,1,2]]}
[]
["EFM NCI Reporting"]
[]
[null,null,null,null,null,"* Please sheet(s) to print",null,"* For pivot table listing control"]
[null,null,null,null,null,"Sheet","YES/NO","Start Row","Last Col"]
[null,"Company :","NOMURA ASSET MANAGEMENT MALAYSIA SDN BHD",{"$f":"VLOOKUP(FundCode,InFund!A2:G75,7,0)","v":"NI"},null,"Descriptions","YES"]
{"$rows_left_out":11}
{"sheet":"Template","index":1,"n_rows":93,"n_cols":10,"rows_kept":93,"cut":false,"hidden":false,"merged":[[85,0,85,7]]}
["1) List of Reclassed Securities"]
["Note :"]
[]
["All transactions are in USD unless stated otherwise."]
[]
["1. Total no. of shares are as at ending of the Reclass Date."]
{"$rows_left_out":88}
{"sheet":"InTrn","index":2,"n_rows":12,"n_cols":27,"rows_kept":12,"cut":false,"hidden":true,"merged":[]}
["CustNo","qStockCode","StockName","TranType","ExRate","BeginUFV","BeginCostPrice","BeginCostFC","TradeDate","UnitFaceValue","TranPrice","FCNetProceed","FCGrossProceed","PayDate","MVPrice","ReclassDt","ReclassPrice","ReClassMV","qTrnCode","TranDesc","MarketValueFC","OutMoney","SeqName","row_num","ImportCost","ImportCostPrice","FilterInOut"]
[212401,"BYP20B9","BAYCURRENT CONSULTING INC","SELL",4.1985000000000001,7200,425.58068611111111,3055905.74,"2022-02-28",400,396.3533783783767,158382.81,158541.35140000001,"2022-02-28",394.96452638888888,"2021-12-20",388.02416388888889,2793773.98,"SS","Share Sale",2843744.59,1,"202112_BYP20B9",1,{"$f":"IF(X2<>1,0,ROUND(SUMIFS(BNYM_NAV_HistCost_RCdate!$AA:$AA,BNYM_NAV_HistCost_RCdate!C:C,P2,BNYM_NAV_HistCost_RCdate!I:I,B2),2))","v":3063971.51},{"$f":"SUMIFS(BNYM_NAV_HistCost_RCdate!$AA:$AA,BNYM_NAV_HistCost_RCdate!C:C,P2,BNYM_NAV_HistCost_RCdate!I:I,B2)/SUMIFS(BNYM_NAV_HistCost_RCdate!$W:$W,BNYM_NAV_HistCost_RCdate!C:C,P2,BNYM_NAV_HistCost_RCdate!I:I,B2)","v":425.5515986111111},{"$f":"IF(ISERROR(IF(Z2>Q2,1,0)),V1,IF(Z2>Q2,1,0))","v":1}]
[212401,"BYP20B9","BAYCURRENT CONSULTING INC","SELL",4.1929999999999996,6800,425.58068676470589,2885673.47,"2022-03-01",800,424.79639639639822,339497.28,339837.11709999997,"2022-03-01",393.74864264705883,"2021-12-20",388.02416388888889,2793773.98,"SS","Share Sale",2677490.77,1,"202112_BYP20B9",2,{"$f":"IF(X3<>1,0,ROUND(SUMIFS(BNYM_NAV_HistCost_RCdate!$AA:$AA,BNYM_NAV_HistCost_RCdate!C:C,P3,BNYM_NAV_HistCost_RCdate!I:I,B3),2))","v":0},{"$f":"SUMIFS(BNYM_NAV_HistCost_RCdate!$AA:$AA,BNYM_NAV_HistCost_RCdate!C:C,P3,BNYM_NAV_HistCost_RCdate!I:I,B3)/SUMIFS(BNYM_NAV_HistCost_RCdate!$W:$W,BNYM_NAV_HistCost_RCdate!C:C,P3,BNYM_NAV_HistCost_RCdate!I:I,B3)","v":425.5515986111111},{"$f":"IF(ISERROR(IF(Z3>Q3,1,0)),V2,IF(Z3>Q3,1,0))","v":1}]
[212401,"BYP20B9","BAYCURRENT CONSULTING INC","SELL",4.194,6000,425.58918499999999,2545259.91,"2022-03-02",1500,410.45163830497125,615061.78,615677.45750000002,"2022-03-02",424.6330733333333,"2021-12-20",388.02416388888889,2793773.98,"SS","Share Sale",2547798.44,1,"202112_BYP20B9",3,{"$f":"IF(X4<>1,0,ROUND(SUMIFS(BNYM_NAV_HistCost_RCdate!$AA:$AA,BNYM_NAV_HistCost_RCdate!C:C,P4,BNYM_NAV_HistCost_RCdate!I:I,B4),2))","v":0},{"$f":"SUMIFS(BNYM_NAV_HistCost_RCdate!$AA:$AA,BNYM_NAV_HistCost_RCdate!C:C,P4,BNYM_NAV_HistCost_RCdate!I:I,B4)/SUMIFS(BNYM_NAV_HistCost_RCdate!$W:$W,BNYM_NAV_HistCost_RCdate!C:C,P4,BNYM_NAV_HistCost_RCdate!I:I,B4)","v":425.5515986111111},1]
[212401,"BYP20B9","BAYCURRENT CONSULTING INC","SELL",4.1775000000000002,4500,425.58918444444447,1906876.13,"2022-03-07",700,357.9940515654788,250345.24,250595.8358,"2022-03-07",388.01550222222221,"2021-12-20",388.02416388888889,2793773.98,"SS","Share Sale",1746069.76,1,"202112_BYP20B9",4,{"$f":"IF(X5<>1,0,ROUND(SUMIFS(BNYM_NAV_HistCost_RCdate!$AA:$AA,BNYM_NAV_HistCost_RCdate!C:C,P5,BNYM_NAV_HistCost_RCdate!I:I,B5),2))","v":0},{"$f":"SUMIFS(BNYM_NAV_HistCost_RCdate!$AA:$AA,BNYM_NAV_HistCost_RCdate!C:C,P5,BNYM_NAV_HistCost_RCdate!I:I,B5)/SUMIFS(BNYM_NAV_HistCost_RCdate!$W:$W,BNYM_NAV_HistCost_RCdate!C:C,P5,BNYM_NAV_HistCost_RCdate!I:I,B5)","v":425.5515986111111},1]
[212401,"BYP20B9","BAYCURRENT CONSULTING INC","SELL",4.1822999999999997,3800,425.5891842105263,1608963.7,"2022-03-08",400,349.4593381452558,139671.91,139783.7353,"2022-03-08",354.46548421052631,"2021-12-20",388.02416388888889,2793773.98,"SS","Share Sale",1346968.84,1,"202112_BYP20B9",5,{"$f":"IF(X6<>1,0,ROUND(SUMIFS(BNYM_NAV_HistCost_RCdate!$AA:$AA,BNYM_NAV_HistCost_RCdate!C:C,P6,BNYM_NAV_HistCost_RCdate!I:I,B6),2))","v":0},{"$f":"SUMIFS(BNYM_NAV_HistCost_RCdate!$AA:$AA,BNYM_NAV_HistCost_RCdate!C:C,P6,BNYM_NAV_HistCost_RCdate!I:I,B6)/SUMIFS(BNYM_NAV_HistCost_RCdate!$W:$W,BNYM_NAV_HistCost_RCdate!C:C,P6,BNYM_NAV_HistCost_RCdate!I:I,B6)","v":425.5515986111111},1]
{"$rows_left_out":7}
{"sheet":"InFund","index":3,"n_rows":7284,"n_cols":9,"rows_kept":7284,"cut":false,"hidden":true,"merged":[]}
["qFundCode","FundName","qFundType","Islamic","FinanceYrStart","FinanceYrEnd","qCompanyID","RollEOYFlag","Fundcurrency"]
["AJC-MASHAREQ","ALJAZIRA JAPANESE EQUITY FUND",1,1,"2013-03-01","2020-12-31","NI",1,"USD"]
["BNM-ICLIF","IFM ICLIF SHARIAH EQUITY NOMURA-I",1,1,"2013-08-26","2020-12-31","NI",1,"MYR"]
["BNM-ICLIF-FI2","IFM ICLIF CORP BOND NOMURA",2,0,"2021-01-04","2020-12-31","NM",1,"MYR"]
["BNM-INCEIF","IFM INCEIF SHARIAH EQUITY NOMURA-I",1,1,"2013-08-26","2020-12-31","NI",1,"MYR"]
["BNM-INCEIF-FI","IFM INCEIF SUKUK NOMURA-I",2,1,"2016-11-28","2020-12-31","NI",1,"MYR"]
{"$rows_left_out":7279}
{"sheet":"InIntRec","index":4,"n_rows":10,"n_cols":7,"rows_kept":10,"cut":false,"hidden":true,"merged":[]}
["CustNo","AccName","accdate","ExRateSCUSD","ExRateUSDMYR","qCurrencyCode","Amount"]
[212401,"EPF-SHWORLD-AUD","2021-09-30",0.72234996740612478,4.1864999999999997,"AUD",3.62]
[212401,"EPF-SHWORLD-AUD","2021-10-29",0.75109994455830875,4.1425000000000001,"AUD",1.17]
[212401,"EPF-SHWORLD-GBP","2021-10-29",1.3707499452453933,4.1425000000000001,"GBP",0.3]
[212401,"EPF-SHWORLD-AUD","2021-11-30",0.70904996777226093,4.2115,"AUD",0.62]
[212401,"EPF-SHWORLD-GBP","2021-11-30",1.3229999627443212,4.2115,"GBP",0.04]
{"$rows_left_out":5}
{"sheet":"InHolding","index":5,"n_rows":5,"n_cols":23,"rows_kept":5,"cut":false,"hidden":true,"merged":[]}
["HistoryDate","qStockCode","StockName","UnitFaceValue","costfc","MarketValueFC","ExchgRate","StockCurrency","CustNo","CostPrice","MVPrice","MthEndPrice","MthEndMV","MthEndUint","MthEndCost","ISINCode","OtherCode1","CostSC","MarketValueSC","Price","AccIntSC","AccIntFC","curUFV"]
["2021-12-20","BYP20B9","BAYCURRENT CONSULTING INC",7200,3063971.5,2793773.98,113.395,"JPY",212401,425.5515972222222,388.02416388888889,333.05032400000005,832625.81,2500,1063878.9930555555,"JP3835250006","6532 JP",349127897,316800000,44000,0,0,2500]
["2022-03-21",2459020,"INTUIT INC",7242,3922076.37,3378393,1,"USD",212401,541.57364954432478,466.5,418.75,3032587.5,7242,3922076.37,"US4612021034","INTU US",3922076.37,3378393,466.5,0,0,7242]
["2022-05-10","BQ7ZVF1","EUROAPI SASU",2740,32234.66,41887.339999999997,0.94849664,"EUR",212401,11.764474452554744,15.287350364963503,null,null,null,null,"FR0014008VX5","EAPI FP",30458.91,39730,14.5,0,0]
["2022-05-13","BLDBN85","ATLAS COPCO AB-B RDS",162879,0,129326.78,10.0755,"SEK",212401,0,0.79400524315596244,null,null,null,null,"SE0017486871","ATCOILB SS",0,1303032,8,0,0]

{"sheet":"Descriptions","index":6,"n_rows":14,"n_cols":3,"rows_kept":14,"cut":false,"hidden":false,"merged":[[13,1,13,8],[3,2,3,9],[4,2,4,9],[5,2,5,9],[6,2,6,9],[7,2,7,9],[11,1,11,9]]}
[null,{"$f":"FundCode","v":"EPF-SHWORLD"}]
[]
[]
[null,"Worksheet Name","Descriptions"]
[null,"1) List of Reclassed Securities","Listing of all securities in the portfolio that are reclassified from shariah to non-shariah on the effective date of reclassification (MMYYYY) based on the periodic review by the shariah index used as performance benchmark as stated in the mandate (i.e. FTSE and MSCI)."]
[null,"2) ITM Reclassed Securities","Disclosure of all the transactions related to the in-the-money (ITM)1 reclassed securites for the month."]
{"$rows_left_out":9}
{"sheet":"1) List of Reclassed Securities","index":7,"n_rows":58,"n_cols":23,"rows_kept":58,"cut":false,"hidden":false,"merged":[]}
[null,null,{"$f":"IF(OR(U1=\"\",U1=\"(blank)\"),\"\",U1)","v":""},{"$f":"IF(OR(N1=\"\",N1=\"(blank)\"),\"\",N1)","v":""},{"$f":"IF(OR(O1=\"\",O1=\"(blank)\"),\"\",O1)","v":""},{"$f":"IF(OR(P1=\"\",P1=\"(blank)\"),\"\",P1)","v":""},{"$f":"IF(OR(M1=\"\",M1=\"(blank)\"),\"\",M1)","v":""},{"$f":"IF(OR(W1=\"\",W1=\"(blank)\"),\"\",ROUND(W1,2))","v":""},{"$f":"IF(OR(Q1=\"\",Q1=\"(blank)\"),\"\",ROUND(SUMIFS(BNYM_NAV_HistCost_RCdate!$AA:$AA,BNYM_NAV_HistCost_RCdate!C:C,G1,BNYM_NAV_HistCost_RCdate!I:I,D1),2))","v":""},{"$f":"IF(OR(V1=\"\",V1=\"(blank)\"),\"\",IF(F1=0,0,ROUND(I1/F1,2)))","v":""},{"$f":"IF(D1=\"\",\"\",IF(H1>=J1,\"IN-THE-MONEY\",\"OUT-OF-THE-MONEY\"))","v":""},{"$f":"IF(OR(R1=\"\",R1=\"(blank)\"),\"\",R1)","v":""}]
[null,{"$f":"\"LIST OF SECURITIES RECLASSIFIED FROM SHARIAH TO NON-SHARIAH IN \" & UPPER(TEXT(EndDate,\"MMMm-yyyy\"))","v":"LIST OF SECURITIES RECLASSIFIED FROM SHARIAH TO NON-SHARIAH IN MAY-2022"}]
[null,null,null," "]
[null,"Mandate :",null,{"$f":"FundName","v":"EPF SHARIAH WORLD NOMURA ISLAMIC"}]
[null,"Portfolio Manager :",null,"NOMURA ISLAMIC ASSET MANAGEMENT SDN BHD"]
[null,null,null," "]
{"$rows_left_out":53}
{"sheet":"2) ITM Reclassed Securities","index":8,"n_rows":34,"n_cols":73,"rows_kept":34,"cut":false,"hidden":false,"merged":[[5,7,5,9],[5,10,5,15],[5,16,5,18],[5,19,5,22],[6,17,8,17],[6,12,8,12],[6,13,8,13],[6,14,8,14],[6,15,8,15],[6,16,8,16],[6,18,8,18],[6,19,8,19],[6,20,8,20],[6,21,8,21],[6,22,8,22],[5,29,5,30],[5,31,5,34],[5,35,5,38],[5,39,8,39],[5,23,5,26],[5,27,5,28],[6,28,8,28],[6,29,8,29],[6,23,8,23],[6,38,8,38],[6,30,8,30],[6,31,7,32],[6,33,7,34],[6,35,8,35],[6,36,8,36],[6,37,8,37],[6,24,8,24],[6,25,8,25],[6,26,8,26],[6,27,8,27],[7,1,8,1],[7,2,8,2],[7,3,8,3],[7,4,8,4],[7,5,8,5],[6,6,8,6],[6,7,8,7],[6,8,8,8],[6,9,8,9],[6,10,8,10],[6,11,8,11]]}
[null,null,{"$f":"IF(OR(AR1=\"\",AT1=\"\"),\"\",AT1)","v":""},{"$f":"IF(OR(AR1=\"\",AU1=\"\"),\"\",AU1)","v":""},{"$f":"IF(OR(AR1=\"\",AV1=\"\"),\"\",AV1)","v":""},{"$f":"IF(OR(AW1=\"\",AW1=\"(blank)\"),\"\",AW1)","v":""},{"$f":"IF(OR(AX1=\"\",AX1=0),\"\",ROUND(AX1,4))","v":""},{"$f":"IF(OR(AY1=\"\",AY1=0),\"\",IF(F1=\"Corporate Action\",BB1,AY1))","v":""},{"$f":"IF(BM1=\"\",\"\",IF(BM1=1,AZ1,AZ1))","v":""},{"$f":"IF(H1=\"\",\"\",I1*H1)","v":""},{"$f":"IF(OR(BG1=\"\",BH1<>\"SS\"),\"\",BG1)","v":""},{"$f":"IF(OR(BB1=\"\",BH1<>\"SS\"),\"\",BB1)","v":""},{"$f":"IF(OR(BC1=\"\",BH1<>\"SS\"),\"\",BC1)","v":""},{"$f":"IF(OR(BE1=\"\",BH1<>\"SS\"),\"\",BE1)","v":""},{"$f":"IF(L1=\"\",\"\",L1*I1)","v":""},{"$f":"IF(OR(BE1=\"\",BH1<>\"SS\"),\"\",BE1-BD1)","v":""},{"$f":"IF(OR(BI1=0,BI1=\"\"),\"\",BI1)","v":""},{"$f":"IF(OR(BJ1=\"\",BJ1=0),\"\",BJ1)","v":""},{"$f":"IF(OR(R1=\"\",L1=0),\"\",L1*R1)","v":""},{"$f":"IF(OR(BG1=\"\",BH1<>\"SI\"),\"\",BG1)","v":""},{"$f":"IF(OR(AS1=\"\",BH1<>\"SI\"),\"\",AS1)","v":""},{"$f":"IF(OR(BC1=\"\",BH1<>\"SI\"),\"\",W1/H1)","v":""},{"$f":"IF(OR(BD1=\"\",BH1<>\"SI\"),\"\",BD1)","v":""},{"$f":"IF(OR(BL1=\"\",BL1=\"(blank)\",BH1=\"SI\",BH1=\"SS\"),\"\",BL1)","v":""},{"$f":"IF(OR(BG1=\"\",BG1=\"(blank)\",BH1=\"SI\",BH1=\"SS\",BL1=\"(blank)\"),\"\",BG1)","v":""},{"$f":"IF(OR(BB1=\"\",BB1=\"(blank)\",BH1=\"SI\",BH1=\"SS\",BH1=\"\",BL1=\"(blank)\"),\"\",BB1)","v":""},{"$f":"IF(OR(BD1=\"\",BD1=\"(blank)\",BH1=\"SI\",BH1=\"SS\",BH1=\"\",BL1=\"(blank)\"),\"\",BD1)","v":""},{"$f":"IF(N1=\"\",\"\",N1-O1-P1)","v":""},{"$f":"IF(W1=\"\",\"\",W1)","v":""},{"$f":"IF(S1=\"\",\"\",IF(S1=\"\",0,S1)-IF(O1=\"\",0,O1)-IF(P1=\"\",0,P1))","v":""},{"$f":"IF(AC1=\"\",\"\",AC1)","v":""},{"$f":"IF(N1=\"\",\"\",N1-S1)","v":""},{"$f":"IF(OR(AF1=\"\",G1=\"\"),\"\",AF1*G1)","v":""},{"$f":"IF(AE1=\"\",\"\",AE1)","v":""},{"$f":"IF(OR(AH1=\"\",G1=\"\"),\"\",AH1*G1)","v":""},{"$f":"IF(H1=\"\",\"\",IF(BH1=\"SS\",H1-L1,IF(F1<>\"\",H1,\"\")))","v":""},{"$f":"IF($F1=\"\",\"\",IF($F1=\"Dividend\",$AL1/$AJ1,IF($F1=\"SELL\",IF(I1=0,AZ1,$I1),($J1-IF($AA1=\"\",0,$AA1))/$AJ1)))","v":""},{"$f":"IF($F1=\"\",\"\",IF($F1=\"Dividend\",$BA1,AK1*AJ1))","v":""},{"$f":"IF(R1=\"\",\"\",IF(BH1=\"SS\",R1,IF(F1<>\"\",R1,\"\")))","v":""}]
[null,{"$f":"\"TRANSACTIONS OF THE IN-THE-MONEY (ITM) RECLASSED SECURITIES FOR THE MONTH OF \"&UPPER(TEXT(EndDate,\"MMMm-yyyy\"))","v":"TRANSACTIONS OF THE IN-THE-MONEY (ITM) RECLASSED SECURITIES FOR THE MONTH OF MAY-2022"}]
[]
[null,"Mandate :",null,{"$f":"FundName","v":"EPF SHARIAH WORLD NOMURA ISLAMIC"}]
[null,"Portfolio Manager :",null,"NOMURA ISLAMIC ASSET MANAGEMENT SDN BHD"]
[null,null,null,null,null,null,null,"Beginning Holdings",null,null,"Disposal \nof \nReclassed Securities",null,null,null,null,null,"Details \nof \nReclassed Securities",null,null,"Dividend Received \nfrom \nReclassed Securities",null,null,null,"Corporate Action \nEvents of the Reclassed Securities",null,null,null,"Total Income ",null,"Shariah Income",null,"Non-Compliant Income (NCI) ",null,null,null,"Remaining Holdings",null,null,null,"Note"]
{"$rows_left_out":29}
{"sheet":"3) OTM Reclassed Securities","index":9,"n_rows":317,"n_cols":62,"rows_kept":317,"cut":false,"hidden":false,"merged":[[5,27,5,30],[6,19,8,19],[5,31,5,33],[5,34,8,34],[6,6,8,6],[6,7,8,7],[6,8,8,8],[6,9,8,9],[6,10,8,10],[6,11,8,11],[6,12,8,12],[6,13,8,13],[5,7,5,9],[5,10,5,15],[5,16,5,19],[5,20,5,23],[5,24,5,25],[6,14,8,14],[6,15,8,15],[6,16,8,16],[6,17,8,17],[6,18,8,18],[6,33,8,33],[6,20,8,20],[6,21,8,21],[6,22,8,22],[6,23,8,23],[6,24,8,24],[6,25,8,25],[6,26,8,26],[6,27,7,28],[6,29,7,30],[6,31,8,31],[6,32,8,32],[7,1,8,1],[7,2,8,2],[7,3,8,3],[7,4,8,4],[7,5,8,5]]}
[null,null,{"$f":"IF(OR(AK1=\"\",AM1=\"\"),\"\",AM1)","v":""},{"$f":"IF(OR(AK1=\"\",AN1=\"\"),\"\",AN1)","v":""},{"$f":"IF(OR(AK1=\"\",AO1=\"\"),\"\",AO1)","v":""},{"$f":"IF(OR(AP1=\"\",AP1=\"(blank)\"),\"\",AP1)","v":""},{"$f":"IF(OR(AQ1=\"\",AQ1=0),\"\",AQ1)","v":""},{"$f":"IF(AR1=\"\",\"\",IF(F1=\"Corporate Action\",AU1,AR1))","v":""},{"$f":"IF(BB1=\"\",\"\",IF(BB1=1,AS1,AS1))","v":""},{"$f":"IF(H1=\"\",\"\",I1*H1)","v":""},{"$f":"IF(OR(AY1=\"\",AZ1<>\"SS\"),\"\",AY1)","v":""},{"$f":"IF(OR(AU1=\"\",AZ1<>\"SS\"),\"\",AU1)","v":""},{"$f":"IF(OR(AV1=\"\",AZ1<>\"SS\"),\"\",AV1)","v":""},{"$f":"IF(OR(AX1=\"\",AZ1<>\"SS\"),\"\",AX1)","v":""},{"$f":"IF(L1=\"\",\"\",L1*I1)","v":""},{"$f":"IF(OR(AX1=\"\",AZ1<>\"SS\"),\"\",AX1-AW1)","v":""},{"$f":"IF(OR(AY1=\"\",AZ1<>\"SI\"),\"\",AY1)","v":""},{"$f":"IF(OR(AL1=\"\",AZ1<>\"SI\"),\"\",AL1)","v":""},{"$f":"IF(OR(AV1=\"\",AZ1<>\"SI\"),\"\",T1/H1)","v":""},{"$f":"IF(OR(AW1=\"\",AZ1<>\"SI\"),\"\",AW1)","v":""},{"$f":"IF(OR(BA1=\"\",BA1=\"(blank)\",AZ1=\"SI\",AZ1=\"SS\"),\"\",BA1)","v":""},{"$f":"IF(OR(AY1=\"\",AY1=\"(blank)\",AZ1=\"SI\",AZ1=\"SS\",BA1=\"(blank)\"),\"\",AY1)","v":""},{"$f":"IF(OR(AU1=\"\",AU1=\"(blank)\",AZ1=\"SI\",AZ1=\"SS\",BA1=\"(blank)\"),\"\",AU1)","v":""},{"$f":"IF(OR(AW1=\"\",AW1=\"(blank)\",AZ1=\"SI\",AZ1=\"SS\",BA1=\"(blank)\"),\"\",AW1)","v":""},{"$f":"IF(N1=\"\",\"\",N1-O1-P1)","v":""},{"$f":"IF(T1=\"\",\"\",T1)","v":""},{"$f":"IF(Z1=\"\",\"\",IF(J1>0,Z1,\"\"))","v":""},{"$f":"IF(Y1=\"\",\"\",IF(Y1>=0,Y1,\"\"))","v":""},{"$f":"IF(AB1=\"\",\"\",IF(G1=\"\",\"\",AB1*G1))","v":""},{"$f":"IF(Z1=\"\",\"\",IF(J1<=0,Z1,\"\"))","v":""},{"$f":"IF(AD1=\"\",\"\",IF(G1=\"\",\"\",AD1*G1))","v":""},{"$f":"IF(H1=\"\",\"\",IF(AZ1=\"SS\",H1-L1,IF(F1<>\"\",H1,\"\")))","v":""},{"$f":"IF($F1=\"\",\"\",IF($F1=\"Dividend\",$AH1/$AF1,IF($F1=\"SELL\",$I1,($J1-IF($X1=\"\",0,$X1))/$AF1)))","v":""},{"$f":"IF($F1=\"\",\"\",IF($F1=\"Dividend\",$AT1,AG1*AF1))","v":""}]
[null,{"$f":"\"TRANSACTIONS OF THE OUT-OF-THE-MONEY (OTM) RECLASSED SECURITIES FOR THE MONTH OF \"&UPPER(TEXT(EndDate,\"MMMm-yyyy\"))","v":"TRANSACTIONS OF THE OUT-OF-THE-MONEY (OTM) RECLASSED SECURITIES FOR THE MONTH OF MAY-2022"}]
[]
[null,"Mandate :",null,{"$f":"FundName","v":"EPF SHARIAH WORLD NOMURA ISLAMIC"}]
[null,"Portfolio Manager :",null,"NOMURA ISLAMIC ASSET MANAGEMENT SDN BHD"]
[null,null,null,null,null,null,null,"Beginning Holdings",null,null,"Disposal \nof \nReclassed Securities",null,null,null,null,null,"Dividend Received \nfrom \nReclassed Securities",null,null,null,"Corporate Action \nEvents of the Reclassed Securities",null,null,null,"Total Income ",null,"Shariah Income ","Non-Compliant Income (NCI)",null,null,null,"Remaining Holdings",null,null,"Note"]
{"$rows_left_out":312}
{"sheet":"4) Reclassed Sec Not Disposed","index":10,"n_rows":51,"n_cols":27,"rows_kept":51,"cut":false,"hidden":false,"merged":[]}
[null,null,{"$f":"IF(OR(P1=\"\",P1=\"(blank)\"),\"\",P1)","v":""},{"$f":"IF(OR(Q1=\"\",Q1=\"(blank)\"),\"\",Q1)","v":""},{"$f":"IF(OR(R1=\"\",R1=\"(blank)\"),\"\",R1)","v":""},{"$f":"IF(OR(D1=\"\"),\"\",IF(D1=0,0,ROUND(SUMIFS(BNYM_NAV_HistCost_MonthEnd!W:W,BNYM_NAV_HistCost_MonthEnd!I:I,D1),0)))","v":""},{"$f":"IF(OR(O1=\"\",O1=\"(blank)\"),\"\",O1)","v":""},{"$f":"IF(OR(W1=\"\",W1=\"(blank)\"),\"\",W1)","v":""},{"$f":"IF(D1=\"\",\"\",IF(IF(M1=\"OUT-OF-THE-MONEY\",SUMIFS('3) OTM Reclassed Securities'!BH:BH,'3) OTM Reclassed Securities'!BE:BE,D1,'3) OTM Reclassed Securities'!BF:BF,G1,'3) OTM Reclassed Securities'!BJ:BJ,1),SUMIFS('2) ITM Reclassed Securities'!BS:BS,'2) ITM Reclassed Securities'!BP:BP,D1,'2) ITM Reclassed Securities'!BQ:BQ,G1,'2) ITM Reclassed Securities'!BU:BU,1))=0,SUMIFS(BNYM_NAV_HistCost_RCdate!$AA:$AA,BNYM_NAV_HistCost_RCdate!C:C,G1,BNYM_NAV_HistCost_RCdate!I:I,D1)/SUMIFS(BNYM_NAV_HistCost_RCdate!$W:$W,BNYM_NAV_HistCost_RCdate!C:C,G1,BNYM_NAV_HistCost_RCdate!I:I,D1),IF(M1=\"OUT-OF-THE-MONEY\",SUMIFS('3) OTM Reclassed Securities'!BH:BH,'3) OTM Reclassed Securities'!BE:BE,D1,'3) OTM Reclassed Securities'!BF:BF,G1,'3) OTM Reclassed Securities'!BJ:BJ,1),SUMIFS('2) ITM Reclassed Securities'!BS:BS,'2) ITM Reclassed Securities'!BP:BP,D1,'2) ITM Reclassed Securities'!BQ:BQ,G1,'2) ITM Reclassed Securities'!BU:BU,1))))","v":""},{"$f":"IF(D1=\"\",\"\",IF(F1=0,0,IF(IF(M1=\"OUT-OF-THE-MONEY\",SUMIFS('3) OTM Reclassed Securities'!BI:BI,'3) OTM Reclassed Securities'!BE:BE,D1,'3) OTM Reclassed Securities'!BF:BF,G1,'3) OTM Reclassed Securities'!BJ:BJ,1),SUMIFS('2) ITM Reclassed Securities'!BT:BT,'2) ITM Reclassed Securities'!BP:BP,D1,'2) ITM Reclassed Securities'!BQ:BQ,G1,'2) ITM Reclassed Securities'!BU:BU,1))=0,SUMIFS(BNYM_NAV_HistCost_RCdate!$AA:$AA,BNYM_NAV_HistCost_RCdate!C:C,G1,BNYM_NAV_HistCost_RCdate!I:I,D1),IF(M1=\"OUT-OF-THE-MONEY\",SUMIFS('3) OTM Reclassed Securities'!BI:BI,'3) OTM Reclassed Securities'!BE:BE,D1,'3) OTM Reclassed Securities'!BF:BF,G1,'3) OTM Reclassed Securities'!BJ:BJ,1),SUMIFS('2) ITM Reclassed Securities'!BT:BT,'2) ITM Reclassed Securities'!BP:BP,D1,'2) ITM Reclassed Securities'!BQ:BQ,G1,'2) ITM Reclassed Securities'!BU:BU,1)))))","v":""},{"$f":"IF(OR(F1=\"\"),\"\",IF(F1=0,0,IF(SUMIFS(BNYM_NAV_HistCost_MonthEnd!W:W,BNYM_NAV_HistCost_MonthEnd!I:I,D1)=0,0,SUMIFS(BNYM_NAV_HistCost_MonthEnd!AG:AG,BNYM_NAV_HistCost_MonthEnd!I:I,D1)/SUMIFS(BNYM_NAV_HistCost_MonthEnd!W:W,BNYM_NAV_HistCost_MonthEnd!I:I,D1))))","v":""},{"$f":"IF(OR(F1=\"\"),\"\",IF(F1=0,0,ROUND(K1*F1,0)))","v":""},{"$f":"IF(G1=\"\",\"\",IF(H1>=SUMIFS('1) List of Reclassed Securities'!J:J,'1) List of Reclassed Securities'!D:D,D1,'1) List of Reclassed Securities'!G:G,G1),\"IN-THE-MONEY\",\"OUT-OF-THE-MONEY\"))","v":""}]
[null,{"$f":"\"LIST OF REMAINING RECLASSIFIED SECURITIES NOT DISPOSED AS OF  \"&UPPER(TEXT(EndDate,\"MMMm-yyyy\"))","v":"LIST OF REMAINING RECLASSIFIED SECURITIES NOT DISPOSED AS OF  MAY-2022"}]
[]
[null,"Mandate :",null,{"$f":"FundName","v":"EPF SHARIAH WORLD NOMURA ISLAMIC"}]
[null,"Portfolio Manager :",null,"NOMURA ISLAMIC ASSET MANAGEMENT SDN BHD"]
[]
{"$rows_left_out":46}
{"sheet":"5) Cash Account Interest","index":11,"n_rows":123,"n_cols":19,"rows_kept":123,"cut":false,"hidden":false,"merged":[[115,1,115,8],[5,5,5,6],[5,7,5,10],[6,6,7,6],[6,7,6,10],[6,1,7,1],[6,2,7,2],[6,3,7,3],[6,4,7,4],[6,5,7,5]]}
[null,null,{"$f":"IF(OR(N1=\"\",N1=\"(blank)\"),\"\",N1)","v":""},{"$f":"IF(OR(O1=\"\",O1=\"(blank)\"),\"\",O1)","v":""},{"$f":"IF(OR(M1=\"\",M1=\"(blank)\"),\"\",M1)","v":""},{"$f":"IF(OR(P1=\"\",P1=0,P1=\"(blank)\"),\"\",P1)","v":""},{"$f":"IF(OR(Q1=\"\",Q1=\"(blank)\"),\"\",Q1)","v":""},{"$f":"IF(OR(R1=\"\",R1=FundCur,R1=\"(blank)\"),\"\",R1)","v":""},{"$f":"IF(OR(S1=\"\",S1=\"(blank)\"),\"\",S1)","v":""},{"$f":"IF(OR(S1=\"\",F1=\"\",S1=\"(blank)\"),\"\",ROUND(S1*F1,8))","v":""},{"$f":"IF(OR(S1=\"\",G1=\"\",S1=\"(blank)\"),\"\",ROUND(J1*G1,2))","v":""}]
[null,{"$f":"\"INTEREST (NCI) RECEIVED ON CASH ACCOUNT IN \"&UPPER(TEXT(EndDate,\"MMMm-yyyy\"))","v":"INTEREST (NCI) RECEIVED ON CASH ACCOUNT IN MAY-2022"},null,null,null,null,"."]
[]
[null,"Mandate :",null,{"$f":"FundName","v":"EPF SHARIAH WORLD NOMURA ISLAMIC"}]
[null,"Portfolio Manager :",null,"NOMURA ISLAMIC ASSET MANAGEMENT SDN BHD"]
[null,null,null,null,null,"Currency Exchange Rate1",null,"Non-Compliant Income (NCI) "]
{"$rows_left_out":118}
{"sheet":"BNYM_NAV_HistCost_RCdate","index":12,"n_rows":377,"n_cols":41,"rows_kept":377,"cut":false,"hidden":false,"merged":[]}
["EPF SHAR W NOM (MYR HC) Distribution"]
[]
[]
[]
[]
[]
{"$rows_left_out":372}
{"sheet":"BNYM_NAV_HistCost_MonthEnd","index":13,"n_rows":94,"n_cols":41,"rows_kept":94,"cut":false,"hidden":false,"merged":[]}
["EPF SHARIAH WD NOM USD Distribution"]
["30-Apr-2022"]
[]
[]
[]
[]
{"$rows_left_out":88}