{"text_format":"1","workbook":"xlsx","n_sheets":6,"sheets":["Sheet1","Login","CashBankAccount","WorkingTrn","Swift","CounterParty"],"not_rendered":{"charts":0,"images":5,"macros":1,"external_links":1,"defined_names":24,"comments":0,"pivot_tables":0},"unopened":[],"bounds":{"document_bytes":16777216,"sheet_cells":100000,"rows_first":2000,"rows_last":500,"rows_between":2000,"halvings":0,"cell_chars":16384,"cell_head_chars":4096},"cells_cut":0,"cells_raw":0,"read":"whole","date_system":"1900"}

{"sheet":"Sheet1","index":0,"n_rows":26,"n_cols":5,"rows_kept":26,"cut":false,"hidden":true,"merged":[]}
[]
[null,null,"Trustee","Placement Type","Instruction Required"]
[null,null,"Citibank","New Placement","MT599 & MT202"]
[null,null,null,"Early Upliftment","MT599"]
[null,null,null,"Rollover, P+I","MT599"]
[null,null,null,"Maturity","Nil"]
[null,null,"CIMB ","New Placement","MT599"]
[null,null,null,"Early Upliftment","MT599"]
[null,null,null,"Rollover, P+I","MT599"]
[null,null,null,"Maturity","Nil"]
[null,null,"Maybank","New Placement","MT599"]
[null,null,null,"Early Upliftment","MT599"]
[null,null,null,"Rollover, P+I","MT599"]
[null,null,null,"Maturity","Nil"]
[null,null,"Deutsche Trustees ","New Placement","MT599 or Manual Instruction"]
[null,null,null,"Early Upliftment","MT599 or Manual Instruction"]
[null,null,null,"Rollover, P+I","MT599 or Manual Instruction"]
[null,null,null,"Maturity","MT599 or Manual Instruction"]
[null,null,"HSBC","New Placement","MT299"]
[null,null,null,"Early Upliftment","MT299"]
[null,null,null,"Rollover, P+I","MT299"]
[null,null,null,"Maturity","MT299"]
[null,null,"Mtrustee","New Placement","Manual Instruction"]
[null,null,null,"Early Upliftment","Manual Instruction"]
[null,null,null,"Rollover, P+I","Manual Instruction"]
[null,null,null,"Maturity","Manual Instruction"]

{"sheet":"Login","index":1,"n_rows":12,"n_cols":8,"rows_kept":12,"cut":false,"hidden":false,"merged":[[1,7,4,12]]}
[]
[null,null,null,null,null,null,null,"Box 389, Lot 7.16, Wisma Central, Jln Ampang, 50450 Kuala Lumpur"]
[]
[]
[]
[]
[]
[]
[]
[]
[]
[null,"Nomura Swift Report"]

{"sheet":"CashBankAccount","index":2,"n_rows":38,"n_cols":2,"rows_kept":38,"cut":false,"hidden":true,"merged":[]}
["Fund Code","Bank Account Number"]
["NRBF2","0042176000"]
["NGDBF","425234001"]
["NGSEF",428124001]
["i-INCOME2","4001525000"]
["RHBI-GDMF","052-000171-301"]
["MSIG-EQ","0599006001"]
["EPF","0599388095"]
["EPFMSIANFI","0599388281"]
["KWAP","0599399054"]
["SOCSO",105272777025]
["EPF-DMSUKUK",1599388024]
["EPF-NIAMEQ",1599388121]
["KWAP-NIAM",1599399093]
["UJSB-EQ2",1599474184]
["TNB-RBTF","211-201-201127-0"]
["i-CASH",4000519000]
["i-MONEY",4000527000]
["NGSSGF",40014344001]
["BNMMF","514012-074895"]
["BNM-NTF-FI","514012082989"]
["BNM-MEDF-FI","514012082996"]
["CGC","514012087512"]
["BNM-NTF","514012-090217"]
["BNM-ICLIF-FI2","514012-432484"]
["BNM-INCEIF","564016-627342"]
["BNM-ICLIF","564016-627366"]
["BNM-INCEIF-FI","564016629781"]
["TNB-RBTFI","564016661913"]
["EPF","0599388095"]
["LAB-NGBF","704252"]
["SLMAB-LFNP","8007882516"]
["NGHC","8008327843"]
["NRBF1","8009839299"]
["PET-ACF","8009857841"]
["PET-FI","8010205303"]
["SLMAB-LNUL","8010370374"]
["SLMTB-FTFPA","8602451955"]

{"sheet":"WorkingTrn","index":3,"n_rows":20,"n_cols":30,"rows_kept":20,"cut":false,"hidden":true,"merged":[]}
[null,null,3,null,null,6,null,{"$f":"COLUMN()","v":8},9,null,11,12,13,14,15,16,17,null,{"$f":"COLUMN()","v":19},20,null,22,null,{"$f":"COLUMN()","v":24},25,null,{"$f":"PROPER(AA12)","v":""},{"$f":"COLUMN()","v":28},null,{"$f":"COLUMN()","v":30}]
["qCshTrnID","qStockCode","qTrnCode","qFundCode","Rate","MaturityPrinciple","FaceValue","SettCurrency","TradeDate","ValueDate","MaturityDate","qCshType","qCPCode","CPName","BNMAcc","RolloverFlag","Tenor","FIDealer","InterestRM","FundName","qCompanyID","PaymentEntity","SourceBankName","qBankAccNo","CshTypeDesc","Basis","Remarks","Trustee","ClientBankAccName","ADINO"]
["CSH*220200610","RPF*MYR*PBK","RP","EPF",1.7500000000000002E-2,0,172450000,"MYR","2022-02-14","2022-02-14","2022-02-15","RPF","PBK","PUBLIC BANK BERHAD","XXX",0,1,null,0,"EMPLOYEES PROVIDENT FUND BOARD","NM","CITIT-EPF","CITIT","0599388095MYR","Short Term Placement",365,null,"CITIT","EMPLOYEES PROVIDENT FUND BOARD","5993880008"]
["CSH*220200612","RPF*MYR*PBK","RP","KWAP",1.7500000000000002E-2,0,61580000,"MYR","2022-02-14","2022-02-14","2022-02-15","RPF","PBK","PUBLIC BANK BERHAD","XXX",0,1,null,0,"KUMPULAN WANG PERSARAAN","NM","CITIT-KWAP","CITIT","0599399054MYR","Short Term Placement",365,null,"CITIT","KUMPULAN WANG PERSARAAN","5993990005"]
["CSH*220200614","RPF*MYR*PBK","RP","SOCSO",1.7500000000000002E-2,0,16330000,"MYR","2022-02-14","2022-02-14","2022-02-15","RPF","PBK","PUBLIC BANK BERHAD","XXX",0,1,null,0,"PERTUBUHAN KESELAMATAN SOSIAL(SOCSO)","NM","HSBCT-SOCSO","HSK","105272777025MYR","Short Term Placement",365,null,"HSBCT","PERTUBUHAN KESELAMATAN SOCIAL(SOCSO)","318-280351-085"]
["CSH*220200616","RPF*MYR*PBK","RP","SLMAB-LFNP",1.7500000000000002E-2,0,4290000,"MYR","2022-02-14","2022-02-14","2022-02-15","RPF","PBK","PUBLIC BANK BERHAD","XXX",0,1,null,0,"SUN LIFE (LIFE FUND NON PAR-NA)","NM","CIMBBNK-SLMAB-LFNP","CIMBBNK","8007882516MYR","Short Term Placement",365,null,"CIMBBNK","SUN LIFE MALAYSIA ASSURANCE BERHAD (LIFE FUND NON PAR-NA)","SLMAB-LFNP-NA"]
["CSH*220200621","RPF*MYR*CBB","RP","MSIG-EQ",1.7000000000000001E-2,0,14905000,"MYR","2022-02-14","2022-02-14","2022-02-15","RPF","CBB","CIMB BANK BERHAD","XXX",0,1,null,0,"NOMURA FOR MSIG INSURANCE (MALAYSIA)BHD (EQ)","NM","CITIT-MSIG-EQ","CITIT","0599006001MYR","Short Term Placement",365,null,"CITIT","NOMURA FOR MSIG INSURANCE (MALAYSIA)BHD (EQ)","5990060001"]
["CSH*220200623","RPF*MYR*CMI","RP","TNB-RBTFI",1.7000000000000001E-2,0,22812000,"MYR","2022-02-14","2022-02-14","2022-02-15","RPF","CMI","CIMB ISLAMIC BANK","XXX",0,1,null,0,"MTRUSTEE BHD FOR NOMURA TNB RBTF (EQ)","NI","MTRUSTEE-TNB-RBTFI","MTRUSTEE",564016661913,"Short Term Placement",365,null,"MTRUSTEE","MTRUSTEE BHD FOR NOMURA TNB RBTF (EQ)","N14011433137"]
["CSH*220200625","RPF*MYR*CMI","RP","UJSB-EQ2",1.7000000000000001E-2,0,41887000,"MYR","2022-02-14","2022-02-14","2022-02-15","RPF","CMI","CIMB ISLAMIC BANK","XXX",0,1,null,0,"URUSHARTA JAMAAH SDN BHD (NOMURA 2)","NI","CITIT-UJSB-EQ","CITIT","1599474184MYR","Short Term Placement",365,null,"CITIT","URUSHARTA JAMAAH SDN BHD (NOMURA 2)","5994740014"]
["CSH*220200627","RPF*MYR*CMI","RP","EPF-NIAMEQ",1.7000000000000001E-2,0,65220000,"MYR","2022-02-14","2022-02-14","2022-02-15","RPF","CMI","CIMB ISLAMIC BANK","XXX",0,1,null,0,"EMPLOYEES PROVIDENT FUND BOARD (NIAM EQ)","NI","CITIT-EPF-NIAMEQ","CITIT","1599388121MYR","Short Term Placement",365,null,"CITIT","EMPLOYEES PROVIDENT FUND BOARD (NIAM EQ)","5993880036"]
["CSH*220200629","RPF*MYR*CMI","RP","SLMTB-FTFPA",1.7000000000000001E-2,0,9164000,"MYR","2022-02-14","2022-02-14","2022-02-15","RPF","CMI","CIMB ISLAMIC BANK","XXX",0,1,null,0,"SUN LIFE TAKAFUL(FTFPA)","NI","CIMBISLA-SLMTB-FTFPA","CIMBISLA","8602451955MYR","Short Term Placement",365,null,"CIMBISLA","SUN LIFE MALAYSIA TAKAFUL BERHAD (FAMILY TAKAFUL FUND PARTICIPANT ACCOUNT-NA)","SLMTB-FTFPA-NA"]
["CSH*220200631","RPF*MYR*HLI","RP","i-CASH",1.6E-2,0,5264000,"MYR","2022-02-14","2022-02-14","2022-02-16","RPF","HLI","HONG LEONG ISLAMIC BANK","XXX",0,2,null,0,"NOMURA i-CASH FUND","NI","DEUT-i-CASH","DEUBNK","4000519000MYR","Short Term Placement",365,null,"DEUT","NOMURA i-CASH FUND","40005194001"]
["CSH*220200634","RPF*MYR*CMI","RP","i-MONEY",1.7000000000000001E-2,0,5130000,"MYR","2022-02-14","2022-02-14","2022-02-15","RPF","CMI","CIMB ISLAMIC BANK","XXX",0,1,null,0,"NOMURA i-INCOME FUND","NI","DEUT-i-MONEY","DEUBNK","4000527000MYR","Short Term Placement",365,null,"DEUT","NOMURA i-INCOME FUND","40005274001"]
["CSH*220200637","RPF*MYR*CMI","RP","KWAP-NIAM",1.7000000000000001E-2,15262000,15264843.33,"MYR","2022-02-14","2022-02-14","2022-02-15","RPF","CMI","CIMB ISLAMIC BANK","XXX",2,1,null,2843.33,"KWAP (NOMURA ISLAMIC AM)","NI","CITIT-KWAP-NIAM","CITIT","1599399093MYR","Short Term Placement",365,null,"CITIT","KWAP (NOMURA ISLAMIC AM)","5993990020"]
["CSH*220200638","RPF*MYR*CMI","RP","EPF-DMSUKUK",1.7000000000000001E-2,105347761.45999999,105367387.89,"MYR","2022-02-14","2022-02-14","2022-02-15","RPF","CMI","CIMB ISLAMIC BANK","XXX",2,1,null,19626.43,"EMPLOYEES PROVIDENT FUND BOARD (NIAM-FI RR) - IC","NI","CITIT-EPF-DMSUKUK","CITIT","1599388024MYR","Short Term Placement",365,null,"CITIT","EMPLOYEES PROVIDENT FUND BOARD (NIAM-FI RR) - IC","5993880027"]
["CSH*220200642","RPF*MYR*PBK","RP","CGC",1.7500000000000002E-2,14933000,14935863.859999999,"MYR","2022-02-14","2022-02-14","2022-02-15","RPF","PBK","PUBLIC BANK BERHAD","XXX",2,1,null,2863.86,"CREDIT GUARANTEE CORPORATION MALAYSIA BERHAD","NM","MBBT-CGC","MBBT","514012087512MYR","Short Term Placement",365,null,"MBBT","CREDIT GUARANTEE CORPORATION MALAYSIA BERHAD (NOMURA)","N14011412863"]
["CSH*220200643","RPF*MYR*PBK","RP","EPFMSIANFI",1.7500000000000002E-2,127011177.98999999,127035536.3,"MYR","2022-02-14","2022-02-14","2022-02-15","RPF","PBK","PUBLIC BANK BERHAD","XXX",2,1,null,24358.31,"EMPLOYEES PROVIDENT FUND BOARD (NAM-FI RR)","NM","CITIT-EPFMSIANFI","CITIT","0599388281MYR","Short Term Placement",365,null,"CITIT","EMPLOYEES PROVIDENT FUND BOARD (NAM-FI RR)","5993880023"]
["CSH*220200644","RPF*MYR*PBK","RP","NRBF1",1.7500000000000002E-2,19376857.879999999,19380573.989999998,"MYR","2022-02-14","2022-02-14","2022-02-15","RPF","PBK","PUBLIC BANK BERHAD","XXX",2,1,null,3716.11,"NOMURA RINGGIT BOND FUND 1","NM","CIMBCOMTRT-NRBF1","CIMBBNK","8009839299MYR","Short Term Placement",365,null,"CIMBCOMTRT","CCTB-NOMURA RINGGIT BOND FUND1","CCTB-NRBF1"]
["CSH*220200645","RPF*MYR*PBK","RP","NRBF2",1.7500000000000002E-2,7199690.3200000003,7201071.0800000001,"MYR","2022-02-14","2022-02-14","2022-02-15","RPF","PBK","PUBLIC BANK BERHAD","XXX",2,1,null,1380.76,"NOMURA RINGGIT BOND FUND 2","NM","DEUT-NRBF2","DEUBNK","0042176000MYR","Short Term Placement",365,null,"DEUT","DTMB FOR NOMURA RINGGIT BOND FUND 2","000421764001"]
["CSH*220200646","RPF*MYR*PBK","RP","PET-FI",1.7500000000000002E-2,5037483,5038449.09,"MYR","2022-02-14","2022-02-14","2022-02-15","RPF","PBK","PUBLIC BANK BERHAD","XXX",2,1,null,966.09,"PETRONAS EFM (NOMURA-FI) ","NM","CIMBBNK-PET-FI","CIMBBNK","8010205303MYR","Short Term Placement",365,null,"CIMBBNK","PETRONAS EFM (NOMURA ASSET MANAGEMENT MALAYSIA SDN BHD-FI) ","0001NOMURA-FI"]

{"sheet":"Swift","index":4,"n_rows":26,"n_cols":35,"rows_kept":26,"cut":false,"hidden":true,"merged":[[0,25,1,25],[1,0,4,2],[6,0,7,2],[9,1,9,2],[0,14,1,14],[0,15,1,15],[0,16,1,16],[0,22,1,22]]}
[null,null,null,null,null,null,null,null,null,null,null,null,null,null,"Ref. No.","Account Name","Bank","Tenure","Eff Int","Deal","Value","Maturity","Currency","Principal","Interest","Remark",null,null,null,null,null,null,null,{"$f":"VLOOKUP(AE1,CounterParty!$A:$S,19,0)","v":"N/A"},{"$f":"IF(AH1=\"IS\",\"PROFIT AMOUNT:\", \"INTEREST AMOUNT:\")","v":"INTEREST AMOUNT:"}]
["Nomura Swift",null,null,null,null,"Sender",{"$f":"IF(ISBLANK($P$4),\"\",\"NOCMMYKLXXX\")","v":"NOCMMYKLXXX"},null,null,"Sender",{"$f":"IF(AA4<>\"CITIT\",\"\",IF(OR($Z$4=\"New Placement\",$Z$4=\"Top up\"),\"NOCMMYKLXXX\",\"\"))","v":""},null,null,null,null,null,null,"(days)","rate(%)","Date"," Date","Date",null,"Amt","Amt",null,null,null,{"$f":"COLUMN()","v":29},null,null,null,null,{"$f":"COLUMN()","v":34},35]
[null,null,null,null,null,"Recipient",{"$f":"IF(ISBLANK($P$4),\"\",VLOOKUP($AA$4,CounterParty!A:L,12,0))","v":"CITIMYKLXXX"},null,null,"Recipient",{"$f":"IF($AA$4<>\"CITIT\",\"\",IF(OR($Z$4=\"New Placement\",$L$5=\"Top up\"),VLOOKUP($AA$4,CounterParty!A:L,12,0),\"\"))","v":""},null,null,null,"qCshTrnID","qFundCode","CPName","Tenor","Rate","TradeDate","ValueDate","MaturityDate","SettCurrency","FaceValue","Interest Amount","Remarks","Trustee","ClientBankAccName","Safekeeping Acc No","Cash Acc No","qCPCOde","Source Bank ","Source Bank ","Islamic FI  ? ","PROFIT OR INTEREST"]
[null,null,null,null,null,"Type of Message",{"$f":"IF(ISBLANK($P$4),\"\",IF(AA4=\"HSBCT\",\"299\",\"599\"))","v":"599"},null,null,"Type of Message",{"$f":"IF($AA$4<>\"CITIT\",\"\",IF(OR($Z$4=\"New Placement\",$Z$4=\"Top up\"),\"202\",\"\"))","v":""},null,null,null,"CSH*220200610","EPF","PUBLIC BANK BERHAD",1,1.7500000000000002E-2,"2022-02-14","2022-02-14","2022-02-15","MYR",0,0,null,"CITIT","EMPLOYEES PROVIDENT FUND BOARD","5993880008","0599388095MYR","PBK","CITIT","NM",{"$f":"VLOOKUP(AE4,CounterParty!$A:$S,19,0)","v":"N/A"},{"$f":"IF(AH4=\"IS\",\"PROFIT AMOUNT:\", \"INTEREST AMOUNT:\")","v":"INTEREST AMOUNT:"}]
[null,null,null,null,null,"Client Reference Number",{"$f":"IF(ISBLANK($P$4),\"\",TEXT(TODAY(),\"yymmdd\")&LEFT(extractAlpha($P$4),6)&\"-\"&UPPER(LEFT(Z4,3)))","v":"220214EPF-"},null,null,"Client Reference Number",{"$f":"IF($AA$4<>\"CITIT\",\"\",IF(OR($Z$4=\"New Placement\",$Z$4=\"Top up\"),LEFT($P$4,6)&\"-\"&UPPER(LEFT($Z$4,3))&TEXT(TODAY(),\"yymmdd\"),\"\"))","v":""}]
[null,null,null,null,null,"Related Reference Number",{"$f":"IF(ISBLANK($P$4)=\"\",\"\",\"-\")","v":"-"},null,null,"Related Reference Number",{"$f":"IF($AA$4<>\"CITIT\",\"\",IF(OR($Z$4=\"New Placement\",$Z$4=\"Top up\"),MID(O4,5,LEN(O4)-1),\"\"))","v":""}]
["Method 1: By Row",null,null,null,null,"Message Narrative",{"$f":"IF(ISBLANK($P$4),\"\",\"ATTN: CASH TEAM\")","v":"ATTN: CASH TEAM"},null,null,"Amount to Transfer",{"$f":"IF($AA$4<>\"CITIT\",\"\",IF(OR($Z$4=\"New Placement\",$Z$4=\"Top up\"),TEXT(X4,\"00.00\"),\"\"))","v":""}]
[null,null,null,null,null,null,".",null,null,"Currency to Transfer",{"$f":"IF($AA$4<>\"CITIT\",\"\",IF(OR($Z$4=\"New Placement\",$Z$4=\"Top up\"),\"MYR\",\"\"))","v":""}]
[null,null,null,null,null,null,"PLEASE REFER TO BELOW FOR MONEY MARKET PLACEMENT DETAILS",null,null,"Value Date",{"$f":"IF($AA$4<>\"CITIT\",\"\",IF(OR($Z$4=\"New Placement\",$Z$4=\"Top up\"),$U$4,\"\"))","v":""}]
["Total Transaction:","18 record(s) of transaction.",null,null,null,null,".",null,null,"Beneficiary Institution"]
["Row:",1,null,null,null,null,{"$f":"IF(ISBLANK($P$4),\"\",\"PLACEMENT TYPE:\"&\" \"&PROPER($Z$4))","v":"PLACEMENT TYPE: "},null,null,"Beneficiary BIC",{"$f":"IF($AA$4<>\"CITIT\",\"\",IF(OR($Z$4=\"New Placement\",$Z$4=\"Top up\"),VLOOKUP($AE$4,CounterParty!A:L,12,0)))","v":false}]
[null,null,null,null,null,null,{"$f":"IF(ISBLANK($P$4),\"\",\"OUR REF:\"&\" \"&$K$5)","v":"OUR REF: "},null,null,"Beneficiary ID",{"$f":"IF($AA$4<>\"CITIT\",\"\",IF(OR($Z$4=\"New Placement\",$Z$4=\"Top up\"),VLOOKUP($AE$4,CounterParty!A:O,15,0)))","v":false}]
[null,null,null,null,null,null,{"$f":"IF(ISBLANK($P$4),\"\",\"ACCOUNT NAME:\"&Swift!$AB$4)","v":"ACCOUNT NAME:EMPLOYEES PROVIDENT FUND BOARD"},null,null,"Account with Institution"]
[null,null,null,null,null,null,{"$f":"IF(ISBLANK($P$4),\"\",\"SF AC:\"&\" \"&AC4)","v":"SF AC: 5993880008"},null,null,"Account with Institution BIC",{"$f":"K11","v":false}]
[null,null,null,null,null,null,{"$f":"IF(ISBLANK($P$4),\"\",\"CASH AC:\"&\" \"&VLOOKUP($P$4,CashBankAccount!A:B,2,0))","v":"CASH AC: 0599388095"},null,null,"Ordering Institution"]
[null,null,null,null,null,null,{"$f":"IF(ISBLANK($P$4),\"\",\"PLACEMENT BANK:\"&\" \"&Q4)","v":"PLACEMENT BANK: PUBLIC BANK BERHAD"},null,null,"Ordering Institution BIC",{"$f":"IF($AA$4<>\"CITIT\",\"\",IF(OR($Z$4=\"New Placement\",$Z$4=\"Top up\"),\"NOCMMYKLXXX\",\"\"))","v":""}]
[null,null,null,null,null,null,{"$f":"IF(ISBLANK($P$4)=\"\",\"\",\"PLACEMENT DATE:\"&\" \"&TEXT(U4,\"dd-mm-yyyy\"))","v":"PLACEMENT DATE: 14-02-2022"},null,null,"Correspondents"]
[null,null,null,null,null,null,{"$f":"IF(ISBLANK($P$4),\"\",\"MATURITY DATE:\"&\" \"&TEXT(V4,\"dd-mm-yyyy\"))","v":"MATURITY DATE: 15-02-2022"},null,null,"Sender's Correspondent Type",{"$f":"IF($AA$4<>\"CITIT\",\"\",IF(OR($Z$4=\"New Placement\",$Z$4=\"Top up\"),\"Location\",\"\"))","v":""}]
[null,null,null,null,null,null,{"$f":"IF(ISBLANK($P$4),\"\",\"PLACEMENT RATE:\"&\" \"&(S4*100)&\" PERCENT P.A\")","v":"PLACEMENT RATE: 1.75 PERCENT P.A"},null,null,"Sender's Correspondent",{"$f":"IF($AA$4<>\"CITIT\",\"\",\"/\"&IF(OR($Z$4=\"New Placement\",$Z$4=\"Top up\"),VLOOKUP($P$4,CashBankAccount!A:B,2,0),\"\"))","v":"/"}]
[null,null,null,null,null,null,{"$f":"IF(ISBLANK($P$4),\"\",\"PRINCIPAL AMOUNT:\"&\" \"&TEXT(X4,\"0,00.00\"))","v":"PRINCIPAL AMOUNT: 000.00"},null,null,"Sender to Receiver Information"]
[null,null,null,null,null,null,{"$f":"IF(ISBLANK($P$4)=\"\",\"\", AI4&IF(OR(Z4=\"New Placement\",Z4=\"Rollover, P+I\"), TEXT(X4*S4*R4/365,\"0,00.00\"),TEXT(Y4,\"0,00.00\")))","v":"INTEREST AMOUNT:000.00"},null,null,"Special Instructions Type",{"$f":"IF($AA$4<>\"CITIT\",\"\",IF(OR($Z$4=\"New Placement\",$Z$4=\"Top up\"),\"Instructing Party Instructions\",\"\"))","v":""}]
[null,null,null,null,null,null,".",null,null,"Special Instructions",{"$f":"IF($AA$4<>\"CITIT\",\"\",IF(OR($Z$4=\"New Placement\",$Z$4=\"Top up\"),\"DEPOSIT VD\"&TEXT(U4,\" dd-mmm-yyyy\")))","v":false}]
[null,null,null,null,null,null,"UNLESS RENEWED BY US, KINDLY INSTRUCT PLACEMENT"]
[null,null,null,null,null,null,{"$f":"IF(AH4<>\"IS\",\"BANK REMIT THE PRINCIPAL AND INTEREST EARNED TO\", \"BANK REMIT THE PRINCIPAL AND PROFIT EARNED TO\")","v":"BANK REMIT THE PRINCIPAL AND INTEREST EARNED TO"}]
[null,null,null,null,null,null,"THE CLIENT'S CASH ACCOUNT NO. STATED ABOVE"]
[null,null,null,null,null,null,{"$f":"IF(ISBLANK($P$4),\"\",\"MAINTAINED WITH \"&VLOOKUP(AF4,CounterParty!A:B,2,0))","v":"MAINTAINED WITH CITIBANK BERHAD"}]

{"sheet":"CounterParty","index":5,"n_rows":1026,"n_cols":28,"rows_kept":1026,"cut":false,"hidden":true,"merged":[]}
[null,null,3,null,null,6,null,null,null,10,null,null,13,null,null,null,null,18,"Use for Nomura in Islamic tagging"]
["qCPCode","CPName","CPTel","CPFax","CPContactPerson","CPAddress","CPPostCode","StateName","CityName","CPEmail","CPWebsite","BICCode","TradeAccount","SwiftCode","SwiftBankAccNo","CPBankName","BNMAcc","CPBankAdd","qCPGroup",null,null,null,null,null,null,null,null,"Product Type"]
[0,"NOMURA SECURITIES","03-2166 2636","03-2166 2636","Riskk","Riskk",50050,"WILAYAH PERSEKUTUAN","Kuala Lumpur","NIL","NIL","N/A","N/A","N/A","N/A",null,null,null,"N/A"]
[7,"NOMURA SECURITIES","03-2166 2636","03-2166 2636","Riskk","Riskk",50050,"WILAYAH PERSEKUTUAN","Kuala Lumpur","NIL","NIL","N/A","N/A","N/A","N/A",null,null,null,"N/A"]
["0BI","NOMURA INTERNATIONAL PLC","03-2166 2636","03-2166 2636","Riskk","Riskk",50050,"WILAYAH PERSEKUTUAN","Kuala Lumpur","NIL","NIL","N/A","N/A","N/A","N/A",null,null,null,"N/A"]
["0LX","NOMURA BANK LUXEMBOURG","03-2166 2636","03-2166 2636","Riskk","Riskk",50050,"WILAYAH PERSEKUTUAN","Kuala Lumpur","NIL","NIL","N/A","N/A","N/A","N/A",null,null,null,"N/A"]
["0TB","NOMURA TRUST & BANKING","03-2166 2636","03-2166 2636","Riskk","Riskk",50050,"WILAYAH PERSEKUTUAN","Kuala Lumpur","NIL","NIL","N/A","N/A","N/A","N/A",null,null,null,"N/A"]
["AAA","AAA",20748953,"3-20709387","Ms.Amalina / Mr. Abdullah Tahir","8th,Menara Maybank, 100 Jln Tun Perak,",50050,"WILAYAH PERSEKUTUAN","Kuala Lumpur","abdullah.tahir@maybank.com.my","NIL","N/A","N/A","N/A","N/A",null,null,null,"N/A"]
["AAB","ABN AMRO BANK","03-2166 2636","03-2166 2636","Riskk","Riskk",50050,"WILAYAH PERSEKUTUAN","Kuala Lumpur","NIL","NIL","N/A","N/A","N/A","N/A",null,null,null,"N/A"]
["AAM","AAM","03-2166 2636","03-2166 2636","Riskk","Riskk",50050,"WILAYAH PERSEKUTUAN","Kuala Lumpur","NIL","NIL","N/A","N/A","N/A","N/A",null,null,null,"N/A"]
["AB","A.B. ASESORES BURSATILES","03-2166 2636","03-2166 2636","Riskk","Riskk",50050,"WILAYAH PERSEKUTUAN","Kuala Lumpur","NIL","NIL","N/A","N/A","N/A","N/A",null,null,null,"N/A"]
["ABA","ABN AMRO CLEARING BK NV","03-2166 2636","03-2166 2636","Riskk","Riskk",50050,"WILAYAH PERSEKUTUAN","Kuala Lumpur","NIL","NIL","N/A","N/A","N/A","N/A",null,null,null,"N/A"]
["ABC","AGRICULTURAL BANK OF CHINA","03-2166 2636","03-2166 2636","Riskk","Riskk",50050,"WILAYAH PERSEKUTUAN","Kuala Lumpur","NIL","NIL","N/A","N/A","N/A","N/A",null,null,null,"N/A"]
["ABE","ABEL NOSER","03-2166 2636","03-2166 2636","Riskk","Riskk",50050,"WILAYAH PERSEKUTUAN","Kuala Lumpur","NIL","NIL","N/A","N/A","N/A","N/A",null,null,null,"N/A"]
["ABG","ABG SECURITIES","03-2166 2636","03-2166 2636","Riskk","Riskk",50050,"WILAYAH PERSEKUTUAN","Kuala Lumpur","NIL","NIL","N/A","N/A","N/A","N/A",null,null,null,"N/A"]
["ABK","AMBANK","03-2166 2636","03-2166 2636","Riskk","Riskk",50050,"WILAYAH PERSEKUTUAN","Kuala Lumpur","NIL","NIL","N/A","N/A","N/A","N/A","AMBANK (M) BERHAD",null,null,"N/A"]
["ABL","ABSA BANK LIMITED","03-2166 2636","03-2166 2636","Riskk","Riskk",50050,"WILAYAH PERSEKUTUAN","Kuala Lumpur","NIL","NIL","N/A","N/A","N/A","N/A",null,null,null,"N/A"]
["ABN","ABN AMRO","03-2166 2636","03-2166 2636","Riskk","Riskk",50050,"WILAYAH PERSEKUTUAN","Kuala Lumpur","NIL","NIL","N/A","N/A","N/A","N/A",null,null,null,"N/A"]
["ABS","ABRAHAM & SONS","03-2166 2636","03-2166 2636","Riskk","Riskk",50050,"WILAYAH PERSEKUTUAN","Kuala Lumpur","NIL","NIL","N/A","N/A","N/A","N/A",null,null,null,"N/A"]
["ACA","ACADEMY SECURITIES, INC.","03-2166 2636","03-2166 2636","Riskk","Riskk",50050,"WILAYAH PERSEKUTUAN","Kuala Lumpur","NIL","NIL","N/A","N/A","N/A","N/A",null,null,null,"N/A"]
["ACB","ALLIANCE BANK","03-2166 2636","03-2166 2636","Riskk","Riskk",50050,"WILAYAH PERSEKUTUAN","Kuala Lumpur","NIL","NIL","N/A","N/A","N/A","N/A",null,null,null,"N/A"]
["ACE","ACE SEC","03-2166 2636","03-2166 2636","Riskk","Riskk",50050,"WILAYAH PERSEKUTUAN","Kuala Lumpur","NIL","NIL","N/A","N/A","N/A","N/A",null,null,null,"N/A"]
["ACG","A.C. GOODE","03-2166 2636","03-2166 2636","Riskk","Riskk",50050,"WILAYAH PERSEKUTUAN","Kuala Lumpur","NIL","NIL","N/A","N/A","N/A","N/A",null,null,null,"N/A"]
["ACL","AXIS CAPITAL LIMITED","03-2166 2636","03-2166 2636","Riskk","Riskk",50050,"WILAYAH PERSEKUTUAN","Kuala Lumpur","NIL","NIL","N/A","N/A","N/A","N/A",null,null,null,"N/A"]
["ADC","ANDREW DAVIDSON & CO.,INC.","03-2166 2636","03-2166 2636","Riskk","Riskk",50050,"WILAYAH PERSEKUTUAN","Kuala Lumpur","NIL","NIL","N/A","N/A","N/A","N/A",null,null,null,"N/A"]
["ADV","ADVEST DEVELOPMENT & FINANC","03-2166 2636","03-2166 2636","Riskk","Riskk",50050,"WILAYAH PERSEKUTUAN","Kuala Lumpur","NIL","NIL","N/A","N/A","N/A","N/A",null,null,null,"N/A"]
["AEL","ASIA EQUITY LIMITED. HONG","03-2166 2636","03-2166 2636","Riskk","Riskk",50050,"WILAYAH PERSEKUTUAN","Kuala Lumpur","NIL","NIL","N/A","N/A","N/A","N/A",null,null,null,"N/A"]
["AFC","ALBERT FRIED AND COMPANY","03-2166 2636","03-2166 2636","Riskk","Riskk",50050,"WILAYAH PERSEKUTUAN","Kuala Lumpur","NIL","NIL","N/A","N/A","N/A","N/A",null,null,null,"N/A"]
["AFF","AFFIN SECS SDN BHD","03-2166 2636","03-2166 2636","Riskk","Riskk",50050,"WILAYAH PERSEKUTUAN","Kuala Lumpur","NIL","NIL","N/A","N/A","N/A","N/A",null,null,null,"N/A"]
["AFI","AFIN SECURITIES INTL","03-2166 2636","03-2166 2636","Riskk","Riskk",50050,"WILAYAH PERSEKUTUAN","Kuala Lumpur","NIL","NIL","N/A","N/A","N/A","N/A",null,null,null,"N/A"]
["AGE","A.G.,EDWARD & SONS,INC","03-2166 2636","03-2166 2636","Riskk","Riskk",50050,"WILAYAH PERSEKUTUAN","Kuala Lumpur","NIL","NIL","N/A","N/A","N/A","N/A",null,null,null,"N/A"]
["AGF","AMERICAN GENERAL FINANCE","03-2166 2636","03-2166 2636","Riskk","Riskk",50050,"WILAYAH PERSEKUTUAN","Kuala Lumpur","NIL","NIL","N/A","N/A","N/A","N/A",null,null,null,"N/A"]
["AGL","AVIATE GLOBAL LLP","03-2166 2636","03-2166 2636","Riskk","Riskk",50050,"WILAYAH PERSEKUTUAN","Kuala Lumpur","NIL","NIL","N/A","N/A","N/A","N/A",null,null,null,"N/A"]
["AGO","AGORA COR DE TITUL E VAL MO","03-2166 2636","03-2166 2636","Riskk","Riskk",50050,"WILAYAH PERSEKUTUAN","Kuala Lumpur","NIL","NIL","N/A","N/A","N/A","N/A",null,null,null,"N/A"]
["AHG","ABN AMRO HOARE GOVET","03-2166 2636","03-2166 2636","Riskk","Riskk",50050,"WILAYAH PERSEKUTUAN","Kuala Lumpur","NIL","NIL","N/A","N/A","N/A","N/A",null,null,null,"N/A"]
["AHI","AFFIN HWANG INVESTMENT BANK","03-2166 2636","ibops@affinhwang.com","Investment Banking Operations","Riskk",50050,"WILAYAH PERSEKUTUAN","Kuala Lumpur","ibops@affinhwang.com","NIL","N/A","N/A","N/A","N/A",null,"N/A",null,"N/A"]
["AIG","BANQUE AIG","03-2166 2636","03-2166 2636","Riskk","Riskk",50050,"WILAYAH PERSEKUTUAN","Kuala Lumpur","NIL","NIL","N/A","N/A","N/A","N/A",null,null,null,"N/A"]
["AIS","AMBANK ISLAMIC BERHAD","03-2166 2636","03-2166 2636","Riskk","Riskk",50050,"WILAYAH PERSEKUTUAN","Kuala Lumpur","NIL","NIL","N/A","N/A","N/A","N/A","AMISLAMIC","XXX",null,"IS"]
["AIZ","AIZAWA SEC.","03-2166 2636","03-2166 2636","Riskk","Riskk",50050,"WILAYAH PERSEKUTUAN","Kuala Lumpur","NIL","NIL","N/A","N/A","N/A","N/A",null,null,null,"N/A"]
["AKN","ORIX SECURITIES CO.,LTD.","03-2166 2636","03-2166 2636","Riskk","Riskk",50050,"WILAYAH PERSEKUTUAN","Kuala Lumpur","NIL","NIL","N/A","N/A","N/A","N/A",null,null,null,"N/A"]
{"$rows_left_out":986}