{"text_format":"1","workbook":"xlsx","n_sheets":19,"sheets":["Riskk","Login","InPL","Main","FI_TMIM","NoFI_TMIM","FI_BNM","NoFI_LBNM","NoFI_NLBNM","NoFI_NLBNM_X","MainMarket","Asset","InvestRisk","newInvestRisk","Limit","InInvRisk","InTrn","InLstMstHst","InMstHst"],"not_rendered":{"charts":0,"images":0,"macros":1,"external_links":1,"defined_names":79,"comments":0,"pivot_tables":7},"unopened":[],"bounds":{"document_bytes":16777216,"sheet_cells":100000,"rows_first":2000,"rows_last":500,"rows_between":2000,"halvings":0,"cell_chars":16384,"cell_head_chars":4096},"cells_cut":0,"cells_raw":0,"read":"whole","date_system":"1900"}

{"sheet":"Riskk","index":0,"n_rows":6,"n_cols":11,"rows_kept":6,"cut":false,"hidden":true,"merged":[]}
["LSL","UPSW",null,null,null,null,null,{"$f":"COUNT(H3:H26)","v":0},false]
["LSL","Userid",null,null,null,null,null,"Main/sub","Caption","On Action","NewGroup"]
[3,"UserLevel"]
["2010-09-09T15:20:33","LoginTime"]
[null,"LogoutTime"]
["MYR","Global Ccy"]

{"sheet":"Login","index":1,"n_rows":24,"n_cols":11,"rows_kept":24,"cut":false,"hidden":false,"merged":[[23,10,23,12],[9,2,9,11]]}
[]
[]
[]
[]
[]
[]
[]
[]
{"$rows_left_out":17}
{"sheet":"InPL","index":2,"n_rows":169,"n_cols":5,"rows_kept":169,"cut":false,"hidden":true,"merged":[]}
["sType","qFundCode","ShortGL","qAssetAccType","Amount"]
["Mth","HFT",200100,0,-0.02]
["Mth","HFT",500000,0,1264920.49]
["Mth","HFT",710102,0,129]
["Mth","HFT",800000,0,-377438368.63999999]
["Mth","HFT",830000,0,-43729749.140000001]
["Mth","HFT",100000,210,83000000]
["Mth","HFT",139000,210,15698.64]
{"$rows_left_out":162}
{"sheet":"Main","index":3,"n_rows":28,"n_cols":22,"rows_kept":28,"cut":false,"hidden":true,"merged":[[2,0,2,10]]}
[]
[]
["Compliance Report"]
[]
[]
[]
[null,"Report Date","2022-02-28",null,null,null,null,null,"Sheet","Export"]
[null,"Total Book Value",2639532366.4099998,null,null,null,null,null,"FI_TMIM","YES"]
{"$rows_left_out":21}
{"sheet":"FI_TMIM","index":4,"n_rows":78,"n_cols":24,"rows_kept":78,"cut":false,"hidden":true,"merged":[]}
["TOKIO MARINE INSURANS (MALAYSIA) BERHAD.     (Company No. 149520-U)",null,null,null,null,null,null,null,null,null,null,null,null,null,null,null,null,"Total Asset",{"$f":"TotalMV","v":2639532366.4099998}]
[]
["EXPOSURE TO FINANCIAL INSTITUTIONS (DEPOSITS & BONDS)-PER TMIM INVESTMENT GUIDELINES",null,null,null,null,null,null,null,null,null,null,null,null,null,null,null,null,"Attribute","(Multiple Items)"]
[null,null,null,null,null,null,null,null,"To Be Key In","To Be Key In",null,null,null,null,null,null,null,"qAssetClass","(Multiple Items)"]
[" ",null,null,null,null,null,null,null,null,null,null,null,null,null,null,null,null,"CashMaturity","(Multiple Items)"]
["Name of Institution","CPCode","Rating","QFI/AMB","TMIM","TMIM","Deposit","Money Market","Fund Manager's","Current","Total","Total","Indicator"]
[null,null,null,null,"Limit %","Limit",null,"Instruments (MMI)","Deposit","Account",null,null,"Within Limit",null,null,null,null,null,"Data"]
[null,null,null,null,null,null,null,null,null,null,null,null,null,null,null,null,null,"Issuer","Sum of Deposits","Sum of MoneyMarket","Sum of Bond","Sum of UTBond","Sum of UTDeposit","Sum of MarketValueFC"]
{"$rows_left_out":71}
{"sheet":"NoFI_TMIM","index":5,"n_rows":74,"n_cols":23,"rows_kept":74,"cut":false,"hidden":true,"merged":[]}
["TOKIO MARINE INSURANS (MALAYSIA) BERHAD.     (Company No. 149520-U)",null,null,null,null,null,null,null,null,null,null,null,"Total Asset",{"$f":"TotalMV","v":2639532366.4099998}]
[]
["EXPOSURE TO NON FINANCIAL INSTITUTIONS (BONDS)-PER TMIM INVESTMENT GUIDELINES",null,null,null,null,null,null,null,null,null,null,null,"Attribute","(Multiple Items)"]
[null,null,null,null,null,null,null,null,null,null,null,null,"qAssetClass","(Multiple Items)"]
[" ",null,null,"Total Holding","Actual Exposure","Actual Exposure","Concentration","Indicator",null,null,null,null,"Rating","(Multiple Items)",null,null,null,null,null,"Asset Class","Actual","Asset Class"]
["Name of Institution","Bonds","Unit Trust","as at","on Total Assets","on Total Assets","Limit","Within Limit",null,null,null,null,null,null,null,null,null,null,null,null,"Exposure","Limit"]
[null,"(RM)","(RM)",{"$f":"TEXT(ReportDate,\"dd.mm.yyyy\")","v":"28.02.2022"},"Without Unit Trust","With Unit Trust",null,null,null,null,null,null,null,"Data",null,null,null,null,null,"Money Market Instruments",{"$f":"SUM(SUMIFS(InMstHst!J:J,InMstHst!AK:AK,\"FI\",InMstHst!AG:AG,\"CSH\",InMstHst!G:G,\"R*\",InMstHst!AS:AS,0))/TotalAsset","v":0},0.1]
[null,null,null,null,null,null,null,null,null,null,null,null,"Issuer","Sum of Bond","Sum of UnitTrust","Sum of MarketValueFC"]
{"$rows_left_out":67}
{"sheet":"FI_BNM","index":6,"n_rows":20,"n_cols":23,"rows_kept":20,"cut":false,"hidden":true,"merged":[]}
["TOKIO MARINE INSURANS (MALAYSIA) BERHAD.     (Company No. 149520-U)",null,null,null,null,null,null,null,null,null,null,null,null,null,null,"Total Asset",{"$f":"TotalMV","v":2639532366.4099998}]
[]
["EXPOSURE TO FINANCIAL INSTITUTIONS (DEPOSITS, BONDS & EQUITIES)-PER BNM GUIDELINES",null,null,null,null,null,null,null,null,null,null,null,null,null,null,"Attribute","(Multiple Items)"]
[null,null,null,null,null,null,null,null,null,null,null,null,null,null,null,"qAssetClass","(Multiple Items)"]
[" "," ","Money Market",null,null,"Unit Trust","Unit Trust","Total Holding","Actual Exposure","Actual Exposure","Regulatory","Indicator",null,null,null,"CashMaturity","(Multiple Items)"]
["Name of Institution","Deposits","Instruments (MMI)","Bonds","Equities","Bonds","Deposits","as at","on Total Assets","on Total Assets","Limit","Within Limit"]
[null,"(RM)","(RM)","(RM)","(RM)","(RM)","(RM)",{"$f":"TEXT(ReportDate,\"dd.mm.yyyy\")","v":"28.02.2022"},"Without Unit Trust","With Unit Trust",null,null,null,null,null,null,"Data"]
[null,null,null,null,null,null,null,null,null,null,null,null,null,null,null,"Issuer","Sum of Deposits","Sum of MoneyMarket","Sum of Bond","Sum of Equity","Sum of BNMUnitTrust","Sum of UTDeposit","Sum of MarketValueFC"]
{"$rows_left_out":13}
{"sheet":"NoFI_LBNM","index":7,"n_rows":23,"n_cols":17,"rows_kept":23,"cut":false,"hidden":true,"merged":[]}
["TOKIO MARINE INSURANS (MALAYSIA) BERHAD.     (Company No. 149520-U)",null,null,null,null,null,null,null,null,null,"TotalAsset",{"$f":"TotalMV","v":2639532366.4099998}]
[]
["EXPOSURE TO NON FINANCIAL INSTITUTIONS LISTED ON BURSA -PER BNM GUIDELINES",null,null,null,null,null,null,null,null,null,null,null,"Attribute","(Multiple Items)"]
[null,null,null,null,null,null,null,null,null,null,null,null,"ListedFlag","(Multiple Items)"]
[" ",null,null,null,"Total Holding","Actual Exposure","Actual Exposure","Regulatory","Indicator",null,null,null,"qAssetClass","(Multiple Items)"]
["Name of Institution","Bonds","Equities","Unit Trust","as at","on Total Assets","on Total Assets","Limit","Within Limit"]
[null,"(RM)","(RM)","(RM)",{"$f":"TEXT(ReportDate,\"dd.mm.yyyy\")","v":"28.02.2022"},"Without Unit Trust","With Unit Trust",null,null,null,null,null,null,"Data"]
[null,null,null,null,null,null,null,null,null,null,null,null,"Issuer","Sum of Bond","Sum of Equity","Sum of UnitTrust","Sum of MarketValueFC"]
{"$rows_left_out":16}
{"sheet":"NoFI_NLBNM","index":8,"n_rows":61,"n_cols":17,"rows_kept":61,"cut":false,"hidden":true,"merged":[]}
["TOKIO MARINE INSURANS (MALAYSIA) BERHAD.     (Company No. 149520-U)",null,null,null,null,null,null,null,null,null,"TotalAsset",{"$f":"TotalMV","v":2639532366.4099998}]
[null,null,null,null,null,null,null,null,null,null,null,null,"Attribute","(Multiple Items)"]
["EXPOSURE TO OTHER COUNTERPARTIES (NON FINANCIAL INSTITUTIONS NOT LISTED ON BURSA) -PER BNM GUIDELINES",null,null,null,null,null,null,null,null,null,null,null,"ListedFlag","(Multiple Items)"]
[null,null,null,null,null,null,null,null,null,null,null,null,"qAssetClass","(Multiple Items)"]
[" ",null,null,null,"Total Holding","Actual Exposure","Actual Exposure","Regulatory","Indicator",null,null,null,"Rating","(Multiple Items)"]
["Name of Institution","Bonds","Equities","Unit Trust","as at","on Total Assets","on Total Assets","Limit","Within Limit"]
[null,"(RM)","(RM)","(RM)",{"$f":"TEXT(ReportDate,\"dd.mm.yyyy\")","v":"28.02.2022"},"Without Unit Trust","With Unit Trust",null,null,null,null,null,null,"Data"]
[null,null,null,null,null,null,null,null,null,null,null,null,"Issuer","Sum of Bond","Sum of Equity","Sum of UnitTrust","Sum of MarketValueFC"]
{"$rows_left_out":54}
{"sheet":"NoFI_NLBNM_X","index":9,"n_rows":19,"n_cols":17,"rows_kept":19,"cut":false,"hidden":true,"merged":[]}
["TOKIO MARINE INSURANS (MALAYSIA) BERHAD.     (Company No. 149520-U)",null,null,null,null,null,null,null,null,null,"TotalAsset",{"$f":"TotalMV","v":2639532366.4099998}]
[null,null,null,null,null,null,null,null,null,null,null,null,"Attribute","(Multiple Items)"]
["EXPOSURE TO NON FINANCIAL INSTITUTIONS NOT LISTED ON BURSA -PER BNM GUIDELINES (X-RATE)",null,null,null,null,null,null,null,null,null,null,null,"ListedFlag","(Multiple Items)"]
[null,null,null,null,null,null,null,null,null,null,null,null,"qAssetClass","(Multiple Items)"]
[" ",null,null,null,"Total Holding","Actual Exposure","Actual Exposure","Regulatory","Indicator",null,null,null,"Rating","(Multiple Items)"]
["Name of Institution","Bonds","Equities","Unit Trust","as at","on Total Assets","on Total Assets","Limit","Within Limit"]
[null,"(RM)","(RM)","(RM)",{"$f":"TEXT(ReportDate,\"dd.mm.yyyy\")","v":"28.02.2022"},"Without Unit Trust","With Unit Trust",null,null,null,null,null,null,"Data"]
[null,null,null,null,null,null,null,null,null,null,null,null,"Issuer","Sum of Bond","Sum of Equity","Sum of UnitTrust","Sum of MarketValueFC"]
{"$rows_left_out":12}
{"sheet":"MainMarket","index":10,"n_rows":11,"n_cols":14,"rows_kept":11,"cut":false,"hidden":true,"merged":[]}
["TOKIO MARINE INSURANS (MALAYSIA) BERHAD.     (Company No. 149520-U)",null,null,null,null,null,null,null,null,"Total Asset",{"$f":"TotalAsset","v":2639532366.4099998}]
[null,null,null,null,null,null,null,null,null,"qAssetClass","(Multiple Items)"]
[{"$f":"\"EXPOSURE TO COUNTERPARTIES LISTED ON MAIN MARKET, BURSA AS AT \" & TEXT(ReportDate,\"dd.mm.yyyy\")","v":"EXPOSURE TO COUNTERPARTIES LISTED ON MAIN MARKET, BURSA AS AT 28.02.2022"},null,null,null,null,null,null,null,null,"BOARD","(Multiple Items)"]
[]
[" ",null,null,null,null,null,null,null,null,null,null,"Data"]
["DESCRIPTION","EQUITIES","BONDS","TOTAL","Actual Exposure","Regulatory",null,null,null,"SectorName","Issuer","Sum of Equity","Sum of Bond","Sum of MarketValueFC"]
[null,"NBV","NBV","HOLDINGS","on Total Assets","Limit",null,null,null,"Grand Total"]
[null,"(RM)","(RM)","(RM)"]
{"$rows_left_out":4}
{"sheet":"Asset","index":11,"n_rows":48,"n_cols":7,"rows_kept":48,"cut":false,"hidden":true,"merged":[]}
[]
["INVESTMENT ASSET ALLOCATION"]
[]
[{"$f":"\"As at \" & TEXT(ReportDate,\"dd.mm.yyyy\")","v":"As at 28.02.2022"}]
[]
[" ","Target Asset","% ","At","% ","At","Unrealised G/L"]
["Investment Type","Allocation","of Total Inv","NBV (RM)","of Total Inv","Market Value (RM)","(Market Value - Total cost)"]
[]
{"$rows_left_out":41}
{"sheet":"InvestRisk","index":12,"n_rows":76,"n_cols":5,"rows_kept":76,"cut":false,"hidden":true,"merged":[]}
[{"$f":"\"D.  INVESTMENT RISK @ \" & TEXT(ReportDate,\"dd MMM yyyy\")","v":"D.  INVESTMENT RISK @ 28 Feb 2022"},null,null,{"$f":"TotalMV","v":2639532366.4099998},2251301501.54]
[]
["Table 9:  Investment Strategic Asset Allocation"]
[null,"Target","Min","Max",{"$f":"\"Actual @ \" & TEXT(ReportDate,\"dd.mm.yyyy\")","v":"Actual @ 28.02.2022"}]
[]
["Deposits",0.3,0.25,0.35,{"$f":"Asset!C11","v":0.21484827060812528}]
["MGS",0.33,0.28000000000000003,0.38,{"$f":"Asset!C17","v":0.34180528425284329}]
["Corporate Bonds",0.3,0.25,0.35,{"$f":"Asset!C22","v":0.44334644513903154}]
{"$rows_left_out":69}
{"sheet":"newInvestRisk","index":13,"n_rows":67,"n_cols":11,"rows_kept":67,"cut":false,"hidden":true,"merged":[[14,1,14,2]]}
[null,{"$f":"\"D.  INVESTMENT RISK @ \" & TEXT(ReportDate,\"dd MMM yyyy\")","v":"D.  INVESTMENT RISK @ 28 Feb 2022"},null,null,null,{"$f":"TotalMV","v":2639532366.4099998}]
[]
[null,"Investment Strategic Asset Allocation"]
[null,null,"Target","Min","Max",{"$f":"\"Actual @ \" & TEXT(ReportDate,\"dd/MM/yyyy\")","v":"Actual @ 28/02/2022"}]
[]
[null,"Deposits",0.15,{"$f":"C6-5%","v":9.9999999999999992E-2},{"$f":"C6+10%","v":0.25},{"$f":"Asset!C11","v":0.21484827060812528}]
[null,"MGS",0.35,{"$f":"C7-10%","v":0.24999999999999997},{"$f":"C7+5%","v":0.39999999999999997},{"$f":"Asset!C17","v":0.34180528425284329}]
[null,"Corporate Bonds",0.5,{"$f":"C8-10%","v":0.4},{"$f":"C8+5%","v":0.55000000000000004},{"$f":"Asset!C22","v":0.44334644513903154}]
{"$rows_left_out":60}
{"sheet":"Limit","index":14,"n_rows":80,"n_cols":3,"rows_kept":80,"cut":false,"hidden":true,"merged":[]}
["Institution","Limit","Main Market"]
["Besraya (M) Sdn Berhad",20]
["Bangkok Bank",20]
["Bank of Tokyo-Mitsubishi UFJ (M) Bhd",20]
["CIMB",20]
["Hong Leong Bank Berhad",20]
["HWANG Investment Bank",20]
["Industrial And Commercial Bank Of China (M) Bhd",20]
{"$rows_left_out":73}
{"sheet":"InInvRisk","index":15,"n_rows":191,"n_cols":21,"rows_kept":191,"cut":false,"hidden":true,"merged":[]}
["UTFlag","PreAcqSC","BookValue","qFundCode","MarketValueFC","AccruedInterest","qProductType","qAssetClass","qAssetAccType","interval","qIntSector","qBondType","Exchange","RatingUsed","Inactive","rating","StockCurrency","Attribute","maturitydate","CashMaturity","qstockcode"]
[0,0,30000000,"HFT",30000000,260876.71,"CSH","CSH",220,8.3333000000000004E-2,0,null,null,null,null,1,"MYR","FI","2022-03-14",0,"FDC*MYR*BKK"]
[0,0,12000000,"HFT",12000000,82109.59,"CSH","CSH",220,8.3333000000000004E-2,0,null,null,null,null,1,"MYR","FI","2022-03-10",0,"FDC*MYR*BKK"]
[0,0,20000000,"HFT",20000000,40273.97,"CSH","CSH",220,8.3333000000000004E-2,0,null,null,null,null,1,"MYR","FI","2022-03-25",0,"FDC*MYR*BKK"]
[0,0,15000000,"HFT",15000000,152794.51999999999,"CSH","CSH",220,0.33333299999999999,0,null,null,null,null,1,"MYR","FI","2022-06-13",0,"FDC*MYR*MBMB"]
[0,0,15000000,"HFT",15000000,396123.29,"CSH","CSH",220,8.3333000000000004E-2,0,null,null,null,null,1,"MYR","FI","2022-03-09",0,"FDC*MYR*PBB"]
[0,0,10000000,"HFT",10000000,242630.14,"CSH","CSH",220,0.16666600000000001,0,null,null,null,null,1,"MYR","FI","2022-04-07",0,"FDC*MYR*PBB"]
[0,0,10000000,"HFT",10000000,218219.18,"CSH","CSH",220,0.25,0,null,null,null,null,1,"MYR","FI","2022-05-10",0,"FDC*MYR*PBB"]
{"$rows_left_out":184}
{"sheet":"InTrn","index":16,"n_rows":179,"n_cols":8,"rows_kept":179,"cut":false,"hidden":true,"merged":[]}
["stype","qFundCode","qStockCode","qAssetClass","qProductType","qTrnCode","TranIncome","FCNetProceed"]
["YTD","TMUT","AIEF","CIS","EQT","SI",0,19200.75]
["YTD","TMUT","AIEF","CIS","EQT","SI",0,23040.91]
["YTD","HFT","CAP*MYR","CAP","CSH","CN",0,-10000000]
["YTD","TMUT","CAP*MYR","CAP","CSH","CN",0,-2195301.6]
["YTD","HFT","CAP*MYR","CAP","CSH","CR",0,2195301.6]
["YTD","TMUT","CAP*MYR","CAP","CSH","CN",0,-2066315.95]
["YTD","HFT","CAP*MYR","CAP","CSH","CR",0,2066315.95]
{"$rows_left_out":172}
{"sheet":"InLstMstHst","index":17,"n_rows":162,"n_cols":46,"rows_kept":162,"cut":false,"hidden":true,"merged":[]}
["MarketValueDate","qMasterID","qProductType","PurchaseDate","MaturityDate","qFundCode","qStockCode","UnitFaceValue","CostFC","MarketValueFC","MarketValueSC","LastMarketValue","UnrealisedGainsStock","PriceCurr","PurchaseYTM","ValueYTM","AccruedInterest","AmortAccreation","PreAcqSC","StockCurrency","SectorName","InternalSectorName","Issuer","ProductTypeDesc","FundCurrency","CountryName","IssuerGrpName","Deposits","MoneyMarket","Bond","UTDeposit","UTBond","qAssetClass","Equity","ListedFlag","UnitTrust","Attribute","BOARD","QUOTED","qAssetAccType","BNMUnitTrust","CashMaturity","Rating","tenor","qCPCode","isincode"]
["2021-12-31","CSH*211000039","CSH","2021-10-14","2022-03-14","HFT","FDC*MYR*BKK",30000000,30000000,30000000,30149342.469999999,0,0,0,2.3E-2,0,149342.47,0,0,"MYR","CASH","CASH","Bangkok Bank","Money Market","MYR","CASH","N/A",30000000,null,null,null,null,"CSH",null,0,null,"FI",null,"QUOTED SHARES",220,null,0,null,151,"BKK","N/A"]
["2021-12-31","CSH*211000052","CSH","2021-10-20","2022-01-20","HFT","FDC*MYR*BKK",35000000,35000000,35000000,35143500,0,0,0,2.0500000000000001E-2,0,143500,0,0,"MYR","CASH","CASH","Bangkok Bank","Money Market","MYR","CASH","N/A",35000000,null,null,null,null,"CSH",null,0,null,"FI",null,"QUOTED SHARES",220,null,1,null,92,"BKK","N/A"]
["2021-12-31","CSH*211100031","CSH","2021-11-10","2022-03-10","HFT","FDC*MYR*BKK",12000000,12000000,12000000,12038465.75,0,0,0,2.2499999999999999E-2,0,38465.75,0,0,"MYR","CASH","CASH","Bangkok Bank","Money Market","MYR","CASH","N/A",12000000,null,null,null,null,"CSH",null,0,null,"FI",null,"QUOTED SHARES",220,null,0,null,120,"BKK","N/A"]
["2021-12-31","CSH*210200057","CSH","2021-02-24","2022-02-24","HFT","FDC*MYR*MBMB",15000000,15000000,15000000,15288846.58,0,0,0,2.2599999999999999E-2,0,288846.58,0,0,"MYR","CASH","CASH","Mizuho Bank (Malaysia) Bhd","Money Market","MYR","CASH","N/A",15000000,null,null,null,null,"CSH",null,0,null,"FI",null,"QUOTED SHARES",220,null,1,null,365,"MBMB","N/A"]
["2021-12-31","CSH*210900036","CSH","2021-09-13","2022-06-13","HFT","FDC*MYR*MBMB",15000000,15000000,15000000,15099452.050000001,0,0,0,2.1999999999999999E-2,0,99452.05,0,0,"MYR","CASH","CASH","Mizuho Bank (Malaysia) Bhd","Money Market","MYR","CASH","N/A",15000000,null,null,null,null,"CSH",null,0,null,"FI",null,"QUOTED SHARES",220,null,0,null,273,"MBMB","N/A"]
["2021-12-31","CSH*210100030","CSH","2021-01-21","2022-01-21","HFT","FDC*MYR*PBB",13000000,13000000,13000000,13331767.119999999,0,0,0,2.7E-2,0,331767.12,0,0,"MYR","CASH","CASH","Public Bank Berhad","Money Market","MYR","CASH","N/A",13000000,null,null,null,null,"CSH",null,0,null,"FI",null,"QUOTED SHARES",220,null,1,null,365,"PBB","N/A"]
["2021-12-31","CSH*210200040","CSH","2021-02-17","2022-02-17","HFT","FDC*MYR*PBB",10000000,10000000,10000000,10235232.880000001,0,0,0,2.7E-2,0,235232.88,0,0,"MYR","CASH","CASH","Public Bank Berhad","Money Market","MYR","CASH","N/A",10000000,null,null,null,null,"CSH",null,0,null,"FI",null,"QUOTED SHARES",220,null,1,null,365,"PBB","N/A"]
{"$rows_left_out":155}
{"sheet":"InMstHst","index":18,"n_rows":191,"n_cols":46,"rows_kept":191,"cut":false,"hidden":true,"merged":[]}
["MarketValueDate","qMasterID","qProductType","PurchaseDate","MaturityDate","qFundCode","qStockCode","UnitFaceValue","CostFC","MarketValueFC","MarketValueSC","LastMarketValue","UnrealisedGainsStock","PriceCurr","PurchaseYTM","ValueYTM","AccruedInterest","AmortAccreation","PreAcqSC","StockCurrency","SectorName","InternalSectorName","Issuer","ProductTypeDesc","FundCurrency","CountryName","IssuerGrpName","Deposits","MoneyMarket","Bond","UTDeposit","UTBond","qAssetClass","Equity","ListedFlag","UnitTrust","Attribute","BOARD","QUOTED","qAssetAccType","BNMUnitTrust","CashMaturity","Rating","tenor","qCPCode","isincode"]
["2022-02-28","CSH*211000039","CSH","2021-10-14","2022-03-14","HFT","FDC*MYR*BKK",30000000,30000000,30000000,30260876.710000001,0,0,0,2.3E-2,0,260876.71,0,0,"MYR","CASH","CASH","Bangkok Bank","Money Market","MYR","CASH","N/A",30000000,null,null,null,null,"CSH",null,0,null,"FI",null,"QUOTED SHARES",220,null,0,null,151,"BKK","N/A"]
["2022-02-28","CSH*211100031","CSH","2021-11-10","2022-03-10","HFT","FDC*MYR*BKK",12000000,12000000,12000000,12082109.59,0,0,0,2.2499999999999999E-2,0,82109.59,0,0,"MYR","CASH","CASH","Bangkok Bank","Money Market","MYR","CASH","N/A",12000000,null,null,null,null,"CSH",null,0,null,"FI",null,"QUOTED SHARES",220,null,0,null,120,"BKK","N/A"]
["2022-02-28","CSH*220100097","CSH","2022-01-25","2022-03-25","HFT","FDC*MYR*BKK",20000000,20000000,20000000,20040273.969999999,0,0,0,2.1000000000000001E-2,0,40273.97,0,0,"MYR","CASH","CASH","Bangkok Bank","Money Market","MYR","CASH","N/A",20000000,null,null,null,null,"CSH",null,0,null,"FI",null,"QUOTED SHARES",220,null,0,null,59,"BKK","N/A"]
["2022-02-28","CSH*210900036","CSH","2021-09-13","2022-06-13","HFT","FDC*MYR*MBMB",15000000,15000000,15000000,15152794.52,0,0,0,2.1999999999999999E-2,0,152794.51999999999,0,0,"MYR","CASH","CASH","Mizuho Bank (Malaysia) Bhd","Money Market","MYR","CASH","N/A",15000000,null,null,null,null,"CSH",null,0,null,"FI",null,"QUOTED SHARES",220,null,0,null,273,"MBMB","N/A"]
["2022-02-28","CSH*210300024","CSH","2021-03-09","2022-03-09","HFT","FDC*MYR*PBB",15000000,15000000,15000000,15396123.289999999,0,0,0,2.7E-2,0,396123.29,0,0,"MYR","CASH","CASH","Public Bank Berhad","Money Market","MYR","CASH","N/A",15000000,null,null,null,null,"CSH",null,0,null,"FI",null,"QUOTED SHARES",220,null,0,null,365,"PBB","N/A"]
["2022-02-28","CSH*210400021","CSH","2021-04-07","2022-04-07","HFT","FDC*MYR*PBB",10000000,10000000,10000000,10242630.140000001,0,0,0,2.7E-2,0,242630.14,0,0,"MYR","CASH","CASH","Public Bank Berhad","Money Market","MYR","CASH","N/A",10000000,null,null,null,null,"CSH",null,0,null,"FI",null,"QUOTED SHARES",220,null,0,null,365,"PBB","N/A"]
["2022-02-28","CSH*210500025","CSH","2021-05-10","2022-05-10","HFT","FDC*MYR*PBB",10000000,10000000,10000000,10218219.18,0,0,0,2.7E-2,0,218219.18,0,0,"MYR","CASH","CASH","Public Bank Berhad","Money Market","MYR","CASH","N/A",10000000,null,null,null,null,"CSH",null,0,null,"FI",null,"QUOTED SHARES",220,null,0,null,365,"PBB","N/A"]
{"$rows_left_out":183}