{"text_format":"1","workbook":"xlsx","n_sheets":19,"sheets":["Main","InTB","InRiskMeasure","InTop","InTWRR","InHst","InTrn","InFund","InPortFolio","FundSummary","Performance","PL","HoldingSector","HoldingCountry","HoldingCurrency","HoldingAll","HoldingNoShariah","Purchase","Sale"],"not_rendered":{"charts":0,"images":5,"macros":1,"external_links":1,"defined_names":282,"comments":0,"pivot_tables":10},"unopened":[],"bounds":{"document_bytes":16777216,"sheet_cells":100000,"rows_first":2000,"rows_last":500,"rows_between":2000,"halvings":0,"cell_chars":16384,"cell_head_chars":4096},"cells_cut":0,"cells_raw":0,"read":"whole","date_system":"1900"}

{"sheet":"Main","index":0,"n_rows":27,"n_cols":9,"rows_kept":27,"cut":false,"hidden":false,"merged":[[1,0,1,2]]}
[]
["Monthly Report"]
[]
[null,null,null,null,null,"* Please sheet(s) to print",null,"* For pivot table listing control"]
[null,null,null,null,null,"Sheet","YES/NO","Start Row","Last Col"]
[null,"Company :","BIMB Investment Management Berhad",{"$f":"VLOOKUP(FundCode,InFund!A2:G75,7,0)","v":"BI"},null,"FundSummary","YES",1]
[null,"Fund :","THE",{"$f":"VLOOKUP(FundCode,InFund!A2:G76,6,0)","v":"2021-08-30"},null,"Performance","YES",1]
[null,"Fund Name :",{"$f":"VLOOKUP(FundCode,InFund!A2:G75,2,0)","v":"THE"},null,null,"PL","YES",1]
{"$rows_left_out":20}
{"sheet":"InTB","index":1,"n_rows":25,"n_cols":13,"rows_kept":25,"cut":false,"hidden":true,"merged":[]}
["qFundCode","TBDate","qAssetRptGrp","qCurrencyCode","GLCode","qAssetAccType","ShortGL","CreditAmt","DebitAmt","ExRate","ValuationGL","TBType","SumDrCr"]
["THE","2021-10-29","O-EQT","USD","THE-USD015-100000","15","100000",-316919.23,10286700.65,1,false,"BS ",9969781.4199999999]
["THE","2021-10-29","O-EQT","USD","THE-USD015-189000","15","189000",-76390.92,153302.73000000001,1,true,"BS ",76911.81]
["THE","2021-10-29","O-EQT","USD","THE-USD015-199000","15","199000",-13821.11,6588.88,1,true,"BS ",-7232.23]
["THE","2021-10-29","O-EQT","EUR","THE-EUR015-299000","15","299000",0,336.23,0.86480000000000001,false,"BS ",388.79509713228492]
["THE","2021-10-29","O-EQT","GBP","THE-GBP015-300000","15","300000",-320601.40000000002,144256.14000000001,0.73009999999999997,false,"BS ",-241535.76222435286]
["THE","2021-10-29","O-EQT","USD","THE-USD015-300000","15","300000",-5214334.07,5163373.07,1,false,"BS ",-50961]
["THE","2021-10-29","CSH","JPY","THE-JPY000-500000","0","500000",-136958098,125744102,113.819999999999,false,"BS ",-98523.950096644694]
{"$rows_left_out":18}
{"sheet":"InRiskMeasure","index":2,"n_rows":7,"n_cols":19,"rows_kept":7,"cut":false,"hidden":true,"merged":[]}
["Item","qFundCode","StartDate","ValueDate","VaRReturn","CVaRReturn","Volatility","IndexVolatility","TrackingError","NAV","Beta","IndexBenchmark","PeriodFundRtn","PeriodIndexRtn","RSquare","Alpha","Correlation","FundMaxDrawndown","IndexMaxDrawdown"]
["Mth3","THE","2021-08-01","2021-10-29",0,0,0,null,null,10064008.119999999,null,"FBMKLCI",0,null,0,null,0,-0.4945]
["Mth6","THE","2021-05-01","2021-10-29",0,0,0,null,null,10064008.119999999,null,"FBMKLCI",0,null,0,null,0,-0.4945]
["YTD","THE","2021-10-04","2021-10-29",0,0,0,null,null,10064008.119999999,null,"FBMKLCI",0,null,0,null,0,-0.4945]
["Yr1","THE","2020-11-01","2021-10-29",0,0,0,null,null,10064008.119999999,null,"FBMKLCI",0,null,0,null,0,-0.4945]
["Yr3","THE","2018-11-01","2021-10-29",0,0,0,null,null,10064008.119999999,null,"FBMKLCI",0,null,0,null,0,-0.4945]
["Yr5","THE","2016-11-01","2021-10-29",0,0,0,null,null,10064008.119999999,null,"FBMKLCI",0,null,0,null,0,-0.4945]

{"sheet":"InTop","index":3,"n_rows":233,"n_cols":8,"rows_kept":233,"cut":false,"hidden":true,"merged":[]}
["qStockCode","StockName","qFundCode","twrr","benchmark","Excess","PercNAV","Stype"]
["AU000000GMG2",null,"THE",0,0,0,0.94118982090010483,"Top10"]
["AU000000MGR9",null,"THE",0,0,0,0.52392386185793349,"Top10"]
["AU000000SGP0",null,"THE",0,0,0,0.2942348579901583,"Top10"]
["CA13321L1085",null,"THE",0,0,0,0.18969867444820784,"Top10"]
["CA1363751027",null,"THE",0,0,0,1.0825185025784738,"Top10"]
["CA1363851017",null,"THE",0,0,0,0.99760322927879364,"Top10"]
["CA5503721063",null,"THE",0,0,0,0.36167270103514182,"Top10"]
{"$rows_left_out":226}
{"sheet":"InTWRR","index":4,"n_rows":2,"n_cols":28,"rows_kept":2,"cut":false,"hidden":true,"merged":[]}
["Seq","Item","qFundCode","FundName","ValDt1","ValDt2","NAV1","NAV2","TWRRPrice1","TWRRPrice2","TwrrRtrn","BenchMark","Excess","Indix","EAVTWRRPrice","BAVTWRRPrice","CAVTWRRPrice","EAVTWRRPrice1","EAVTWRRPrice2","BAVTWRRPrice1","BAVTWRRPrice2","CAVTWRRPrice1","CAVTWRRPrice2","IndexRtn","Indices1","Indices2","NetTwrrRtrn","PTR"]
[2,"Year To Date","THE","THE","2021-10-29","2021-10-04",10064008.119999999,10000000,"1900-01-01",1,0,null,null,"FBMKLCI",7.1851147761372358E-2,0,0,1.0718511477613724,1,1,"1900-01-01",1,1,7.1851147761372358E-2,null,null,0,8.5900000000000004E-2]

{"sheet":"InHst","index":5,"n_rows":115,"n_cols":21,"rows_kept":115,"cut":false,"hidden":true,"merged":[]}
["StockName","Description","OtherCode1","StockCurrency","qKLSESector","SectorName","qIntSector","IntSectorName","qFundCode","FundCurrency","FundName","CountryName","qCountryID","UnitFaceValue","CostFC","MarketValueFC","IslamicFlag","RealisedGnL","qStockCode","DivReceived","TWRR"]
[null,null,null,null,null,null,null,null,"THE","USD","THE",null,null,5746,96610.35,94721.42,null,0,null,0,-2.4062467262389253E-2]
[null,null,null,null,null,null,null,null,"THE","USD","THE",null,null,24840,54876.46,52727.74,null,0,null,0,-4.3276258044379956E-2]
[null,null,null,null,null,null,null,null,"THE","USD","THE",null,null,8646,30857.89,29611.82,null,0,null,0,-4.443695967732475E-2]
[null,null,null,null,null,null,null,null,"THE","USD","THE",null,null,786,21101.74,19091.29,null,0,null,0,-9.8521022811999925E-2]
[null,null,null,null,null,null,null,null,"THE","USD","THE",null,null,820,109107.6,108944.75,null,0,null,0,-2.6088846960614642E-4]
[null,null,null,null,null,null,null,null,"THE","USD","THE",null,null,2363,100282.02,100398.87,null,0,null,0,-2.2134743679997904E-3]
[null,null,null,null,null,null,null,null,"THE","USD","THE",null,null,4184,35167.9,36398.769999999997,null,0,null,0,3.1283611199999894E-2]
{"$rows_left_out":108}
{"sheet":"InTrn","index":6,"n_rows":11,"n_cols":23,"rows_kept":11,"cut":false,"hidden":true,"merged":[]}
["StockName","Description","OtherCode1","StockCurrency","SectorName","qIntSector","qTrnCode","qFundCode","FundCurrency","FundName","UnitFaceValue","TradeDate","ValueDate","AccDate","PayDate","TranPrice","SCGrossProceed","SCNetProceed","ExchgRateSF","CountryName","qCountryID","qStockCode","FCAmt"]
["MTR Corporation Limited","MTR Corporation Limited",null,"HKD","Others",0,"SP","THE","USD","THE",9160,"2021-10-21","2021-10-21","2021-10-21",44494,42.15,-386094,-387204.86,7.774,"Hong Kong","HK","HK0066009694",-49807.674298945203]
["Fujifilm Holdings Ord Shs","Fujifilm Holdings Ord Shs",null,"JPY","Others",0,"SP","THE","USD","THE",1422,"2021-10-21","2021-10-21","2021-10-21",44494,8858,-12596076,-12614970,113.97,"Japan","JP","JP3814000000",-110686.75967359831]
["HK0101000591","HK0101000591",null,"HKD","Others",0,"SP","THE","USD","THE",7000,"2021-10-21","2021-10-21","2021-10-21",44494,18.3,-128100,-128597.74,7.774,"Hong Kong","HK","HK0101000591",-16542.029843066633]
["ResMed Inc.","ResMed Inc.",null,"USD","Others",0,"SP","THE","USD","THE",418,"2021-10-21","2021-10-21","2021-10-21",44494,263.04000000000002,-109950.72,-109963.26,1,"United States Of America","US","US7611521078",-109963.26]
["ZAE000026480","ZAE000026480",null,"HKD","Others",0,"SP","THE","USD","THE",21,"2021-10-21","2021-10-21","2021-10-21",44495,133.21,-2797.41,-2816.45,14.6724,"Hong Kong","HK","ZAE000026480",-191.95564461165179]
["Schneider Electric SE","Schneider Electric SE",null,"EUR","Others",0,"SP","THE","USD","THE",683,"2021-10-20","2021-10-20","2021-10-20",44491,142.78,-97518.74,-98038.9,0.85819999999999996,"France","FR","FR0000121972",-114237.82335120019]
["Eaton Corp. Plc","Eaton Corp. Plc",null,"USD","Others",0,"SP","THE","USD","THE",705,"2021-10-20","2021-10-20","2021-10-20",44491,163.19999999999999,-115056,-115142.5,1,"United States Of America","US","IE00B8KQN827",-115142.5]
{"$rows_left_out":4}
{"sheet":"InFund","index":7,"n_rows":35,"n_cols":11,"rows_kept":35,"cut":false,"hidden":true,"merged":[]}
["qFundCode","FundName","qFundType","Islamic","FinanceYrStart","FinanceYrEnd","qCompanyID","RollEOYFlag","Fundcurrency","ManagerName","Description"]
["BAPAC","BIMB-ARABESQUE ASIA PACIFIC SHARIAH-ESG EQUITY",1,1,"2015-11-05","2021-10-29","BI",1,"USD","Abd Razak Salimin","FBM KLCI"]
["BAPACMYR","BAPAC (MYR)",1,1,"2015-11-05","2021-10-29","BI",1,"MYR","Abd Razak Salimin","FBM KLCI"]
["BAPACUSD","BAPAC (USD)",1,1,"2015-11-05","2021-10-29","BI",1,"USD","Abd Razak Salimin","FBM KLCI"]
["BGSEF","Bimb-Arabesque Global Shariah Sustainable Equity",1,1,"2020-04-01","2021-03-31","BI",1,"USD","Abd Razak Salimin","MSCI ACWI Islamic Index"]
["BGSEFAUD","BGSEFAUD",1,1,"2020-04-01","2021-03-31","BI",1,"AUD","Abd Razak Salimin","MSCI ACWI Islamic Index"]
["BGSEFMYR","Bimb-Arabesque Global Shariah Sustainable Equity",1,1,"2020-04-01","2021-03-31","BI",1,"MYR","Abd Razak Salimin","MSCI ACWI Islamic Index"]
["BGSEFRMH","Bimb-Arabesque Global Shariah Sustainable Equity",1,1,"2020-04-01","2021-03-31","BI",1,"MYR","Abd Razak Salimin","MSCI ACWI Islamic Index"]
{"$rows_left_out":28}
{"sheet":"InPortFolio","index":8,"n_rows":157,"n_cols":46,"rows_kept":157,"cut":false,"hidden":true,"merged":[]}
["qFundCode","qProductType","qStockCode","qMasterID","UnrealisedGainsStock","UnrealisedGainsExchg","MarketValueFC","MarketValueSC","MaturityDate","UnitFaceValue","PriceCurr","ExchgRate","AccruedInterest","AmortAccreation","CostFC","costsc","ExPreAcq","ExPreAcqSC","fRefPrice","PurchaseYTM","PurchaseDate","ValueYTM","BookValue1Int","ValGains","MarketValueDate","ExPreAcqSC1","ExPreAcq1","LastMarketValue","lcd","ncd","Diminution","qInvType","percNAV","nav","StockName","StockCurrency","FundCurrency","seq","CountryName","sectorName","IntSecName","ManagerName","CurrencyName","costPortfolio","sPeriod","HistoryDate"]
["THE","EQT","AU000000GMG2","THE*AU000000GMG2",-2616.15,727.22,94721.42,125837.4,"3000-01-01",5746,21.9,1.3285,0,0,96610.35,129312.96000000001,0,0,0,0,"2021-10-22",0,129312.96000000001,0,"2021-10-29",0,0,0,"3000-01-01","3000-01-01",0,"FVTPL",0.94118982090010483,10064008.119999999,"AU000000GMG2","   ","USD",1,null,null,null,"Ahmad Rizal Ujang",null,96610.35,"Cur","2021-10-29"]
["THE","EQT","AU000000MGR9","THE*AU000000MGR9",-2561.79,413.07,52727.74,70048.800000000003,"3000-01-01",24840,2.82,1.3285,0,0,54876.46,73452.14,0,0,0,0,"2021-10-22",0,73452.14,0,"2021-10-29",0,0,0,"3000-01-01","3000-01-01",0,"FVTPL",0.52392386185793349,10064008.119999999,"AU000000MGR9","   ","USD",1,null,null,null,"Ahmad Rizal Ujang",null,54876.46,"Cur","2021-10-29"]
["THE","EQT","AU000000SGP0","THE*AU000000SGP0",-1478.34,232.27,29611.82,39339.300000000003,"3000-01-01",8646,4.55,1.3285,0,0,30857.89,41303.279999999999,0,0,0,0,"2021-10-22",0,41303.279999999999,0,"2021-10-29",0,0,0,"3000-01-01","3000-01-01",0,"FVTPL",0.2942348579901583,10064008.119999999,"AU000000SGP0","   ","USD",1,null,null,null,"Ahmad Rizal Ujang",null,30857.89,"Cur","2021-10-29"]
["THE","EQT","CA13321L1085","THE*CA13321L1085",-2018.97,8.52,19091.29,23635.02,"3000-01-01",786,30.07,1.238,0,0,21101.74,26134.5,0,0,0,0,"2021-10-26",0,26134.5,0,"2021-10-29",0,0,0,"3000-01-01","3000-01-01",0,"FVTPL",0.18969867444820784,10064008.119999999,"CA13321L1085","   ","USD",1,null,null,null,"Ahmad Rizal Ujang",null,21101.74,"Cur","2021-10-29"]
["THE","EQT","CA1363751027","THE*CA1363751027",-4.22,-158.63,108944.75,134873.60000000001,"3000-01-01",820,164.48,1.238,0,0,109107.6,134878.82,0,0,0,0,"2021-10-21",0,134878.82,0,"2021-10-29",0,0,0,"3000-01-01","3000-01-01",0,"FVTPL",1.0825185025784738,10064008.119999999,"CA1363751027","   ","USD",1,null,null,null,"Ahmad Rizal Ujang",null,109107.6,"Cur","2021-10-29"]
["THE","EQT","CA1363851017","THE*CA1363851017",76.349999999999994,40.5,100398.87,124293.8,"3000-01-01",2363,52.6,1.238,0,0,100282.02,124199.28,0,0,0,0,"2021-10-26",0,124199.28,0,"2021-10-29",0,0,0,"3000-01-01","3000-01-01",0,"FVTPL",0.99760322927879364,10064008.119999999,"CA1363851017","   ","USD",1,null,null,null,"Ahmad Rizal Ujang",null,100282.02,"Cur","2021-10-29"]
["THE","EQT","CA5503721063","THE*CA5503721063",1216.67,14.2,36398.769999999997,45061.68,"3000-01-01",4184,10.77,1.238,0,0,35167.9,43555.44,0,0,0,0,"2021-10-26",0,43555.44,0,"2021-10-29",0,0,0,"3000-01-01","3000-01-01",0,"FVTPL",0.36167270103514182,10064008.119999999,"CA5503721063","   ","USD",1,null,null,null,"Ahmad Rizal Ujang",null,35167.9,"Cur","2021-10-29"]
{"$rows_left_out":150}
{"sheet":"FundSummary","index":9,"n_rows":61,"n_cols":30,"rows_kept":61,"cut":false,"hidden":false,"merged":[[10,8,10,9],[10,10,10,11],[10,12,10,13],[29,0,29,1],[10,2,10,3],[10,4,10,5],[10,6,10,7],[29,4,29,5],[29,10,29,11],[30,0,30,1],[31,0,31,1],[32,0,32,1],[33,0,33,1],[34,0,34,1],[35,0,35,1],[36,0,36,1],[37,0,37,1],[38,0,38,1],[39,0,39,1],[30,4,30,5],[31,4,31,5],[32,4,32,5],[33,4,33,5],[34,4,34,5],[35,4,35,5],[36,4,36,5],[37,4,37,5],[38,4,38,5],[39,4,39,5],[30,10,30,11],[31,10,31,11],[32,10,32,11],[33,10,33,11],[34,10,34,11],[35,10,35,11],[36,10,36,11],[37,10,37,11],[38,10,38,11],[39,10,39,11]]}
[]
["Fund Summary"]
[]
[{"$f":"\"Fund Manager: \" & FundMng","v":"Fund Manager: Ahmad Rizal Ujang"}]
[{"$f":"\"Portfolio Value (\" & FundCur &\")\"","v":"Portfolio Value (USD)"},null,{"$f":"SUMIFS(InPortFolio!G:G,InPortFolio!AS:AS,\"Cur\")-SUMIFS(InPortFolio!G:G,InPortFolio!AS:AS,\"Cur\",InPortFolio!C:C,\"RecInt\")","v":10233789.810000004}]
["Benchmark Name",null,{"$f":"VLOOKUP(FundCode,InFund!A:K,11,0)","v":"FBM KLCI"}]
["No of Stock - Portfolio",null,{"$f":"COUNTIFS(InPortFolio!AS:AS,\"Cur\",InPortFolio!B:B,\"EQT\")","v":114}]
["No of Stock - Benchmark",null,{"$f":"COUNTIFS(InPortFolio!AS:AS,\"Cur\",InPortFolio!B:B,\"EQT\")","v":114}]
{"$rows_left_out":54}
{"sheet":"Performance","index":10,"n_rows":24,"n_cols":10,"rows_kept":24,"cut":false,"hidden":false,"merged":[[7,2,7,3],[7,5,7,6],[7,8,7,9]]}
[]
[{"$f":"FundName & \" - EQUITY\"","v":"THE - EQUITY"}]
[]
[{"$f":"\"PORTFOLIO VALUATION & PERFORMANCE AS AT \" & UPPER(TEXT(EndDate,\"dd mmm yyyy\"))","v":"PORTFOLIO VALUATION & PERFORMANCE AS AT 29 OCT 2021"}]
[]
[{"$f":"\"Fund Manager: \" & FundMng","v":"Fund Manager: Ahmad Rizal Ujang"}]
[]
[null,null,{"$f":"\"As at \" & TEXT(EndDate,\"dd mmm yyyy\")","v":"As at 29 Oct 2021"},null,null,{"$f":"\"As at \" & TEXT(EOMONTH(EndDate,-1),\"dd mmm yyyy\")","v":"As at 30 Sep 2021"},null,null,{"$f":"\"As at \" & TEXT(VLOOKUP(\"LstYr\",InPortFolio!AS:AT,2,0),\"dd mmm yyyy\")","v":"As at 04 Oct 2021"}]
{"$rows_left_out":17}
{"sheet":"PL","index":11,"n_rows":78,"n_cols":16,"rows_kept":78,"cut":false,"hidden":false,"merged":[]}
[]
[{"$f":"\"PORTFOLIO REALISED AND UNREALISED RETURN FOR \"& UPPER(TEXT(EndDate,\"dd mmm yyyy\"))","v":"PORTFOLIO REALISED AND UNREALISED RETURN FOR 29 OCT 2021"},null,null,null,null,null,null,{"$f":"\"PORTFOLIO REALISED AND UNREALISED RETURN FOR \"& UPPER(TEXT(EndDate,\"dd mmm yyyy\"))","v":"PORTFOLIO REALISED AND UNREALISED RETURN FOR 29 OCT 2021"}]
[]
[{"$f":"\"Fund Manager: \" & FundMng","v":"Fund Manager: Ahmad Rizal Ujang"},null,null,null,null,null,null,{"$f":"\"Fund Manager: \" & FundMng","v":"Fund Manager: Ahmad Rizal Ujang"}]
[]
[{"$f":"\"Currency: \" & FundCur","v":"Currency: USD"},null,null,null,null,null,null,{"$f":"\"Currency: \" & FundCur","v":"Currency: USD"}]
[]
[null,null,null,{"$f":"EndDate","v":"2021-10-29"},null,{"$f":"\"YTD (\"& TEXT(EndDate,\"dd mmm yyyy\") &\")\"","v":"YTD (29 Oct 2021)"},null,null,null,null,{"$f":"EndDate","v":"2021-10-29"},{"$f":"\"YTD (\"& TEXT(EndDate,\"dd mmm yyyy\") &\")\"","v":"YTD (29 Oct 2021)"}]
{"$rows_left_out":71}
{"sheet":"HoldingSector","index":12,"n_rows":29,"n_cols":12,"rows_kept":29,"cut":false,"hidden":false,"merged":[]}
[{"$f":"IF(I1=\"\",\"\",IF(I1=\"Grand Total\",\"TOTAL EQUITIES BY SECTOR\",I1))","v":""},{"$f":"IF(K1=\"\",\"\",K1)","v":""},{"$f":"IF(L1=\"\",\"\",L1)","v":""},{"$f":"IF(K1=\"\",\"\",L1-K1)","v":""},{"$f":"IF(K1=\"\",\"\",(K1/SUMIFS(InPortFolio!AR:AR,InPortFolio!AS:AS,\"Cur\")*100))","v":""},{"$f":"IF(L1=\"\",\"\",ROUND((L1/CurNAV)*100,2))","v":""}]
[{"$f":"\"PORTFOLIO NET ASSET VALUE MIX AS AT \" & UPPER(TEXT(EndDate,\"dd mmm yyyy\"))","v":"PORTFOLIO NET ASSET VALUE MIX AS AT 29 OCT 2021"}]
[]
[{"$f":"\"Fund Manager: \" & FundMng","v":"Fund Manager: Ahmad Rizal Ujang"}]
[]
[{"$f":"\"Currency: \" & FundCur","v":"Currency: USD"}]
[null,null,null,null,null,null,null,null,"qProductType","EQT"]
["SECTOR (GICS)","TOTAL BOOK VALUE \n+ ACCRUED INCOME","TOTAL CURRENT VALUE \n+ ACCRUED INCOME","TOTAL UNREALISED PROFIT/ (LOSS)","HOLDING ON \nBOOK VALUE","HOLDING ON \nCURRENT VALUE",null,null,"sPeriod","Cur"]
{"$rows_left_out":22}
{"sheet":"HoldingCountry","index":13,"n_rows":28,"n_cols":12,"rows_kept":28,"cut":false,"hidden":false,"merged":[]}
[{"$f":"IF(I1=\"\",\"\",IF(I1=\"Grand Total\",\"TOTAL EQUITIES BY COUNTRY\",I1))","v":""},{"$f":"IF(K1=\"\",\"\",K1)","v":""},{"$f":"IF(L1=\"\",\"\",L1)","v":""},{"$f":"IF(K1=\"\",\"\",L1-K1)","v":""},{"$f":"IF(K1=\"\",\"\",(K1/SUMIFS(InPortFolio!AR:AR,InPortFolio!AS:AS,\"Cur\")*100))","v":""},{"$f":"IF(L1=\"\",\"\",ROUND((L1/CurNAV)*100,2))","v":""}]
[{"$f":"\"PORTFOLIO NET ASSET VALUE MIX AS AT \" & UPPER(TEXT(EndDate,\"dd mmm yyyy\"))","v":"PORTFOLIO NET ASSET VALUE MIX AS AT 29 OCT 2021"}]
[]
[{"$f":"\"Fund Manager: \" & FundMng","v":"Fund Manager: Ahmad Rizal Ujang"}]
[]
[{"$f":"\"Currency: \" & FundCur","v":"Currency: USD"}]
[null,null,null,null,null,null,null,null,"qProductType","EQT"]
["EXPOSURE COUNTRY","TOTAL BOOK VALUE \n+ ACCRUED INCOME","TOTAL CURRENT VALUE \n+ ACCRUED INCOME","TOTAL UNREALISED PROFIT/ (LOSS)","HOLDING ON \nBOOK VALUE","HOLDING ON \nCURRENT VALUE",null,null,"sPeriod","Cur"]
{"$rows_left_out":21}
{"sheet":"HoldingCurrency","index":14,"n_rows":27,"n_cols":12,"rows_kept":27,"cut":false,"hidden":false,"merged":[]}
[{"$f":"IF(I1=\"\",\"\",IF(I1=\"Grand Total\",\"TOTAL EQUITIES BY LOCAL CURRENCY\",I1))","v":""},{"$f":"IF(K1=\"\",\"\",K1)","v":""},{"$f":"IF(L1=\"\",\"\",L1)","v":""},{"$f":"IF(K1=\"\",\"\",L1-K1)","v":""},{"$f":"IF(K1=\"\",\"\",(K1/SUMIFS(InPortFolio!AR:AR,InPortFolio!AS:AS,\"Cur\")*100))","v":""},{"$f":"IF(L1=\"\",\"\",ROUND((L1/CurNAV)*100,2))","v":""}]
[{"$f":"\"PORTFOLIO NET ASSET VALUE MIX AS AT \" & UPPER(TEXT(EndDate,\"dd mmm yyyy\"))","v":"PORTFOLIO NET ASSET VALUE MIX AS AT 29 OCT 2021"}]
[]
[{"$f":"\"Fund Manager: \" & FundMng","v":"Fund Manager: Ahmad Rizal Ujang"}]
[]
[{"$f":"\"Currency: \" & FundCur","v":"Currency: USD"}]
[null,null,null,null,null,null,null,null,"qProductType","EQT"]
["LOCAL CURRENCY","TOTAL BOOK VALUE \n+ ACCRUED INCOME","TOTAL CURRENT VALUE \n+ ACCRUED INCOME","TOTAL UNREALISED PROFIT/ (LOSS)","HOLDING ON \nBOOK VALUE","HOLDING ON \nCURRENT VALUE",null,null,"sPeriod","Cur"]
{"$rows_left_out":20}
{"sheet":"HoldingAll","index":15,"n_rows":36,"n_cols":28,"rows_kept":36,"cut":false,"hidden":false,"merged":[]}
[{"$f":"IF(R1=\"\",\"\",IF(R1=\"Grand Total\",\"Total\",R1))","v":""},{"$f":"IF(S1=\"\",\"\",S1)","v":""},{"$f":"IF(T1=\"\",\"\",T1)","v":""},{"$f":"IF(U1=\"\",\"\",U1)","v":""},{"$f":"IF(V1=\"\",\"\",V1)","v":""},{"$f":"IF(X1=\"\",\"\",X1)","v":""},{"$f":"IF(OR(F1=\"\",A1=\"Total\"),\"\",ROUND(H1/F1,4))","v":""},{"$f":"IF(Y1=\"\",\"\",Y1)","v":""},{"$f":"IF(OR(F1=\"\",A1=\"Total\"),\"\",ROUND(J1/F1,4))","v":""},{"$f":"IF(Z1=\"\",\"\",Z1)","v":""},{"$f":"IF(J1=\"\",\"\",J1-H1)","v":""},{"$f":"IF(AA1=\"\",\"\",AA1)","v":""},{"$f":"IF(AB1=\"\",\"\",AB1)","v":""},{"$f":"IF(W1=\"\",\"\",ROUND(W1*100,2))","v":""},{"$f":"IF(L1=\"\",\"\",L1+M1)","v":""},{"$f":"IF(H1=\"\",\"\",ROUND((O1/H1)*100,2))","v":""}]
[{"$f":"FundName & \" - Equity\"","v":"THE - Equity"}]
["Equities Holdings Report (All)"]
[{"$f":"\"as at \" & TEXT(EndDate,\"dd mmm yyyy\")","v":"as at 29 Oct 2021"}]
[]
["Security \nDescription","Bloomberg\nTicker","Local \nCurrency\n","Country/\nMarket","Sector\n(GICS)","Units","Avg .Cost/\nUnit","Investment\nCost\n","Market Value/\nUnit\n","Market Value\n","Unrealised Gain/(Loss)\n\n","Total Realised\nGain/(Loss) \non trading\n","Total Dividend\nreceived \n","TWRR","Total Return\non Investment\n(ROI)","Total Return\non Investment\n(ROI)"]
[null,null,"(CCY)",null,null,null,{"$f":"\"(\" & FundCur &\")\"","v":"(USD)"},"(USD)","(USD)","(USD)","(USD)","(USD)","(USD)","%",{"$f":"\"(\" & FundCur &\")\"","v":"(USD)"},"%"]
[null,null,null,null,null,null,null,null,null,null,null,null,null,null,null,null,null,"Row Labels","qStockCode","StockCurrency","CountryName","SectorName","TWRR","Sum of UnitFaceValue","Sum of CostFC","Sum of MarketValueFC","Sum of RealisedGnL","Sum of DivReceived"]
{"$rows_left_out":29}
{"sheet":"HoldingNoShariah","index":16,"n_rows":33,"n_cols":28,"rows_kept":33,"cut":false,"hidden":false,"merged":[]}
[{"$f":"IF(R1=\"\",\"\",IF(R1=\"Grand Total\",\"Total\",R1))","v":""},{"$f":"IF(S1=\"\",\"\",S1)","v":""},{"$f":"IF(T1=\"\",\"\",T1)","v":""},{"$f":"IF(U1=\"\",\"\",U1)","v":""},{"$f":"IF(V1=\"\",\"\",V1)","v":""},{"$f":"IF(X1=\"\",\"\",X1)","v":""},{"$f":"IF(OR(F1=\"\",A1=\"Total\"),\"\",ROUND(H1/F1,4))","v":""},{"$f":"IF(Y1=\"\",\"\",Y1)","v":""},{"$f":"IF(OR(F1=\"\",A1=\"Total\"),\"\",ROUND(J1/F1,4))","v":""},{"$f":"IF(Z1=\"\",\"\",Z1)","v":""},{"$f":"IF(J1=\"\",\"\",J1-H1)","v":""}]
[{"$f":"FundName & \" - Equity\"","v":"THE - Equity"}]
["Equities Holdings Report (Non-Shariah Compliant)"]
[{"$f":"\"as at \" & TEXT(EndDate,\"dd mmm yyyy\")","v":"as at 29 Oct 2021"}]
[]
["Security \nDescription","Bloomberg\nTicker","Local \nCurrency\n","Country/\nMarket","Sector\n(GICS)","Units","Avg .Cost/\nUnit","Investment\nCost\n","Market Value/\nUnit\n","Market Value\n","Unrealised Gain/(Loss)\n\n",null,null,null,null,null,null,"IslamicFlag",1]
[null,null,"(CCY)",null,null,null,{"$f":"\"(\" & FundCur &\")\"","v":"(USD)"},{"$f":"\"(\" & FundCur &\")\"","v":"(USD)"},{"$f":"\"(\" & FundCur &\")\"","v":"(USD)"},{"$f":"\"(\" & FundCur &\")\"","v":"(USD)"},{"$f":"\"(\" & FundCur &\")\"","v":"(USD)"}]
[null,null,null,null,null,null,null,null,null,null,null,null,null,null,null,null,null,"Row Labels","qStockCode","StockCurrency","CountryName","SectorName","TWRR","Sum of UnitFaceValue","Sum of CostFC","Sum of MarketValueFC","Sum of RealisedGnL","Sum of DivReceived"]
{"$rows_left_out":26}
{"sheet":"Purchase","index":17,"n_rows":19,"n_cols":28,"rows_kept":19,"cut":false,"hidden":false,"merged":[]}
[{"$f":"IF(P1=\"\",IF(O1=\"Grand Total\",\"Total\",\"\"),P1)","v":""},{"$f":"IF(Q1=\"\",\"\",Q1)","v":""},{"$f":"IF(R1=\"\",\"\",R1)","v":""},{"$f":"IF(S1=\"\",\"\",S1)","v":""},{"$f":"IF(T1=\"\",\"\",T1)","v":""},{"$f":"IF(U1=\"\",\"\",U1)","v":""},{"$f":"IF(OR(O1=\"\",O1=\"Grand Total\"),\"\",O1)","v":""},{"$f":"IF(V1=\"\",\"\",V1)","v":""},{"$f":"IF(W1=\"\",\"\",W1)","v":""},{"$f":"IF(X1=\"\",\"\",X1)","v":""},{"$f":"IF(Y1=\"\",\"\",ABS(Y1))","v":""},{"$f":"IF(Z1=\"\",\"\",ABS(Z1))","v":""},{"$f":"IF(AB1=\"\",\"\",ABS(AB1))","v":""}]
[{"$f":"FundName & \" - Equity\"","v":"THE - Equity"}]
["Purchase Report"]
[{"$f":"\"as at \" & TEXT(EndDate,\"dd mmm yyyy\")","v":"as at 29 Oct 2021"}]
[]
["Security \nDescription","Bloomberg\nTicker","Local \nCurrency\n","Country/\nMarket","Sector\n(GICS)","Units","Trade\nDate","Value\nDate","NAV\nDate","Price Per\nUnit\n","Gross\nAmount\n","Net\nAmount\n","Net\nAmount\n",null,"qTrnCode","SP"]
[null,null,"(CCY)",null,null,null,null,null,null,"(CCY)","(CCY)","(CCY)",{"$f":"\"(\" & FundCur &\")\"","v":"(USD)"}]
[null,null,null,null,null,null,null,null,null,null,null,null,null,null,"Row Labels","Description","qStockCode","StockCurrency","CountryName","SectorName","UnitFaceValue","ValueDate","AccDate","TranPrice","SCGrossProceed","SCNetProceed","ExchgRateSF","Sum of FCAmt"]
{"$rows_left_out":12}
{"sheet":"Sale","index":18,"n_rows":9,"n_cols":28,"rows_kept":9,"cut":false,"hidden":false,"merged":[]}
[{"$f":"IF(P1=\"\",IF(O1=\"Grand Total\",\"Total\",\"\"),P1)","v":""},{"$f":"IF(Q1=\"\",\"\",Q1)","v":""},{"$f":"IF(R1=\"\",\"\",R1)","v":""},{"$f":"IF(S1=\"\",\"\",S1)","v":""},{"$f":"IF(T1=\"\",\"\",T1)","v":""},{"$f":"IF(U1=\"\",\"\",ABS(U1))","v":""},{"$f":"IF(OR(O1=\"\",O1=\"Grand Total\"),\"\",O1)","v":""},{"$f":"IF(V1=\"\",\"\",V1)","v":""},{"$f":"IF(W1=\"\",\"\",W1)","v":""},{"$f":"IF(X1=\"\",\"\",X1)","v":""},{"$f":"IF(Y1=\"\",\"\",ABS(Y1))","v":""},{"$f":"IF(Z1=\"\",\"\",ABS(Z1))","v":""},{"$f":"IF(AB1=\"\",\"\",ABS(AB1))","v":""}]
[{"$f":"FundName & \" - Equity\"","v":"THE - Equity"}]
["Sale Report"]
[{"$f":"\"as at \" & TEXT(EndDate,\"dd mmm yyyy\")","v":"as at 29 Oct 2021"}]
[]
["Security \nDescription","Bloomberg\nTicker","Local \nCurrency\n","Country/\nMarket","Sector\n(GICS)","Units","Trade\nDate","Value\nDate","NAV\nDate","Price Per\nUnit\n","Gross\nAmount\n","Net\nAmount\n","Net\nAmount\n",null,"qTrnCode","SS"]
[null,null,"(CCY)",null,null,null,null,null,null,"(CCY)","(CCY)","(CCY)",{"$f":"\"(\" & FundCur &\")\"","v":"(USD)"}]
[null,null,null,null,null,null,null,null,null,null,null,null,null,null,"Row Labels","Description","qStockCode","StockCurrency","CountryName","SectorName","UnitFaceValue","ValueDate","AccDate","TranPrice","SCGrossProceed","SCNetProceed","ExchgRateSF","Sum of FCAmt"]
{"$rows_left_out":1}