{"text_format":"1","workbook":"xlsx","n_sheets":16,"sheets":["Main","InPVROI","InDropList","RIP","ROI Summary","ROI Summary Qtr","Historical","InTBYTD","SBLSummary","InCalROI","InCalROILM","Sheet5","AccTypeRef","Sheet1","Sheet3","Sheet2"],"not_rendered":{"charts":0,"images":0,"macros":1,"external_links":0,"defined_names":31,"comments":0,"pivot_tables":2},"unopened":[],"bounds":{"document_bytes":16777216,"sheet_cells":100000,"rows_first":2000,"rows_last":500,"rows_between":2000,"halvings":0,"cell_chars":16384,"cell_head_chars":4096},"cells_cut":0,"cells_raw":0,"read":"whole","date_system":"1900"}

{"sheet":"Main","index":0,"n_rows":17,"n_cols":16,"rows_kept":17,"cut":false,"hidden":false,"merged":[]}
[null,null,null,null,null,null,null,null,null,null,null,null,null,null,{"$f":"EOMONTH(ValueDate,-1)","v":42947},{"$f":"EOMONTH(ValueDate,-MONTH(ValueDate))","v":42735}]
[null,null,"Calculate ROI"]
[]
[]
[" ","* Step 1: Connect to the server"]
[]
[]
[]
{"$rows_left_out":10}
{"sheet":"InPVROI","index":1,"n_rows":42,"n_cols":8,"rows_kept":42,"cut":false,"hidden":true,"merged":[]}
[null,null,1]
["Row Labels","Asset Class","Max of WorkingDay",null,null,null,"Row Labels","Max of WorkingDay"]
["CASH","ALL",31,null,null,null,"ALL",31]
["CASH","NULL",31,null,null,null,"NULL",31]
["CASH","CSH",31,null,null,null,"CSH",31]
["CASH","EQT",31,null,null,null,"EQT",31]
["CASH","BND",31,null,null,null,"BND",31]
["CORE","ALL",31,null,null,null,"FMM",31]
{"$rows_left_out":35}
{"sheet":"InDropList","index":2,"n_rows":17,"n_cols":1,"rows_kept":17,"cut":false,"hidden":true,"merged":[]}
["ALLFUNDS"]
["CASH"]
["CASH+DSRA"]
["CASH+DSRA+DUMMY"]
["CASH+DSRA+STFI"]
["CORE"]
["DIVIDEND"]
["DSRA"]
{"$rows_left_out":10}
{"sheet":"RIP","index":3,"n_rows":6,"n_cols":9,"rows_kept":6,"cut":false,"hidden":true,"merged":[]}
[]
[null,"Asset Class ROI"]
[null,null,"Asset Class"]
[null,"Fund Code","BND","CPR","CSH","EQT","FEQ","FMM","ALL"]
[null,"ALLFUNDS MTD",{"$f":"IFERROR(SUMIFS(InCalROI!$D:$D,InCalROI!$B:$B,$B5,InCalROI!$J:$J,C$4)/(SUMIFS(InCalROI!$I:$I,InCalROI!$B:$B,$B5,InCalROI!$J:$J,C$4)/SUMIFS(InPVROI!$C:$C,InPVROI!$A:$A,$B5,InPVROI!$B:$B,C$4))/MAX(InCalROI!$G:$G)*365,\"\")","v":""},{"$f":"IFERROR(SUMIFS(InCalROI!$D:$D,InCalROI!$B:$B,$B5,InCalROI!$J:$J,D$4)/(SUMIFS(InCalROI!$I:$I,InCalROI!$B:$B,$B5,InCalROI!$J:$J,D$4)/SUMIFS(InPVROI!$C:$C,InPVROI!$A:$A,$B5,InPVROI!$B:$B,D$4))/MAX(InCalROI!$G:$G)*365,\"\")","v":""},{"$f":"IFERROR(SUMIFS(InCalROI!$D:$D,InCalROI!$B:$B,$B5,InCalROI!$J:$J,E$4)/(SUMIFS(InCalROI!$I:$I,InCalROI!$B:$B,$B5,InCalROI!$J:$J,E$4)/SUMIFS(InPVROI!$C:$C,InPVROI!$A:$A,$B5,InPVROI!$B:$B,E$4))/MAX(InCalROI!$G:$G)*365,\"\")","v":""},{"$f":"IFERROR(SUMIFS(InCalROI!$D:$D,InCalROI!$B:$B,$B5,InCalROI!$J:$J,F$4)/(SUMIFS(InCalROI!$I:$I,InCalROI!$B:$B,$B5,InCalROI!$J:$J,F$4)/SUMIFS(InPVROI!$C:$C,InPVROI!$A:$A,$B5,InPVROI!$B:$B,F$4))/MAX(InCalROI!$G:$G)*365,\"\")","v":""},{"$f":"IFERROR(SUMIFS(InCalROI!$D:$D,InCalROI!$B:$B,$B5,InCalROI!$J:$J,G$4)/(SUMIFS(InCalROI!$I:$I,InCalROI!$B:$B,$B5,InCalROI!$J:$J,G$4)/SUMIFS(InPVROI!$C:$C,InPVROI!$A:$A,$B5,InPVROI!$B:$B,G$4))/MAX(InCalROI!$G:$G)*365,\"\")","v":""},{"$f":"IFERROR(SUMIFS(InCalROI!$D:$D,InCalROI!$B:$B,$B5,InCalROI!$J:$J,H$4)/(SUMIFS(InCalROI!$I:$I,InCalROI!$B:$B,$B5,InCalROI!$J:$J,H$4)/SUMIFS(InPVROI!$C:$C,InPVROI!$A:$A,$B5,InPVROI!$B:$B,H$4))/MAX(InCalROI!$G:$G)*365,\"\")","v":""},{"$f":"SUMIFS(InCalROI!$H:$H,InCalROI!$B:$B,$B5,InCalROI!$J:$J,\"ALL\")/MAX(InCalROI!$G:$G)*365","v":0}]
[null,"ALLFUNDS YTD",{"$f":"IFERROR(SUMIFS(InCalROI!$D:$D,InCalROI!$J:$J,C$4)/(SUMIFS(InCalROI!$I:$I,InCalROI!$J:$J,C$4)/SUMIFS(InPVROI!$H:$H,InPVROI!$G:$G,C$4))/MAX(InCalROI!$G:$G)*365,\"\")","v":""},{"$f":"IFERROR(SUMIFS(InCalROI!$D:$D,InCalROI!$J:$J,D$4)/(SUMIFS(InCalROI!$I:$I,InCalROI!$J:$J,D$4)/SUMIFS(InPVROI!$H:$H,InPVROI!$G:$G,D$4))/MAX(InCalROI!$G:$G)*365,\"\")","v":""},{"$f":"IFERROR(SUMIFS(InCalROI!$D:$D,InCalROI!$J:$J,E$4)/(SUMIFS(InCalROI!$I:$I,InCalROI!$J:$J,E$4)/SUMIFS(InPVROI!$H:$H,InPVROI!$G:$G,E$4))/MAX(InCalROI!$G:$G)*365,\"\")","v":4.854923249260016E-3},{"$f":"IFERROR(SUMIFS(InCalROI!$D:$D,InCalROI!$J:$J,F$4)/(SUMIFS(InCalROI!$I:$I,InCalROI!$J:$J,F$4)/SUMIFS(InPVROI!$H:$H,InPVROI!$G:$G,F$4))/MAX(InCalROI!$G:$G)*365,\"\")","v":1.1621890127453039E-2},{"$f":"IFERROR(SUMIFS(InCalROI!$D:$D,InCalROI!$J:$J,G$4)/(SUMIFS(InCalROI!$I:$I,InCalROI!$J:$J,G$4)/SUMIFS(InPVROI!$H:$H,InPVROI!$G:$G,G$4))/MAX(InCalROI!$G:$G)*365,\"\")","v":6.1174231672735425E-3},{"$f":"IFERROR(SUMIFS(InCalROI!$D:$D,InCalROI!$J:$J,H$4)/(SUMIFS(InCalROI!$I:$I,InCalROI!$J:$J,H$4)/SUMIFS(InPVROI!$H:$H,InPVROI!$G:$G,H$4))/MAX(InCalROI!$G:$G)*365,\"\")","v":7.1986753140084337E-3},{"$f":"IFERROR((SUMIFS(InCalROI!$D:$D,InCalROI!$J:$J,\"<>ALL\",InCalROI!$J:$J,\"<>NULL\"))/(SUMIFS(InCalROI!$I:$I,InCalROI!$J:$J,\"<>ALL\",InCalROI!$J:$J,\"<>NULL\")/MAX(InPVROI!$H:$H))/MAX(InCalROI!$G:$G)*365,\"\")","v":9.764214264092486E-3}]

{"sheet":"ROI Summary","index":4,"n_rows":74,"n_cols":7,"rows_kept":74,"cut":false,"hidden":false,"merged":[[2,3,2,4],[2,5,2,6]]}
[null,"Return on Investment (ROI)"]
[]
[null,null,null,{"$f":" \"MTD - \" & TEXT(ValueDate,\"dd-MMMM-yyyy\")","v":"MTD - 31-August-2017"},null,{"$f":" \"YTD - \" & TEXT(ValueDate,\"dd-MMMM-yyyy\")","v":"YTD - 31-August-2017"}]
[null,null,null,"RM","RM","RM","RM"]
[null,"Investment  (Average)","Listed Equity",{"$f":"IFERROR((SUMIFS(InCalROI!$E:$E,InCalROI!$J:$J,\"EQT\",InCalROI!$A:$A,ValueDate)-IF(MONTH(ValueDate)=1,0,SUMIFS(InCalROI!$E:$E,InCalROI!$J:$J,\"EQT\",InCalROI!$A:$A,LastMonth)))/($E$44),0)","v":5156162161.4416151},null,{"$f":"IFERROR(SUMIFS(InCalROI!$E:$E,InCalROI!$J:$J,\"EQT\",InCalROI!$A:$A,ValueDate)/$G$44,0)","v":4343505346.9357615}]
[null,null,"Unlisted Equity",{"$f":"IFERROR((SUMIFS(InCalROI!$E:$E,InCalROI!$J:$J,\"FEQ\",InCalROI!$A:$A,ValueDate)-IF(MONTH(ValueDate)=1,0,SUMIFS(InCalROI!$E:$E,InCalROI!$J:$J,\"FEQ\",InCalROI!$A:$A,LastMonth)))/($E$44),0)","v":25000000},{"$f":"SUM(D5:D6)","v":5181162161.4416151},{"$f":"IFERROR(SUMIFS(InCalROI!$E:$E,InCalROI!$J:$J,\"FEQ\",InCalROI!$A:$A,ValueDate)/$G$44,0)","v":20127572.016460907},{"$f":"SUM(F5:F6)","v":4363632918.9522228}]
[]
[null,null,"Money Market",{"$f":"IFERROR((SUMIFS(InCalROI!$E:$E,InCalROI!$J:$J,\"CSH\",InCalROI!$A:$A,ValueDate)-IF(MONTH(ValueDate)=1,0,SUMIFS(InCalROI!$E:$E,InCalROI!$J:$J,\"CSH\",InCalROI!$A:$A,LastMonth)))/($E$44),0)","v":1150431225.8064516},null,{"$f":"IFERROR(SUMIFS(InCalROI!$E:$E,InCalROI!$J:$J,\"CSH\",InCalROI!$A:$A,ValueDate)/$G$44,0)","v":1542923147.0164609}]
{"$rows_left_out":67}
{"sheet":"ROI Summary Qtr","index":5,"n_rows":80,"n_cols":11,"rows_kept":80,"cut":false,"hidden":false,"merged":[[2,3,2,4],[2,5,2,6],[2,7,2,8],[2,9,2,10]]}
[null,"Return on Investment (ROI)"]
[]
[null,null,null,"1st Quarter",null,"2nd Quarter",null,"3rd Quarter",null,"4th Quarter"]
[null,null,null,"RM","RM","RM","RM","RM","RM","RM","RM"]
[null,"Investment  (Average)","Listed Equity",{"$f":"IFERROR((SUMIFS(InCalROI!$E:$E,InCalROI!$J:$J,\"EQT\",InCalROI!$A:$A,IF(MONTH(ValueDate)>3,EOMONTH(LastYear,3),ValueDate)))/($E$44),0)","v":3821683186.8449998},null,{"$f":"IFERROR((SUMIFS(InCalROI!$E:$E,InCalROI!$J:$J,\"EQT\",InCalROI!$A:$A,IF(MONTH(ValueDate)>6,EOMONTH(LastYear,6),ValueDate))-SUMIFS(InCalROI!$E:$E,InCalROI!$J:$J,\"EQT\",InCalROI!$A:$A,EOMONTH(LastYear,3)))/(G$44),0)","v":4354465170.4048338},null,{"$f":"IFERROR((SUMIFS(InCalROI!$E:$E,InCalROI!$J:$J,\"EQT\",InCalROI!$A:$A,IF(MONTH(ValueDate)>9,EOMONTH(LastYear,9),ValueDate))-SUMIFS(InCalROI!$E:$E,InCalROI!$J:$J,\"EQT\",InCalROI!$A:$A,EOMONTH(LastYear,6)))/(I$44),0)","v":5084902935.2016153},null,{"$f":"IFERROR((SUMIFS(InCalROI!$E:$E,InCalROI!$J:$J,\"EQT\",InCalROI!$A:$A,IF(MONTH(ValueDate)>12,EOMONTH(LastYear,12),ValueDate))-SUMIFS(InCalROI!$E:$E,InCalROI!$J:$J,\"EQT\",InCalROI!$A:$A,EOMONTH(LastYear,9)))/(K$44),0)","v":4343505346.9357615}]
[null,null,"Unlisted Equity",{"$f":"IFERROR((SUMIFS(InCalROI!$E:$E,InCalROI!$J:$J,\"FEQ\",InCalROI!$A:$A,IF(MONTH(ValueDate)>3,EOMONTH(LastYear,3),ValueDate)))/($E$44),0)","v":15033333.333333334},{"$f":"SUM(D5:D6)","v":3836716520.1783333},{"$f":"IFERROR((SUMIFS(InCalROI!$E:$E,InCalROI!$J:$J,\"FEQ\",InCalROI!$A:$A,IF(MONTH(ValueDate)>6,EOMONTH(LastYear,6),ValueDate))-SUMIFS(InCalROI!$E:$E,InCalROI!$J:$J,\"FEQ\",InCalROI!$A:$A,EOMONTH(LastYear,3)))/(G$44),0)","v":21846153.846153848},{"$f":"SUM(F5:F6)","v":4376311324.250988},{"$f":"IFERROR((SUMIFS(InCalROI!$E:$E,InCalROI!$J:$J,\"FEQ\",InCalROI!$A:$A,IF(MONTH(ValueDate)>9,EOMONTH(LastYear,9),ValueDate))-SUMIFS(InCalROI!$E:$E,InCalROI!$J:$J,\"FEQ\",InCalROI!$A:$A,EOMONTH(LastYear,6)))/(I$44),0)","v":25000000},{"$f":"SUM(H5:H6)","v":5109902935.2016153},{"$f":"IFERROR((SUMIFS(InCalROI!$E:$E,InCalROI!$J:$J,\"FEQ\",InCalROI!$A:$A,IF(MONTH(ValueDate)>12,EOMONTH(LastYear,12),ValueDate))-SUMIFS(InCalROI!$E:$E,InCalROI!$J:$J,\"FEQ\",InCalROI!$A:$A,EOMONTH(LastYear,9)))/(K$44),0)","v":20127572.016460907},{"$f":"SUM(J5:J6)","v":4363632918.9522228}]
[]
[null,null,"Money Market",{"$f":"IFERROR((SUMIFS(InCalROI!$E:$E,InCalROI!$J:$J,\"CSH\",InCalROI!$A:$A,IF(MONTH(ValueDate)>3,EOMONTH(LastYear,3),ValueDate)))/($E$44),0)","v":1365579135.8333333},null,{"$f":"IFERROR((SUMIFS(InCalROI!$E:$E,InCalROI!$J:$J,\"CSH\",InCalROI!$A:$A,IF(MONTH(ValueDate)>6,EOMONTH(LastYear,6),ValueDate))-SUMIFS(InCalROI!$E:$E,InCalROI!$J:$J,\"CSH\",InCalROI!$A:$A,EOMONTH(LastYear,3)))/(G$44),0)","v":1945332434.0659342},null,{"$f":"IFERROR((SUMIFS(InCalROI!$E:$E,InCalROI!$J:$J,\"CSH\",InCalROI!$A:$A,IF(MONTH(ValueDate)>9,EOMONTH(LastYear,9),ValueDate))-SUMIFS(InCalROI!$E:$E,InCalROI!$J:$J,\"CSH\",InCalROI!$A:$A,EOMONTH(LastYear,6)))/(I$44),0)","v":1209725016.1290324},null,{"$f":"IFERROR((SUMIFS(InCalROI!$E:$E,InCalROI!$J:$J,\"CSH\",InCalROI!$A:$A,IF(MONTH(ValueDate)>12,EOMONTH(LastYear,12),ValueDate))-SUMIFS(InCalROI!$E:$E,InCalROI!$J:$J,\"CSH\",InCalROI!$A:$A,EOMONTH(LastYear,9)))/(K$44),0)","v":1542923147.0164609}]
{"$rows_left_out":73}
{"sheet":"Historical","index":6,"n_rows":110,"n_cols":11,"rows_kept":110,"cut":false,"hidden":false,"merged":[]}
[null,"SLA & GSSA - VCAM","SLA - iVCAP","Financing Cost","Loss/ Gain on Disposal of Asset","Prov for Unrealised Loss","Diminution in value of available-for-sale financial assets","G & A","Tax Expense","Capital Employed","Shareholders' Equity"]
["2015-12-31",null,null,null,null,null,null,null,null,3173912306.1399999,172505511.62]
["2016-01-31",318049.25,158561.67000000001,-10902657.529999999,null,null,null,-1206784.68,247678.23,3189037493.71,176728041.66]
["2016-02-29",318049.25,158561.67000000001,-10199260.27,null,null,null,-1640524.47,null,3196618237.25,174109524.93000001]
["2016-03-31",318049.25,158561.66,-10902657.539999999,null,null,null,-1755784.66,null,3221677242.1399999,188265872.28]
["2016-04-30",318049.25,158561.67000000001,-10550958.9,null,null,null,-2029471.15,null,3166088525.5999999,122126196.84]
["2016-05-31",318049.25,169718.42,-10902657.539999999,null,null,null,-1876896.56,null,3139917545.1399999,85052558.840000004]
["2016-06-30",318049.25,158561.66,-10663534.24,null,null,null,-1981673.98,null,4107088819.1799998,105921147.95999999]
{"$rows_left_out":103}
{"sheet":"InTBYTD","index":7,"n_rows":1058,"n_cols":22,"rows_kept":1058,"cut":false,"hidden":false,"merged":[]}
[null,null,null,null,null,null,null,null,null,null,{"$f":"RIGHT(E1,3)","v":""},{"$f":"LEFT(E1,1)","v":""},{"$f":"VLOOKUP(E1,TBgp,2)","v":"BS"},{"$f":"IF(ISNA(VLOOKUP(MOD(E1,1000),$S$1:$V$26,4,0))=TRUE,0,VLOOKUP(MOD(E1,1000),$S$1:$V$26,4,0))","v":"CSH"},null,0,"BS",null,0,"CAPT","Unitholder Capital","CSH"]
["TBDate","GLCode","qFundCode","qCurrencyCode","ShortGL","Value","ValuationGL","TBType","qRptGrpID","qRptGrp1ID","AccType","First","Group","Product Type",null,200000,"CSH",null,10,"SHLI","Local Listed Share","EQT"]
["2016-12-31","0-CH-MYR-100210","CASH","MYR",100210,1544226000,0,"BS ","BIRPFD","BIACDP","210","1","BS","CSH",null,299000,"DR",null,15,"SHFL","Foreign Listed Equities","EQT"]
["2016-12-31","0-CH-MYR-139210","CASH","MYR",139210,3882763.86,1,"BS ","BAINTR","BOAIND","210","1","BS","CSH",null,300000,"CSH",null,30,"SHUL","Local UnListed Share","EQT"]
["2016-12-31","0-CH-MYR-500000","CASH","MYR",500000,821.46,0,"BS ","BABANK","BOABNK","000","5","CSH","CSH",null,600000,"RG",null,100,"BDCG","Cagamas Bond","BND"]
["2016-12-31","0-CH-MYR-630210","CASH","MYR",630210,-59412776.149999999,0,"PLR","PRINTI","PRINMM","210","6","INC","CSH",null,619000,"INC",null,110,"BDCO","Commercial Bond","BND"]
["2016-12-31","0-CH-MYR-636003","CASH","MYR",636003,-6457915.7999999998,0,"PLR","PROTHI","PRINOT","003","6","DI",0,null,630000,"INC",null,115,"BXCO","Foreign Commercial Bond","BND"]
["2016-12-31","0-CH-MYR-636010","CASH","MYR",636010,-535.13,0,"PLR","PRDIVI","PRDVTE","010","6","DI","EQT",null,635000,"DI",null,120,"BDCP","Commercial Paper","BND"]
{"$rows_left_out":1051}
{"sheet":"SBLSummary","index":8,"n_rows":21,"n_cols":15,"rows_kept":21,"cut":false,"hidden":false,"merged":[]}
[null,null,null,null,null,null,null,null,null,null,null,null,null,{"$f":"I1*(1-M1)","v":0},{"$f":"MONTH(A1)","v":1}]
["InterestDate","qFundCode","qStockCode","StockName","ParcelID","UnitFaceValue","PriceCurr","ValueYTM","DailyInterest","PayDate","CPName","StockCurrency","qRank","Value","Month"]
["2017-07-05","REITS",5109,"YTLREIT","SBL*170700001",50000,1.17,1,1.6,"2017-07-05","AFFIN HWANG INVESTMENT BANK BHD","MYR",0.2,1.2800000000000002,7]
["2017-07-06","REITS",5109,"YTLREIT","SBL*170700001",50000,1.18,1,1.62,"2017-07-05","AFFIN HWANG INVESTMENT BANK BHD","MYR",0.2,1.2960000000000003,7]
["2017-07-07","REITS",5109,"YTLREIT","SBL*170700001",50000,1.18,1,1.62,"2017-07-05","AFFIN HWANG INVESTMENT BANK BHD","MYR",0.2,1.2960000000000003,7]
["2017-07-08","REITS",5109,"YTLREIT","SBL*170700001",50000,1.19,1,1.63,"2017-07-05","AFFIN HWANG INVESTMENT BANK BHD","MYR",0.2,1.304,7]
["2017-07-09","REITS",5109,"YTLREIT","SBL*170700001",50000,1.19,1,1.63,"2017-07-05","AFFIN HWANG INVESTMENT BANK BHD","MYR",0.2,1.304,7]
["2017-08-18","DIVIDEND",8583,"MAHSING","SBL*170800002",1700000,1.57,3.25,237.65,"2017-08-18","CIMB INVESTMENT BANK BHD","MYR",0,237.65,8]
{"$rows_left_out":14}
{"sheet":"InCalROI","index":9,"n_rows":165,"n_cols":15,"rows_kept":165,"cut":false,"hidden":false,"merged":[]}
[null,null,null,null,null,null,null,null,{"$f":"IF(D1=0,E1,E1)","v":0},{"$f":"IFERROR(IF(OR(C1=\"ALL\",C1=\"NULL\"),C1,VLOOKUP(C1,AccTypeRef!$A:$D,4,0)),\"\")","v":""},{"$f":"IF($A1=ValueDate,$G1,0)","v":0},{"$f":"IF($A1=LastMonth,$G1,0)","v":0},{"$f":"IF($A1=EOMONTH(LastYear,3),$G1,0)","v":0},{"$f":"IF($A1=EOMONTH(LastYear,6),$G1,0)","v":0},{"$f":"IF($A1=EOMONTH(LastYear,9),$G1,0)","v":0}]
["TBDate","qFundCode","qAccType","TotIncome","TotHolding","TotExpenses","WorkingDay","ROI","CalHolding","AssetClass","VD","LM","D3","D6","D9"]
["2017-08-31","CASH","NULL",5802934.4100000001,0,1838.2,0,0,0,"NULL",0,0,0,0,0]
["2017-08-31","CASH","BDCG",0,0,0,0,0,0,"BND",0,0,0,0,0]
["2017-08-31","CASH","CSMM",35784733.960000001,345802719825,0,243,2.5146390000000001E-2,345802719825,"CSH",243,0,0,0,0]
["2017-08-31","CASH","SHLI",0,0,0,0,0,0,"EQT",0,0,0,0,0]
["2017-08-31","CASH","ALL",41587668.369999997,345802719825,1838.2,243,2.92229E-2,345802719825,"ALL",243,0,0,0,0]
["2017-08-31","CORE","NULL",0,0,0,0,0,0,"NULL",0,0,0,0,0]
{"$rows_left_out":158}
{"sheet":"InCalROILM","index":10,"n_rows":42,"n_cols":27,"rows_kept":42,"cut":false,"hidden":true,"merged":[]}
[null,null,null,null,null,null,null,null,{"$f":"IF(D1=0,E1,E1)","v":0},{"$f":"IFERROR(IF(OR(C1=\"ALL\",C1=\"NULL\"),C1,VLOOKUP(C1,AccTypeRef!$A:$D,3,0)),\"\")","v":""},"Unique","Unique"]
["TBDate","qFundCode","qAccType","TotIncome","TotHolding","TotExpenses","WorkingDay","ROI","CalHolding","AssetClass",null,null,null,null,null,null,null,null,null,null,null,null,null,null,null,null,"Asset Class"]
["2017-01-31","CASH","NULL",1544698.44,0,259.7,0,0,0,"NULL",null,null,null,null,null,null,null,null,null,null,null,null,null,null,null,null,"ZZZZZZ"]
["2017-01-31","CASH","BDCG",0,0,0,0,0,0,"BND",null,null,null,null,null,null,null,null,null,null,null,null,null,null,null,null,"ZZZZZZ"]
["2017-01-31","CASH","CSMM",4175835.13,39426185575,0,31,3.2833699999999999E-3,39426185575,"CSH",null,null,null,null,null,null,null,null,null,null,null,null,null,null,null,null,"CSH"]
["2017-01-31","CASH","SHLI",0,0,0,0,0,0,"EQT",null,null,null,null,null,null,null,null,null,null,null,null,null,null,null,null,"EQT"]
["2017-01-31","CASH","ALL",5720533.5700000003,39426185575,259.7,31,4.4977300000000001E-3,39426185575,"ALL",null,null,null,null,null,null,null,null,null,null,null,null,null,null,null,null,"ZZZZZZ"]
["2017-01-31","CORE","NULL",0,0,0,0,0,0,"NULL",null,null,null,null,null,null,null,null,null,null,null,null,null,null,null,null,"BND"]
{"$rows_left_out":35}
{"sheet":"Sheet5","index":11,"n_rows":362,"n_cols":7,"rows_kept":362,"cut":false,"hidden":true,"merged":[]}
["a","a","a","a","a","a","a"]
["2017-01-03","CASH","MYR",100210,"CSMM","BS ","NULL"]
["2017-01-03","CASH","MYR",139210,"CSMM","BS ","NULL"]
["2017-01-03","CASH","MYR",200100,"BDCG","BS ","NULL"]
["2017-01-03","CASH","MYR",500000,"NULL","BS ","NULL"]
["2017-01-03","CASH","MYR",630210,"CSMM","PLR",48180.93]
["2017-01-03","CASH","MYR",636003,"NULL","PLR",0]
["2017-01-03","CASH","MYR",636010,"SHLI","PLR",0]
{"$rows_left_out":355}
{"sheet":"AccTypeRef","index":12,"n_rows":32,"n_cols":30,"rows_kept":32,"cut":false,"hidden":false,"merged":[[0,5,0,6],[0,0,0,3]]}
["Map AccType to AssetClass (Put NA for unmatched AccType)",null,null,null,null,"Available Asset Class"]
["qAccType","GLMapProdCode","Description",null,null,"qAssetClass","AssetClassDesc"]
["BDCG","100","Cagamas Bond","BND",null,"BND","Bond",null,null,null,null,null,null,null,null,null,null,null,null,null,null,null,null,null,null,null,"BDCG","100","Cagamas Bond","BND"]
["BDCO","110","Commercial Bond","NA",null,"CAP","Capital",null,null,null,null,null,null,null,null,null,null,null,null,null,null,null,null,null,null,null,"BDCO","110","Commercial Bond","NA"]
["BDCP","120","Commercial Paper","CPR",null,"CIS","Collective Investment",null,null,null,null,null,null,null,null,null,null,null,null,null,null,null,null,null,null,null,"BDCP","120","Commercial Paper","CPR"]
["BDGG","130","Government Guaranteed Bond","NA",null,"CPR","Commercial Papers",null,null,null,null,null,null,null,null,null,null,null,null,null,null,null,null,null,null,null,"BDGG","130","Government Guaranteed Bond","NA"]
["BDMG","140","Malaysia Government Securities","NA",null,"CSH","Cash",null,null,null,null,null,null,null,null,null,null,null,null,null,null,null,null,null,null,null,"BDMG","140","Malaysia Government Securities","NA"]
["BNID","190","NID","NA",null,"DCI","Dual Currency Investment",null,null,null,null,null,null,null,null,null,null,null,null,null,null,null,null,null,null,null,"BNID","190","NID","NA"]
{"$rows_left_out":25}
{"sheet":"Sheet1","index":13,"n_rows":4039,"n_cols":16,"rows_kept":4039,"cut":false,"hidden":true,"merged":[]}
["TBDate","qFundCode","qCurrencyCode","ShortGL","qAccType","TBType","TotIncome","TotHoldings","TotExp","TotDays"]
["2017-01-03","CASH","MYR",100210,"CSMM","BS ","NULL",1509567000,"NULL",1,null,null,"2017-02-01",3907938599.1100001]
["2017-01-03","CASH","MYR",139210,"CSMM","BS ","NULL","NULL","NULL",1,null,null,"2017-02-02",3907938599.1100001,{"$f":"SUMIFS(H:H,E:E,\"SHLI\",A:A,M3)+SUMIFS(H:H,E:E,\"REIT\",A:A,M3)","v":3928593825.8800001},{"$f":"O3-N3","v":20655226.769999981}]
["2017-01-03","CASH","MYR",200100,"BDCG","BS ","NULL","NULL","NULL",1,null,null,"2017-02-03",3940654596.8499999,{"$f":"SUMIFS(H:H,E:E,\"SHLI\",A:A,M4)+SUMIFS(H:H,E:E,\"REIT\",A:A,M4)","v":3940654596.8500004},{"$f":"O4-N4","v":0}]
["2017-01-03","CASH","MYR",500000,"NULL","BS ","NULL","NULL","NULL",1,null,null,"2017-02-04",3940654596.8499999,{"$f":"SUMIFS(H:H,E:E,\"SHLI\",A:A,M5)+SUMIFS(H:H,E:E,\"REIT\",A:A,M5)","v":0},-3940654596.8499999]
["2017-01-03","CASH","MYR",630210,"CSMM","PLR",48180.93,"NULL","NULL",1,null,null,"2017-02-05",3940654596.8499999,{"$f":"SUMIFS(H:H,E:E,\"SHLI\",A:A,M6)+SUMIFS(H:H,E:E,\"REIT\",A:A,M6)","v":0},-3940654596.8499999]
["2017-01-03","CASH","MYR",636003,"NULL","PLR",0,"NULL","NULL",1,null,null,"2017-02-06",3929320445.6500001,{"$f":"SUMIFS(H:H,E:E,\"SHLI\",A:A,M7)+SUMIFS(H:H,E:E,\"REIT\",A:A,M7)","v":3929320445.6499996},0]
["2017-01-03","CASH","MYR",636010,"SHLI","PLR",0,"NULL","NULL",1,null,null,"2017-02-07",3917805922.0700002,{"$f":"SUMIFS(H:H,E:E,\"SHLI\",A:A,M8)+SUMIFS(H:H,E:E,\"REIT\",A:A,M8)","v":3917805922.0699992},0]
{"$rows_left_out":4032}
{"sheet":"Sheet3","index":14,"n_rows":28,"n_cols":3,"rows_kept":28,"cut":false,"hidden":true,"merged":[]}
["2017-02-01",3907938599.1100001]
["2017-02-02",3907938599.1100001]
["2017-02-03",3940654596.8499999,3940654596.8500004]
["2017-02-04",3940654596.8499999,0]
["2017-02-05",3940654596.8499999,0]
["2017-02-06",3929320445.6500001,3929320445.6499996]
["2017-02-07",3917805922.0700002,3917805922.0699992]
["2017-02-08",3909906717.3099999,3909906717.3099999]
{"$rows_left_out":21}
{"sheet":"Sheet2","index":15,"n_rows":398,"n_cols":11,"rows_kept":398,"cut":false,"hidden":true,"merged":[]}
["a","s","d","f","g","h","j","k","l","q"]
["2016-12-31","FUND","MYR",100410,"UTEX","BS ","NULL",15000000,"NULL",3,228]
["2017-01-03","FUND","MYR",100410,"UTEX","BS ","NULL",15000000,"NULL",1]
["2017-01-04","FUND","MYR",100410,"UTEX","BS ","NULL",15000000,"NULL",1]
["2017-01-05","FUND","MYR",100410,"UTEX","BS ","NULL",15000000,"NULL",1]
["2017-01-06","FUND","MYR",100410,"UTEX","BS ","NULL",15000000,"NULL",3]
["2017-01-09","FUND","MYR",100410,"UTEX","BS ","NULL",15000000,"NULL",1]
["2017-01-10","FUND","MYR",100410,"UTEX","BS ","NULL",15000000,"NULL",1]
{"$rows_left_out":390}