{"text_format":"1","workbook":"xlsx","n_sheets":7,"sheets":["Riskk","Login","Main","Local","InFund2","Foreign","InTrans"],"not_rendered":{"charts":0,"images":17,"macros":1,"external_links":1,"defined_names":47,"comments":1,"pivot_tables":0},"unopened":[],"bounds":{"document_bytes":16777216,"sheet_cells":100000,"rows_first":2000,"rows_last":500,"rows_between":2000,"halvings":0,"cell_chars":16384,"cell_head_chars":4096},"cells_cut":0,"cells_raw":0,"read":"whole","date_system":"1900"}

{"sheet":"Riskk","index":0,"n_rows":5,"n_cols":11,"rows_kept":5,"cut":false,"hidden":true,"merged":[]}
["linda","UPSW",null,null,null,null,null,{"$f":"COUNT(H3:H20)","v":0},false]
[null,"Userid",null,null,null,null,null,"Main/sub","Caption","On Action","NewGroup"]
[3,"UserLevel"]
["2006-05-09T11:19:39","LoginTime"]
[null,"LogoutTime"]

{"sheet":"Login","index":1,"n_rows":18,"n_cols":10,"rows_kept":18,"cut":false,"hidden":false,"merged":[]}
[]
[null,null,null,null,null,null,null,"Box 389, Lot 7.16, Wisma Central, Jln Ampang, 50450 Kuala Lumpur"]
[]
[]
[]
[]
[]
[]
[null,"BIMB PURCHASE SALES REPORT"]
[]
[]
[]
[]
[]
[]
[]
[]
[null,null,null,null,null,null,null,null,null,"`"]

{"sheet":"Main","index":2,"n_rows":24,"n_cols":11,"rows_kept":24,"cut":false,"hidden":true,"merged":[]}
[null,null,null,"Box 389, Lot 7.16, Wisma Central, Jln Ampang, 50450 Kuala Lumpur"]
[]
[]
[]
[null,"Report Detail",null,null,null,null,null,null,null,"Sheet","Print"]
[null,"Company  :","BIMB Investment Management Berhad",null,null,null,null,null,null,"Local","YES"]
[null,"Fund  :","BMSEF",null,null,null,null,null,null,"Foreign","YES"]
[null,"Fund Name  :",{"$f":"VLOOKUP(FundCode,InFund2!$A:$D,2,0)","v":"BIMB-Arabesque Malaysia Shariah-ESG Equity Fund"}]
[null,"Inception Date  :",{"$f":"VLOOKUP(FundCode,InFund2!$A:$D,3,0)","v":"2017-03-09"}]
[null,"Start Of Year  :",{"$f":"EOMONTH(EOM,-MONTH(EOM))+1","v":"2016-01-01"}]
[null,"Date :","2021-01-08"]
[null,"End Date :","2016-08-15"]
[null,"Index Bench Mark  :",{"$f":"VLOOKUP(FundCode,InFund2!$A:$E,5,0)","v":"FBMKLCI"}]
[null,"Investment Advisor :",{"$f":"VLOOKUP(FundCode,InFund2!$A:$F,6,0)","v":"Thong Yong Ling"}]
[null,"Valuation Method:",{"$f":"IF(FundCode=\"LTAT\", 0,1)","v":1}]
[null,"UTFlag",{"$f":"VLOOKUP(FundCode,InFund2!$A:$G,7,0)","v":1}]
[]
[null,"Current Date :",{"$f":"TEXT(NOW(),\"DD-MMM-YY\")","v":"15-Jun-21"}]
[null,"Current Time :",{"$f":"TEXT(NOW(),\"HH:MM:SS\")","v":"10:05:46"}]
[]
[]
[null,"Conversion Date","2014-12-31"]
[null,"Financial Year End",{"$f":"StartYr-1","v":"2015-12-31"}]
[null,null,{"$f":"C23-1","v":"2015-12-30"}]

{"sheet":"Local","index":3,"n_rows":100,"n_cols":21,"rows_kept":100,"cut":false,"hidden":true,"merged":[]}
[null,null,null,"Fund Description","Trade Date","Settlement Date","Pur/Sal","Broker","ISIN","SEDOL","Stock Name","Quantity","Price","Gross Value","Brokerage\n","Clearing Fees","Stamp Duty","GST","Others\n","Net Value","Currency"]
[]
[null,null,{"$f":"_xlfn.IFNA(VLOOKUP(E3,#REF!,2,FALSE),\"\")","v":{"$error":"#REF!"}},"BIMB-Arabesque Malaysia Shariah-ESG Equity Fund","2021-01-08","2021-01-12","PUR","BR:BIMBSEC","MYQ0078OO004",null,"GDEX",60300,0.38,22914,40.1,6.88,0,2.41,0,22963.39,"MYR"]
[{"$f":"BOM","v":"2021-01-08"},null,{"$f":"_xlfn.IFNA(VLOOKUP(E4,#REF!,2,FALSE),\"\")","v":{"$error":"#REF!"}},"BIMB-Arabesque Malaysia Shariah-ESG Equity Fund","2021-01-08","2021-01-12","PUR","BR:BIMBSEC","MYQ0138OO006",null,"MYEG",13300,1.76,23408,40.96,7.03,24,2.46,0,23482.45,"MYR"]
[null,null,{"$f":"_xlfn.IFNA(VLOOKUP(E5,#REF!,2,FALSE),\"\")","v":{"$error":"#REF!"}},"BIMB-Arabesque Malaysia Shariah-ESG Equity Fund","2021-01-08","2021-01-12","PUR","BR:BIMBSEC","MYL2062OO007",null,"HARBOUR",28700,0.745,21381.5,40,6.42,0,2.4,0,21430.32,"MYR"]
[null,null,{"$f":"_xlfn.IFNA(VLOOKUP(E6,#REF!,2,FALSE),\"\")","v":{"$error":"#REF!"}},"BIMB-Arabesque Malaysia Shariah-ESG Equity Fund","2021-01-08","2021-01-12","PUR","BR:BIMBSEC","MYL2089OO000",null,"UTDPLT",1800,14.42,25956,45.42,7.79,26,2.73,0,26037.94,"MYR"]
[null,null,{"$f":"_xlfn.IFNA(VLOOKUP(E7,#REF!,2,FALSE),\"\")","v":{"$error":"#REF!"}},"BIMB-Arabesque Malaysia Shariah-ESG Equity Fund","2021-01-08","2021-01-12","PUR","BR:BIMBSEC","MYL2127OO008",null,"COMFORT",9800,3.49,34202,59.85,10.27,0,3.59,0,34275.71,"MYR"]
[null,null,{"$f":"_xlfn.IFNA(VLOOKUP(E8,#REF!,2,FALSE),\"\")","v":{"$error":"#REF!"}},"BIMB-Arabesque Malaysia Shariah-ESG Equity Fund","2021-01-08","2021-01-12","PUR","BR:BIMBSEC","MYL2291OO002",null,"GENP",2600,9.9,25740,45.05,7.73,26,2.7,0,25821.48,"MYR"]
[null,null,{"$f":"_xlfn.IFNA(VLOOKUP(E9,#REF!,2,FALSE),\"\")","v":{"$error":"#REF!"}},"BIMB-Arabesque Malaysia Shariah-ESG Equity Fund","2021-01-08","2021-01-12","PUR","BR:BIMBSEC","MYL3867OO008",null,"MPI",800,25.18,20144,40,6.05,21,2.4,0,20213.45,"MYR"]
[null,null,{"$f":"_xlfn.IFNA(VLOOKUP(E10,#REF!,2,FALSE),\"\")","v":{"$error":"#REF!"}},"BIMB-Arabesque Malaysia Shariah-ESG Equity Fund","2021-01-08","2021-01-12","PUR","BR:BIMBSEC","MYL5031OO009",null,"TIMECOM",1800,13.34,24012,42.02,7.21,25,2.52,0,24088.75,"MYR"]
[null,null,{"$f":"_xlfn.IFNA(VLOOKUP(E11,#REF!,2,FALSE),\"\")","v":{"$error":"#REF!"}},"BIMB-Arabesque Malaysia Shariah-ESG Equity Fund","2021-01-08","2021-01-12","PUR","BR:BIMBSEC","MYL5168OO009",null,"HARTA",2500,11.4,28500,49.88,8.5500000000000007,29,2.99,0,28590.42,"MYR"]
[null,null,{"$f":"_xlfn.IFNA(VLOOKUP(E12,#REF!,2,FALSE),\"\")","v":{"$error":"#REF!"}},"BIMB-Arabesque Malaysia Shariah-ESG Equity Fund","2021-01-08","2021-01-12","PUR","BR:BIMBSEC","MYL7106OO007",null,"SUPERMX",9700,6.5,63050,110.34,18.920000000000002,0,6.62,0,63185.88,"MYR"]
[null,null,{"$f":"_xlfn.IFNA(VLOOKUP(E13,#REF!,2,FALSE),\"\")","v":{"$error":"#REF!"}},"BIMB-Arabesque Malaysia Shariah-ESG Equity Fund","2021-01-08","2021-01-12","PUR","BR:BIMBSEC","MYL7113OO003",null,"TOPGLOV",3500,6.07,21245,40,6.38,22,2.4,0,21315.78,"MYR"]
[null,null,{"$f":"_xlfn.IFNA(VLOOKUP(E14,#REF!,2,FALSE),\"\")","v":{"$error":"#REF!"}},"BIMB-Arabesque Malaysia Shariah-ESG Equity Fund","2021-01-08","2021-01-12","PUR","BR:BIMBSEC","MYL7153OO009",null,"KOSSAN",15500,4.2,65100,113.93,19.53,66,6.84,0,65306.3,"MYR"]
[null,null,{"$f":"_xlfn.IFNA(VLOOKUP(E15,#REF!,2,FALSE),\"\")","v":{"$error":"#REF!"}},"BIMB-Arabesque Malaysia Shariah-ESG Equity Fund","2021-01-08","2021-01-12","PUR","BR:BIMBSEC","MYL7277OO006",null,"DIALOG",6800,3.29,22372,40,6.72,23,2.4,0,22444.12,"MYR"]
[null,null,{"$f":"_xlfn.IFNA(VLOOKUP(E16,#REF!,2,FALSE),\"\")","v":{"$error":"#REF!"}},"BIMB-Arabesque Malaysia Shariah-ESG Equity Fund","2021-01-08","2021-01-12","PUR","BR:BIMBSEC","MYL9237OO008",null,"SCIB",6000,1.24,7440,40,2.2400000000000002,8,2.4,0,7492.64,"MYR"]
[null,null,{"$f":"_xlfn.IFNA(VLOOKUP(E17,#REF!,2,FALSE),\"\")","v":{"$error":"#REF!"}}]
[null,null,{"$f":"_xlfn.IFNA(VLOOKUP(E18,#REF!,2,FALSE),\"\")","v":{"$error":"#REF!"}}]
[null,null,{"$f":"_xlfn.IFNA(VLOOKUP(E19,#REF!,2,FALSE),\"\")","v":{"$error":"#REF!"}}]
[null,null,{"$f":"_xlfn.IFNA(VLOOKUP(E20,#REF!,2,FALSE),\"\")","v":{"$error":"#REF!"}}]
[null,null,{"$f":"_xlfn.IFNA(VLOOKUP(E21,#REF!,2,FALSE),\"\")","v":{"$error":"#REF!"}}]
[null,null,{"$f":"_xlfn.IFNA(VLOOKUP(E22,#REF!,2,FALSE),\"\")","v":{"$error":"#REF!"}}]
[null,null,{"$f":"_xlfn.IFNA(VLOOKUP(E23,#REF!,2,FALSE),\"\")","v":{"$error":"#REF!"}}]
[null,null,{"$f":"_xlfn.IFNA(VLOOKUP(E24,#REF!,2,FALSE),\"\")","v":{"$error":"#REF!"}}]
[null,null,{"$f":"_xlfn.IFNA(VLOOKUP(E25,#REF!,2,FALSE),\"\")","v":{"$error":"#REF!"}}]
[null,null,{"$f":"_xlfn.IFNA(VLOOKUP(E26,#REF!,2,FALSE),\"\")","v":{"$error":"#REF!"}}]
[null,null,{"$f":"_xlfn.IFNA(VLOOKUP(E27,#REF!,2,FALSE),\"\")","v":{"$error":"#REF!"}}]
[null,null,{"$f":"_xlfn.IFNA(VLOOKUP(E28,#REF!,2,FALSE),\"\")","v":{"$error":"#REF!"}}]
[null,null,{"$f":"_xlfn.IFNA(VLOOKUP(E29,#REF!,2,FALSE),\"\")","v":{"$error":"#REF!"}}]
[null,null,{"$f":"_xlfn.IFNA(VLOOKUP(E30,#REF!,2,FALSE),\"\")","v":{"$error":"#REF!"}}]
[null,null,{"$f":"_xlfn.IFNA(VLOOKUP(E31,#REF!,2,FALSE),\"\")","v":{"$error":"#REF!"}}]
[null,null,{"$f":"_xlfn.IFNA(VLOOKUP(E32,#REF!,2,FALSE),\"\")","v":{"$error":"#REF!"}}]
[null,null,{"$f":"_xlfn.IFNA(VLOOKUP(E33,#REF!,2,FALSE),\"\")","v":{"$error":"#REF!"}}]
[null,null,{"$f":"_xlfn.IFNA(VLOOKUP(E34,#REF!,2,FALSE),\"\")","v":{"$error":"#REF!"}}]
[null,null,{"$f":"_xlfn.IFNA(VLOOKUP(E35,#REF!,2,FALSE),\"\")","v":{"$error":"#REF!"}}]
[null,null,{"$f":"_xlfn.IFNA(VLOOKUP(E36,#REF!,2,FALSE),\"\")","v":{"$error":"#REF!"}}]
[null,null,{"$f":"_xlfn.IFNA(VLOOKUP(E37,#REF!,2,FALSE),\"\")","v":{"$error":"#REF!"}}]
[null,null,{"$f":"_xlfn.IFNA(VLOOKUP(E38,#REF!,2,FALSE),\"\")","v":{"$error":"#REF!"}}]
[null,null,{"$f":"_xlfn.IFNA(VLOOKUP(E39,#REF!,2,FALSE),\"\")","v":{"$error":"#REF!"}}]
[null,null,{"$f":"_xlfn.IFNA(VLOOKUP(E40,#REF!,2,FALSE),\"\")","v":{"$error":"#REF!"}}]
[null,null,{"$f":"_xlfn.IFNA(VLOOKUP(E41,#REF!,2,FALSE),\"\")","v":{"$error":"#REF!"}}]
[null,null,{"$f":"_xlfn.IFNA(VLOOKUP(E42,#REF!,2,FALSE),\"\")","v":{"$error":"#REF!"}}]
[null,null,{"$f":"_xlfn.IFNA(VLOOKUP(E43,#REF!,2,FALSE),\"\")","v":{"$error":"#REF!"}}]
[null,null,{"$f":"_xlfn.IFNA(VLOOKUP(E44,#REF!,2,FALSE),\"\")","v":{"$error":"#REF!"}}]
[null,null,{"$f":"_xlfn.IFNA(VLOOKUP(E45,#REF!,2,FALSE),\"\")","v":{"$error":"#REF!"}}]
[null,null,{"$f":"_xlfn.IFNA(VLOOKUP(E46,#REF!,2,FALSE),\"\")","v":{"$error":"#REF!"}}]
[null,null,{"$f":"_xlfn.IFNA(VLOOKUP(E47,#REF!,2,FALSE),\"\")","v":{"$error":"#REF!"}}]
[null,null,{"$f":"_xlfn.IFNA(VLOOKUP(E48,#REF!,2,FALSE),\"\")","v":{"$error":"#REF!"}}]
[null,null,{"$f":"_xlfn.IFNA(VLOOKUP(E49,#REF!,2,FALSE),\"\")","v":{"$error":"#REF!"}}]
[null,null,{"$f":"_xlfn.IFNA(VLOOKUP(E50,#REF!,2,FALSE),\"\")","v":{"$error":"#REF!"}}]
[null,null,{"$f":"_xlfn.IFNA(VLOOKUP(E51,#REF!,2,FALSE),\"\")","v":{"$error":"#REF!"}}]
[null,null,{"$f":"_xlfn.IFNA(VLOOKUP(E52,#REF!,2,FALSE),\"\")","v":{"$error":"#REF!"}}]
[null,null,{"$f":"_xlfn.IFNA(VLOOKUP(E53,#REF!,2,FALSE),\"\")","v":{"$error":"#REF!"}}]
[null,null,{"$f":"_xlfn.IFNA(VLOOKUP(E54,#REF!,2,FALSE),\"\")","v":{"$error":"#REF!"}}]
[null,null,{"$f":"_xlfn.IFNA(VLOOKUP(E55,#REF!,2,FALSE),\"\")","v":{"$error":"#REF!"}}]
[null,null,{"$f":"_xlfn.IFNA(VLOOKUP(E56,#REF!,2,FALSE),\"\")","v":{"$error":"#REF!"}}]
[null,null,{"$f":"_xlfn.IFNA(VLOOKUP(E57,#REF!,2,FALSE),\"\")","v":{"$error":"#REF!"}}]
[null,null,{"$f":"_xlfn.IFNA(VLOOKUP(E58,#REF!,2,FALSE),\"\")","v":{"$error":"#REF!"}}]
[null,null,{"$f":"_xlfn.IFNA(VLOOKUP(E59,#REF!,2,FALSE),\"\")","v":{"$error":"#REF!"}}]
[null,null,{"$f":"_xlfn.IFNA(VLOOKUP(E60,#REF!,2,FALSE),\"\")","v":{"$error":"#REF!"}}]
[null,null,{"$f":"_xlfn.IFNA(VLOOKUP(E61,#REF!,2,FALSE),\"\")","v":{"$error":"#REF!"}}]
[null,null,{"$f":"_xlfn.IFNA(VLOOKUP(E62,#REF!,2,FALSE),\"\")","v":{"$error":"#REF!"}}]
[null,null,{"$f":"_xlfn.IFNA(VLOOKUP(E63,#REF!,2,FALSE),\"\")","v":{"$error":"#REF!"}}]
[null,null,{"$f":"_xlfn.IFNA(VLOOKUP(E64,#REF!,2,FALSE),\"\")","v":{"$error":"#REF!"}}]
[null,null,{"$f":"_xlfn.IFNA(VLOOKUP(E65,#REF!,2,FALSE),\"\")","v":{"$error":"#REF!"}}]
[null,null,{"$f":"_xlfn.IFNA(VLOOKUP(E66,#REF!,2,FALSE),\"\")","v":{"$error":"#REF!"}}]
[null,null,{"$f":"_xlfn.IFNA(VLOOKUP(E67,#REF!,2,FALSE),\"\")","v":{"$error":"#REF!"}}]
[null,null,{"$f":"_xlfn.IFNA(VLOOKUP(E68,#REF!,2,FALSE),\"\")","v":{"$error":"#REF!"}}]
[null,null,{"$f":"_xlfn.IFNA(VLOOKUP(E69,#REF!,2,FALSE),\"\")","v":{"$error":"#REF!"}}]
[null,null,{"$f":"_xlfn.IFNA(VLOOKUP(E70,#REF!,2,FALSE),\"\")","v":{"$error":"#REF!"}}]
[null,null,{"$f":"_xlfn.IFNA(VLOOKUP(E71,#REF!,2,FALSE),\"\")","v":{"$error":"#REF!"}}]
[null,null,{"$f":"_xlfn.IFNA(VLOOKUP(E72,#REF!,2,FALSE),\"\")","v":{"$error":"#REF!"}}]
[null,null,{"$f":"_xlfn.IFNA(VLOOKUP(E73,#REF!,2,FALSE),\"\")","v":{"$error":"#REF!"}}]
[null,null,{"$f":"_xlfn.IFNA(VLOOKUP(E74,#REF!,2,FALSE),\"\")","v":{"$error":"#REF!"}}]
[null,null,{"$f":"_xlfn.IFNA(VLOOKUP(E75,#REF!,2,FALSE),\"\")","v":{"$error":"#REF!"}}]
[null,null,{"$f":"_xlfn.IFNA(VLOOKUP(E76,#REF!,2,FALSE),\"\")","v":{"$error":"#REF!"}}]
[null,null,{"$f":"_xlfn.IFNA(VLOOKUP(E77,#REF!,2,FALSE),\"\")","v":{"$error":"#REF!"}}]
[null,null,{"$f":"_xlfn.IFNA(VLOOKUP(E78,#REF!,2,FALSE),\"\")","v":{"$error":"#REF!"}}]
[null,null,{"$f":"_xlfn.IFNA(VLOOKUP(E79,#REF!,2,FALSE),\"\")","v":{"$error":"#REF!"}}]
[null,null,{"$f":"_xlfn.IFNA(VLOOKUP(E80,#REF!,2,FALSE),\"\")","v":{"$error":"#REF!"}}]
{"$rows_left_out":21}
{"sheet":"InFund2","index":4,"n_rows":18,"n_cols":7,"rows_kept":18,"cut":false,"hidden":true,"merged":[]}
[]
["qFundCode","FundName","FinanceYrStart","FinanceYrEnd","qIndexBenchmark","ManagerName","UTFlag"]
["BAPAC","BIMB-ARABESQUE ASIA PACIFIC","2015-11-05","2018-10-31","FBMKLCI","Badrol Ahmad Fathan",1]
["BICMF3","BIMB I Cash Management Fund 3","2015-12-14","2017-12-29","FBMKLCI","Noorul Azila Kamaruzzaman",1]
["BIW","BIMB Invest Wafiyah","2016-10-25","2017-12-29","FBMKLCI","Noorul Azila Kamaruzzaman",1]
["BMSEF","BIMB-Arabesque Malaysia Shariah-ESG Equity Fund","2017-03-09","2018-05-31","FBMKLCI","Thong Yong Ling",1]
["BSF","BIMB ESG Sukuk Fund","2018-08-01","2019-10-31","FBMKLCI","Ahmad Rizal Ujang",1]
["BVMSEF","BIMB-Arabesque Valuecap Malaysia Shariah-ESG Eqt","2015-11-01","2018-10-31","FBMSHA","Thong Yong Ling",1]
["GD1","BIMB-Arabesque i Global Dividend Fund 1","2015-11-05","2018-03-30","FBMKLCI","Thong Yong Ling",1]
["GD1MYR","BIMB-Arabesque i Global Dividend Fund 1 (MYR)","2015-11-05","2018-03-30","FBMKLCI","Thong Yong Ling",1]
["GD1RM","BIMB i Global Dividend Fund 1 (MYR)","2015-11-05","2018-12-31","FBMKLCI","Thong Yong Ling",1]
["GD1USD","BIMB-Arabesque i Global Dividend Fund 1 (USD)","2015-11-05","2018-03-30","FBMKLCI","Thong Yong Ling",1]
["IB","BIMB Dana Al-Fakhim","2015-09-01","2018-08-30","FBMKLCI","Noorul Azila Kamaruzzaman",1]
["ID","BIMB Dana Al-Falah","2015-09-01","2018-08-30","FBMSHA","Badrol Ahmad Fathan",1]
["IF","BIMB I Flexi Fund","2015-04-01","2018-03-30","FBMSHA","Badrol Ahmad Fathan",1]
["IP","BIMB I Dividend Fund","2015-11-01","2018-10-31","FBMSHA","Thong Yong Ling",1]
["IS","BIMB Dana Al-Munsif","2015-09-01","2018-08-30","FBMSHA","Badrol Ahmad Fathan",1]
["TP","BIMB I Growth","2015-07-01","2018-06-29","FBMSHA","Thong Yong Ling",1]

{"sheet":"Foreign","index":5,"n_rows":100,"n_cols":21,"rows_kept":100,"cut":false,"hidden":true,"merged":[]}
[null,null,null,"Fund Description","Trade Date","Settlement Date","Pur/Sal","Broker","ISIN","SEDOL","Stock Name","Quantity","Price","Gross Value","Brokerage\n","Clearing Fees","Stamp Duty","GST","Others","Net Value","Currency"]
[]
[null,null,{"$f":"_xlfn.IFNA(VLOOKUP(E3,#REF!,2,FALSE),\"\")","v":{"$error":"#REF!"}},"BIMB-Arabesque Malaysia Shariah-ESG Equity Fund","2021-01-08","2021-01-12","SAL","BR:MACSEC","JP3519400000",null,"Chugai Pharmaceutical Co., Ltd.",-400,5512,-2204800,4410,0,0,0,0,-2200390,"JPY"]
[{"$f":"BOM","v":"2021-01-08"},null,{"$f":"_xlfn.IFNA(VLOOKUP(E4,#REF!,2,FALSE),\"\")","v":{"$error":"#REF!"}}]
[null,null,{"$f":"_xlfn.IFNA(VLOOKUP(E5,#REF!,2,FALSE),\"\")","v":{"$error":"#REF!"}}]
[null,null,{"$f":"_xlfn.IFNA(VLOOKUP(E6,#REF!,2,FALSE),\"\")","v":{"$error":"#REF!"}}]
[null,null,{"$f":"_xlfn.IFNA(VLOOKUP(E7,#REF!,2,FALSE),\"\")","v":{"$error":"#REF!"}}]
[null,null,{"$f":"_xlfn.IFNA(VLOOKUP(E8,#REF!,2,FALSE),\"\")","v":{"$error":"#REF!"}}]
[null,null,{"$f":"_xlfn.IFNA(VLOOKUP(E9,#REF!,2,FALSE),\"\")","v":{"$error":"#REF!"}}]
[null,null,{"$f":"_xlfn.IFNA(VLOOKUP(E10,#REF!,2,FALSE),\"\")","v":{"$error":"#REF!"}}]
[null,null,{"$f":"_xlfn.IFNA(VLOOKUP(E11,#REF!,2,FALSE),\"\")","v":{"$error":"#REF!"}}]
[null,null,{"$f":"_xlfn.IFNA(VLOOKUP(E12,#REF!,2,FALSE),\"\")","v":{"$error":"#REF!"}}]
[null,null,{"$f":"_xlfn.IFNA(VLOOKUP(E13,#REF!,2,FALSE),\"\")","v":{"$error":"#REF!"}}]
[null,null,{"$f":"_xlfn.IFNA(VLOOKUP(E14,#REF!,2,FALSE),\"\")","v":{"$error":"#REF!"}}]
[null,null,{"$f":"_xlfn.IFNA(VLOOKUP(E15,#REF!,2,FALSE),\"\")","v":{"$error":"#REF!"}}]
[null,null,{"$f":"_xlfn.IFNA(VLOOKUP(E16,#REF!,2,FALSE),\"\")","v":{"$error":"#REF!"}}]
[null,null,{"$f":"_xlfn.IFNA(VLOOKUP(E17,#REF!,2,FALSE),\"\")","v":{"$error":"#REF!"}}]
[null,null,{"$f":"_xlfn.IFNA(VLOOKUP(E18,#REF!,2,FALSE),\"\")","v":{"$error":"#REF!"}}]
[null,null,{"$f":"_xlfn.IFNA(VLOOKUP(E19,#REF!,2,FALSE),\"\")","v":{"$error":"#REF!"}}]
[null,null,{"$f":"_xlfn.IFNA(VLOOKUP(E20,#REF!,2,FALSE),\"\")","v":{"$error":"#REF!"}}]
[null,null,{"$f":"_xlfn.IFNA(VLOOKUP(E21,#REF!,2,FALSE),\"\")","v":{"$error":"#REF!"}}]
[null,null,{"$f":"_xlfn.IFNA(VLOOKUP(E22,#REF!,2,FALSE),\"\")","v":{"$error":"#REF!"}}]
[null,null,{"$f":"_xlfn.IFNA(VLOOKUP(E23,#REF!,2,FALSE),\"\")","v":{"$error":"#REF!"}}]
[null,null,{"$f":"_xlfn.IFNA(VLOOKUP(E24,#REF!,2,FALSE),\"\")","v":{"$error":"#REF!"}}]
[null,null,{"$f":"_xlfn.IFNA(VLOOKUP(E25,#REF!,2,FALSE),\"\")","v":{"$error":"#REF!"}}]
[null,null,{"$f":"_xlfn.IFNA(VLOOKUP(E26,#REF!,2,FALSE),\"\")","v":{"$error":"#REF!"}}]
[null,null,{"$f":"_xlfn.IFNA(VLOOKUP(E27,#REF!,2,FALSE),\"\")","v":{"$error":"#REF!"}}]
[null,null,{"$f":"_xlfn.IFNA(VLOOKUP(E28,#REF!,2,FALSE),\"\")","v":{"$error":"#REF!"}}]
[null,null,{"$f":"_xlfn.IFNA(VLOOKUP(E29,#REF!,2,FALSE),\"\")","v":{"$error":"#REF!"}}]
[null,null,{"$f":"_xlfn.IFNA(VLOOKUP(E30,#REF!,2,FALSE),\"\")","v":{"$error":"#REF!"}}]
[null,null,{"$f":"_xlfn.IFNA(VLOOKUP(E31,#REF!,2,FALSE),\"\")","v":{"$error":"#REF!"}}]
[null,null,{"$f":"_xlfn.IFNA(VLOOKUP(E32,#REF!,2,FALSE),\"\")","v":{"$error":"#REF!"}}]
[null,null,{"$f":"_xlfn.IFNA(VLOOKUP(E33,#REF!,2,FALSE),\"\")","v":{"$error":"#REF!"}}]
[null,null,{"$f":"_xlfn.IFNA(VLOOKUP(E34,#REF!,2,FALSE),\"\")","v":{"$error":"#REF!"}}]
[null,null,{"$f":"_xlfn.IFNA(VLOOKUP(E35,#REF!,2,FALSE),\"\")","v":{"$error":"#REF!"}}]
[null,null,{"$f":"_xlfn.IFNA(VLOOKUP(E36,#REF!,2,FALSE),\"\")","v":{"$error":"#REF!"}}]
[null,null,{"$f":"_xlfn.IFNA(VLOOKUP(E37,#REF!,2,FALSE),\"\")","v":{"$error":"#REF!"}}]
[null,null,{"$f":"_xlfn.IFNA(VLOOKUP(E38,#REF!,2,FALSE),\"\")","v":{"$error":"#REF!"}}]
[null,null,{"$f":"_xlfn.IFNA(VLOOKUP(E39,#REF!,2,FALSE),\"\")","v":{"$error":"#REF!"}}]
[null,null,{"$f":"_xlfn.IFNA(VLOOKUP(E40,#REF!,2,FALSE),\"\")","v":{"$error":"#REF!"}}]
[null,null,{"$f":"_xlfn.IFNA(VLOOKUP(E41,#REF!,2,FALSE),\"\")","v":{"$error":"#REF!"}}]
[null,null,{"$f":"_xlfn.IFNA(VLOOKUP(E42,#REF!,2,FALSE),\"\")","v":{"$error":"#REF!"}}]
[null,null,{"$f":"_xlfn.IFNA(VLOOKUP(E43,#REF!,2,FALSE),\"\")","v":{"$error":"#REF!"}}]
[null,null,{"$f":"_xlfn.IFNA(VLOOKUP(E44,#REF!,2,FALSE),\"\")","v":{"$error":"#REF!"}}]
[null,null,{"$f":"_xlfn.IFNA(VLOOKUP(E45,#REF!,2,FALSE),\"\")","v":{"$error":"#REF!"}}]
[null,null,{"$f":"_xlfn.IFNA(VLOOKUP(E46,#REF!,2,FALSE),\"\")","v":{"$error":"#REF!"}}]
[null,null,{"$f":"_xlfn.IFNA(VLOOKUP(E47,#REF!,2,FALSE),\"\")","v":{"$error":"#REF!"}}]
[null,null,{"$f":"_xlfn.IFNA(VLOOKUP(E48,#REF!,2,FALSE),\"\")","v":{"$error":"#REF!"}}]
[null,null,{"$f":"_xlfn.IFNA(VLOOKUP(E49,#REF!,2,FALSE),\"\")","v":{"$error":"#REF!"}}]
[null,null,{"$f":"_xlfn.IFNA(VLOOKUP(E50,#REF!,2,FALSE),\"\")","v":{"$error":"#REF!"}}]
[null,null,{"$f":"_xlfn.IFNA(VLOOKUP(E51,#REF!,2,FALSE),\"\")","v":{"$error":"#REF!"}}]
[null,null,{"$f":"_xlfn.IFNA(VLOOKUP(E52,#REF!,2,FALSE),\"\")","v":{"$error":"#REF!"}}]
[null,null,{"$f":"_xlfn.IFNA(VLOOKUP(E53,#REF!,2,FALSE),\"\")","v":{"$error":"#REF!"}}]
[null,null,{"$f":"_xlfn.IFNA(VLOOKUP(E54,#REF!,2,FALSE),\"\")","v":{"$error":"#REF!"}}]
[null,null,{"$f":"_xlfn.IFNA(VLOOKUP(E55,#REF!,2,FALSE),\"\")","v":{"$error":"#REF!"}}]
[null,null,{"$f":"_xlfn.IFNA(VLOOKUP(E56,#REF!,2,FALSE),\"\")","v":{"$error":"#REF!"}}]
[null,null,{"$f":"_xlfn.IFNA(VLOOKUP(E57,#REF!,2,FALSE),\"\")","v":{"$error":"#REF!"}}]
[null,null,{"$f":"_xlfn.IFNA(VLOOKUP(E58,#REF!,2,FALSE),\"\")","v":{"$error":"#REF!"}}]
[null,null,{"$f":"_xlfn.IFNA(VLOOKUP(E59,#REF!,2,FALSE),\"\")","v":{"$error":"#REF!"}}]
[null,null,{"$f":"_xlfn.IFNA(VLOOKUP(E60,#REF!,2,FALSE),\"\")","v":{"$error":"#REF!"}}]
[null,null,{"$f":"_xlfn.IFNA(VLOOKUP(E61,#REF!,2,FALSE),\"\")","v":{"$error":"#REF!"}}]
[null,null,{"$f":"_xlfn.IFNA(VLOOKUP(E62,#REF!,2,FALSE),\"\")","v":{"$error":"#REF!"}}]
[null,null,{"$f":"_xlfn.IFNA(VLOOKUP(E63,#REF!,2,FALSE),\"\")","v":{"$error":"#REF!"}}]
[null,null,{"$f":"_xlfn.IFNA(VLOOKUP(E64,#REF!,2,FALSE),\"\")","v":{"$error":"#REF!"}}]
[null,null,{"$f":"_xlfn.IFNA(VLOOKUP(E65,#REF!,2,FALSE),\"\")","v":{"$error":"#REF!"}}]
[null,null,{"$f":"_xlfn.IFNA(VLOOKUP(E66,#REF!,2,FALSE),\"\")","v":{"$error":"#REF!"}}]
[null,null,{"$f":"_xlfn.IFNA(VLOOKUP(E67,#REF!,2,FALSE),\"\")","v":{"$error":"#REF!"}}]
[null,null,{"$f":"_xlfn.IFNA(VLOOKUP(E68,#REF!,2,FALSE),\"\")","v":{"$error":"#REF!"}}]
[null,null,{"$f":"_xlfn.IFNA(VLOOKUP(E69,#REF!,2,FALSE),\"\")","v":{"$error":"#REF!"}}]
[null,null,{"$f":"_xlfn.IFNA(VLOOKUP(E70,#REF!,2,FALSE),\"\")","v":{"$error":"#REF!"}}]
[null,null,{"$f":"_xlfn.IFNA(VLOOKUP(E71,#REF!,2,FALSE),\"\")","v":{"$error":"#REF!"}}]
[null,null,{"$f":"_xlfn.IFNA(VLOOKUP(E72,#REF!,2,FALSE),\"\")","v":{"$error":"#REF!"}}]
[null,null,{"$f":"_xlfn.IFNA(VLOOKUP(E73,#REF!,2,FALSE),\"\")","v":{"$error":"#REF!"}}]
[null,null,{"$f":"_xlfn.IFNA(VLOOKUP(E74,#REF!,2,FALSE),\"\")","v":{"$error":"#REF!"}}]
[null,null,{"$f":"_xlfn.IFNA(VLOOKUP(E75,#REF!,2,FALSE),\"\")","v":{"$error":"#REF!"}}]
[null,null,{"$f":"_xlfn.IFNA(VLOOKUP(E76,#REF!,2,FALSE),\"\")","v":{"$error":"#REF!"}}]
[null,null,{"$f":"_xlfn.IFNA(VLOOKUP(E77,#REF!,2,FALSE),\"\")","v":{"$error":"#REF!"}}]
[null,null,{"$f":"_xlfn.IFNA(VLOOKUP(E78,#REF!,2,FALSE),\"\")","v":{"$error":"#REF!"}}]
[null,null,{"$f":"_xlfn.IFNA(VLOOKUP(E79,#REF!,2,FALSE),\"\")","v":{"$error":"#REF!"}}]
[null,null,{"$f":"_xlfn.IFNA(VLOOKUP(E80,#REF!,2,FALSE),\"\")","v":{"$error":"#REF!"}}]
{"$rows_left_out":21}
{"sheet":"InTrans","index":6,"n_rows":17,"n_cols":19,"rows_kept":17,"cut":false,"hidden":true,"merged":[]}
[]
["qProductType","FundName","TradeDate","PayDate","qTrnCode","qCPCode","qStockCode","ISINCode","StockName","UnitFaceValue","TranPrice","SCGrossProceed","BrokerageFee","ClearingFee","StampDuty","VAT","OtherFee","SCNetProceed","SettCurrency"]
["EQT","BIMB-Arabesque Malaysia Shariah-ESG Equity Fund","2021-01-08","2021-01-12","SS","BR:MACSEC","JP3519400000","JP3519400000","Chugai Pharmaceutical Co., Ltd.",-400,5512,2204800,4410,0,0,0,0,2200390,"JPY"]
["EQT","BIMB-Arabesque Malaysia Shariah-ESG Equity Fund","2021-01-08","2021-01-12","SP","BR:BIMBSEC",78,"MYQ0078OO004","GDEX",60300,0.38,-22914,40.1,6.88,0,2.41,0,-22963.39,"MYR"]
["EQT","BIMB-Arabesque Malaysia Shariah-ESG Equity Fund","2021-01-08","2021-01-12","SP","BR:BIMBSEC",138,"MYQ0138OO006","MYEG",13300,1.76,-23408,40.96,7.03,24,2.46,0,-23482.45,"MYR"]
["EQT","BIMB-Arabesque Malaysia Shariah-ESG Equity Fund","2021-01-08","2021-01-12","SP","BR:BIMBSEC",2062,"MYL2062OO007","HARBOUR",28700,0.745,-21381.5,40,6.42,0,2.4,0,-21430.32,"MYR"]
["EQT","BIMB-Arabesque Malaysia Shariah-ESG Equity Fund","2021-01-08","2021-01-12","SP","BR:BIMBSEC",2089,"MYL2089OO000","UTDPLT",1800,14.42,-25956,45.42,7.79,26,2.73,0,-26037.94,"MYR"]
["EQT","BIMB-Arabesque Malaysia Shariah-ESG Equity Fund","2021-01-08","2021-01-12","SP","BR:BIMBSEC",2127,"MYL2127OO008","COMFORT",9800,3.49,-34202,59.85,10.27,0,3.59,0,-34275.71,"MYR"]
["EQT","BIMB-Arabesque Malaysia Shariah-ESG Equity Fund","2021-01-08","2021-01-12","SP","BR:BIMBSEC",2291,"MYL2291OO002","GENP",2600,9.9,-25740,45.05,7.73,26,2.7,0,-25821.48,"MYR"]
["EQT","BIMB-Arabesque Malaysia Shariah-ESG Equity Fund","2021-01-08","2021-01-12","SP","BR:BIMBSEC",3867,"MYL3867OO008","MPI",800,25.18,-20144,40,6.05,21,2.4,0,-20213.45,"MYR"]
["EQT","BIMB-Arabesque Malaysia Shariah-ESG Equity Fund","2021-01-08","2021-01-12","SP","BR:BIMBSEC",5031,"MYL5031OO009","TIMECOM",1800,13.34,-24012,42.02,7.21,25,2.52,0,-24088.75,"MYR"]
["EQT","BIMB-Arabesque Malaysia Shariah-ESG Equity Fund","2021-01-08","2021-01-12","SP","BR:BIMBSEC",5168,"MYL5168OO009","HARTA",2500,11.4,-28500,49.88,8.5500000000000007,29,2.99,0,-28590.42,"MYR"]
["EQT","BIMB-Arabesque Malaysia Shariah-ESG Equity Fund","2021-01-08","2021-01-12","SP","BR:BIMBSEC",7106,"MYL7106OO007","SUPERMX",9700,6.5,-63050,110.34,18.920000000000002,0,6.62,0,-63185.88,"MYR"]
["EQT","BIMB-Arabesque Malaysia Shariah-ESG Equity Fund","2021-01-08","2021-01-12","SP","BR:BIMBSEC",7113,"MYL7113OO003","TOPGLOV",3500,6.07,-21245,40,6.38,22,2.4,0,-21315.78,"MYR"]
["EQT","BIMB-Arabesque Malaysia Shariah-ESG Equity Fund","2021-01-08","2021-01-12","SP","BR:BIMBSEC",7153,"MYL7153OO009","KOSSAN",15500,4.2,-65100,113.93,19.53,66,6.84,0,-65306.3,"MYR"]
["EQT","BIMB-Arabesque Malaysia Shariah-ESG Equity Fund","2021-01-08","2021-01-12","SP","BR:BIMBSEC",7277,"MYL7277OO006","DIALOG",6800,3.29,-22372,40,6.72,23,2.4,0,-22444.12,"MYR"]
["EQT","BIMB-Arabesque Malaysia Shariah-ESG Equity Fund","2021-01-08","2021-01-12","SP","BR:BIMBSEC",9237,"MYL9237OO008","SCIB",6000,1.24,-7440,40,2.2400000000000002,8,2.4,0,-7492.64,"MYR"]