{"text_format":"1","workbook":"xlsx","n_sheets":15,"sheets":["Riskk","Login","Main","WSMain","WSList","WS1","WS2","WS3","WS4","WS5","WS6","InTran","InInvPort","InFund","InAccByFundHst"],"not_rendered":{"charts":0,"images":39,"macros":1,"external_links":0,"defined_names":82,"comments":0,"pivot_tables":2},"unopened":[],"bounds":{"document_bytes":16777216,"sheet_cells":100000,"rows_first":2000,"rows_last":500,"rows_between":2000,"halvings":0,"cell_chars":16384,"cell_head_chars":4096},"cells_cut":0,"cells_raw":0,"read":"whole","date_system":"1900"}

{"sheet":"Riskk","index":0,"n_rows":5,"n_cols":11,"rows_kept":5,"cut":false,"hidden":true,"merged":[]}
["linda","UPSW",null,null,null,null,null,{"$f":"COUNT(H3:H20)","v":0},false]
[null,"Userid",null,null,null,null,null,"Main/sub","Caption","On Action","NewGroup"]
[3,"UserLevel"]
["2006-05-09T11:19:39","LoginTime"]
[null,"LogoutTime"]

{"sheet":"Login","index":1,"n_rows":18,"n_cols":10,"rows_kept":18,"cut":false,"hidden":false,"merged":[]}
[]
[null,"Riskk",null,null,null,null,null,"Box 389, Lot 7.16, Wisma Central, Jln Ampang, 50450 Kuala Lumpur"]
[null,"Sdn Bhd (CN 388306K)"]
[]
[]
[]
[]
[]
[null,"SC REPORT"]
[]
{"$rows_left_out":9}
{"sheet":"Main","index":2,"n_rows":18,"n_cols":11,"rows_kept":18,"cut":false,"hidden":true,"merged":[]}
["Riskk ",null,null,"Box 389, Lot 7.16, Wisma Central, Jln Ampang, 50450 Kuala Lumpur"]
["Sdn Bhd (CN 388306K)"]
[]
[]
[null,"Report Detail",null,null,null,null,null,null,null,"Sheet","Print"]
[null,"Company  :","KFH Asset Management Sdn Bhd",null,null,null,null,null,null,"WSMain","YES"]
[null,"Fund  :","KFHICASH",null,null,null,null,null,null,"WSList","YES"]
[null,"Fund Name  :",{"$f":"VLOOKUP(FundCode,InFund!$A:$D,2,0)","v":"KFH iCash Investment Fund"},null,null,null,null,null,null,"WS1","YES"]
[null,"Inception Date  :",{"$f":"TEXT(DATEVALUE(VLOOKUP(FundCode,InFund!$A:$E,5,0)),\"dd-MMM-yy\")","v":"01-Jan-13"},null,null,null,null,null,null,"WS2","YES"]
[null,"Start Of Year  :",{"$f":"EOMONTH(EOM,-MONTH(EOM))+1","v":"2013-01-01"},null,null,null,null,null,null,"WS3","YES"]
{"$rows_left_out":9}
{"sheet":"WSMain","index":3,"n_rows":24,"n_cols":7,"rows_kept":24,"cut":false,"hidden":true,"merged":[[14,6,14,7],[13,6,13,8],[10,3,10,8]]}
[]
[null,null,null,"                                                 SECURITIES COMMISSION"]
[null,null,null,"WHOLESALE FUND RETURNS"]
[]
[{"$f":"EDATE(EOM,0)","v":"2013-08-31"},null,null,"DECLARATION/VERIFICATION FORM"]
[null,null,null,{"$f":"\"For the Month Ended \" & TEXT(EOM,\"MMM yyyy\")","v":"For the Month Ended Aug 2013"}]
[null,null,null,"Management Company ",null,{"$f":"\": \" &CompanyName","v":": KFH Asset Management Sdn Bhd"}]
[null,null,null,"Trustee  ",null,{"$f":"\": \" & VLOOKUP(FundCode,InFund!A:X,23,0)","v":": AAA"}]
[null,null,null,"Fund (s)",null,{"$f":"\": \" &FundName","v":": KFH iCash Investment Fund"}]
[]
{"$rows_left_out":15}
{"sheet":"WSList","index":4,"n_rows":18,"n_cols":8,"rows_kept":18,"cut":false,"hidden":true,"merged":[[10,3,10,8]]}
[]
[null,null,null,"                                  SECURITIES COMMISSION"]
[null,null,null,"WHOLESALE FUND RETURNS"]
[]
[null,null,null,"CHCEKLIST"]
[{"$f":"EDATE(EOM,0)","v":"2013-08-31"},null,null,{"$f":"\"For the Month Ended \" & TEXT(EOM,\"MMM yyyy\")","v":"For the Month Ended Aug 2013"}]
[]
[null,null,null,"Management Company ",null,{"$f":"\": \" &CompanyName","v":": KFH Asset Management Sdn Bhd"}]
[null,null,null,"Fund ",null,{"$f":"\": \" &FundName","v":": KFH iCash Investment Fund"}]
[]
{"$rows_left_out":9}
{"sheet":"WS1","index":5,"n_rows":17,"n_cols":15,"rows_kept":17,"cut":false,"hidden":true,"merged":[[15,3,15,14],[16,3,16,14],[11,3,12,3],[11,4,11,5],[11,6,11,7],[11,8,11,9],[11,10,11,11],[11,12,12,12],[1,3,1,14],[3,3,3,14],[9,7,9,14],[10,3,10,14],[11,13,12,13],[11,14,12,14]]}
[null,null,null,null,null,null,null,null,null,null,null,null,null,null,"WS 1"]
[null,null,null," SECURITIES COMMISSION"]
[null,null,null,"WHOLESALE FUND RETURNS"]
[]
[null,null,null,"NUMBER OF ACCOUNTS"]
[{"$f":"EDATE(EOM,0)","v":"2013-08-31"}]
[]
[null,null,null,"Management Company ",null,null,null,{"$f":"\": \" &CompanyName","v":": KFH Asset Management Sdn Bhd"}]
[null,null,null,"Name of Fund",null,null,null,{"$f":"\": \" &FundName","v":": KFH iCash Investment Fund"}]
[null,null,null,"Month Ended",null,null,null,{"$f":"\":  \" & TEXT(EOM, \"dd mmm yyyy\")","v":":  31 Aug 2013"}]
{"$rows_left_out":8}
{"sheet":"WS2","index":6,"n_rows":17,"n_cols":13,"rows_kept":17,"cut":false,"hidden":true,"merged":[[12,12,13,12],[16,3,16,12],[17,3,17,12],[1,3,1,12],[3,3,3,12],[9,7,9,12],[10,3,10,12],[12,3,13,3],[12,4,12,5],[11,6,11,7],[11,10,11,11],[11,8,11,9],[11,3,11,5]]}
[null,null,null,null,null,null,null,null,null,null,null,null,"WS 2"]
[null,null,null," SECURITIES COMMISSION"]
[null,null,null,"WHOLESALE FUND RETURNS"]
[]
[null,null,null,"UNITS IN CIRCULATION"]
[{"$f":"EDATE(EOM,0)","v":"2013-08-31"}]
[]
[null,null,null,"Management Company ",null,null,null,{"$f":"\": \" &CompanyName","v":": KFH Asset Management Sdn Bhd"}]
[null,null,null,"Name of Fund",null,null,null,{"$f":"\": \" &FundName","v":": KFH iCash Investment Fund"}]
[null,null,null,"Month Ended",null,null,null,{"$f":"\":  \" & TEXT(EOM, \"dd mmm yyyy\")","v":":  31 Aug 2013"}]
{"$rows_left_out":8}
{"sheet":"WS3","index":7,"n_rows":16,"n_cols":9,"rows_kept":16,"cut":false,"hidden":true,"merged":[[15,3,15,8],[1,3,1,8],[3,3,3,8],[9,5,9,8],[10,3,10,4],[10,5,10,6],[2,3,2,8],[4,3,4,8],[10,7,10,8]]}
[null,null,null,null,null,null,null,null,"WS 3"]
[null,null,null,"  SECURITIES COMMISSION"]
[null,null,null,"WHOLESALE FUND RETURNS"]
[]
[null,null,null,"SUBSCRIPTION AND REDEMPTION"]
[{"$f":"EDATE(EOM,0)","v":"2013-08-31"}]
[]
[null,null,null,"Management Company ",null,{"$f":"\": \" &CompanyName","v":": KFH Asset Management Sdn Bhd"}]
[null,null,null,"Name of Fund ",null,{"$f":"\": \" &FundName","v":": KFH iCash Investment Fund"}]
[null,null,null,"Month Ended",null,{"$f":"\":  \" & TEXT(EOM, \"dd mmm yyyy\")","v":":  31 Aug 2013"}]
{"$rows_left_out":7}
{"sheet":"WS4","index":8,"n_rows":17,"n_cols":12,"rows_kept":17,"cut":false,"hidden":true,"merged":[[16,3,16,11],[10,3,10,4],[10,5,10,8],[10,9,11,9],[10,10,11,10],[10,11,11,11],[1,3,1,11],[3,3,3,11],[9,6,9,11],[2,3,2,11],[4,3,4,11]]}
[null,null,null,null,null,null,null,null,null,null,null,"WS 4"]
[null,null,null,"   SECURITIES COMMISSION"]
[null,null,null,"WHOLESALE FUND RETURNS"]
[]
[null,null,null,"SALES BY CHANNELS OF DISTRIBUTION"]
[{"$f":"EDATE(EOM,0)","v":"2013-08-31"}]
[]
[null,null,null,"Management Company ",null,null,{"$f":"\": \" &CompanyName","v":": KFH Asset Management Sdn Bhd"}]
[null,null,null,"Name of Fund ",null,null,{"$f":"\": \" &FundName","v":": KFH iCash Investment Fund"}]
[null,null,null,"Month Ended",null,null,{"$f":"\":  \" & TEXT(EOM, \"dd mmm yyyy\")","v":":  31 Aug 2013"}]
{"$rows_left_out":8}
{"sheet":"WS5","index":9,"n_rows":15,"n_cols":14,"rows_kept":15,"cut":false,"hidden":true,"merged":[[1,3,1,6],[4,3,4,6],[2,3,2,6]]}
[null,null,null,null,null,null,"WS 5"]
[null,null,null,"  SECURITIES COMMISSION"]
[null,null,null,"WHOLESALE FUND RETURNS"]
[]
[null,null,null,"PROFILE OF UNIT HOLDERS"]
[{"$f":"EDATE(EOM,0)","v":"2013-08-31"}]
[]
[null,null,null,"Management Company ",null,{"$f":"\": \" & CompanyName","v":": KFH Asset Management Sdn Bhd"}]
[null,null,null,"Name of Fund",null,{"$f":"\": \" & FundName","v":": KFH iCash Investment Fund"}]
[null,null,null,"Month Ended",null,{"$f":"\": \" & TEXT(EOM,\"dd mmm yyyy\")","v":": 31 Aug 2013"},null,null,null,null,"category","(Multiple Items)"]
{"$rows_left_out":6}
{"sheet":"WS6","index":10,"n_rows":25,"n_cols":19,"rows_kept":25,"cut":false,"hidden":true,"merged":[[1,3,1,8],[4,3,4,8],[2,3,2,8]]}
[null,null,null,null,null,null,null,null,"WS 6"]
[null,null,null,"  SECURITIES COMMISSION"]
[null,null,null,"WHOLESALE FUND RETURNS"]
[]
[null,null,null,"INVESTMENT PORTFOLIO"]
[{"$f":"EDATE(EOM,0)","v":"2013-08-31"}]
[]
[null,null,null,"Management Company ",null,{"$f":"\": \" & CompanyName","v":": KFH Asset Management Sdn Bhd"}]
[null,null,null,"Name of Fund ",null,{"$f":"\": \" & FundName","v":": KFH iCash Investment Fund"}]
[null,null,null,"Month Ended",null,{"$f":"\": \" & TEXT(EOM,\"dd mmm yyyy\")","v":": 31 Aug 2013"}]
{"$rows_left_out":16}
{"sheet":"InTran","index":11,"n_rows":4,"n_cols":6,"rows_kept":4,"cut":false,"hidden":true,"merged":[]}
["qAgentType","GrossProceed","Units","qTrnCode","ValueDate","qFundCode"]
["CUTA",81500,81500,"UP","2013-08-23","KFHICASH"]
["CUTA",-81529.421499999997,-81500,"UR","2013-08-27","KFHICASH"]
["N/A",3000,3000,"UP","2013-08-28","KFHICASH"]

{"sheet":"InInvPort","index":12,"n_rows":23,"n_cols":90,"rows_kept":23,"cut":false,"hidden":true,"merged":[]}
["Class","qProductType","qFundCode","qStockCode","UnitFaceValue","MarketValueSC","MarketValueFC","ExchangeRate","MaturityDateCSH","CostFC","CostSC","AccruedInterestFC","AccruedInterestSC","UnrealisedGainsStock","UnrealisedGainsExchg","PriceCurr","FundName","FundCurrency","MaxTenor","qCompanyID","StockName","StockCurrency","qAssetClass","AssetClassDesc","SectorName","Frequency","ExcelBasis","Coupon","MaturityDateBND","Term","qCPCode","CPName","CurrencyName","ProductTypeDesc","EQTSource","AmortAccreation","ExPreAcq","ExPreAcqSC","IssuedSize","Exchange","IslamicFlag","IssuerName","IssuerGrpName","qStockType","Board","qBondType","BndDesc","StockTypeDesc","qManagerCode","qCountryID","FreezeUnit","FundDesc","RatingUsed","NAV","ExchgName","qCshType","CshTypeDesc","CashFlag","DebitAmtSC","CreditAmtSC","ConsoTotalSC","DebitAmtFC","CreditAmtFC","ConsoTotalFC","Status","RptGrpDesc","qRptGrp1ID","RptGrp1Desc","qRptGrp2ID","RptGrp2Desc","ShortGL","GLCode","ValuationGL","UTFlag","qKLSESector","ValuationMethod","qRptSequence","fPercNAV","PurchaseYTM","PurchaseDate","MarketValueDate","BookValue","ValueYTM","ValGains","PreAcqSC","PreAcqFC","Country","AssetLia","LastMarketValue","LastMarketValue"]
["Placements of Deposits","CSH","KFHICASH","RPE*MYR*KUWAIT",3000000,3000764.38,3000764.38,1,41547,3000000,3000000,764.38,764.38,0,0,0,"KFH iCash Investment Fund","MYR",365,"KF","RPE*MYR*KUWAIT","MYR","CSH","Cash","Money Market Placement",null,null,null,null,null,"KUWAITFIN","Kuwait Finance House (Malaysia) Berhad","Ringgit Malaysia","MONEY MARKET",1,0,0,0,0,"",1,"Kuwait Fin","N/A",null,null,null,null,"Wakalah","MohdZul","MY",null,"KFH iCash Investment Fund",null,3000627.94,"N/A","RPE","Wakalah"," ","0","0","0","0","0","0","N/A"," "," "," "," "," "," "," ","False",1,96,0,4,100.00454704824217,3.1E-2,41515,41517,3000764.38,0,509.59,0,0,"Malaysia","Assets",0]
["Cash And Equivalent","TBI","KFHICASH","TradeDrVal",0,0,0,1,401769,0,0,0,0,0,0,0,"KFH iCash Investment Fund","MYR",365,"KF","","MYR","TBI","Cash And Equivalent","",null,null,null,null,null,null,null,null,"CASH AND EQUIVALENT",1,0,0,0,null,"",null,null,null,null,null,null,null,"Debtor Broker","MohdZul",null,null,"KFH iCash Investment Fund",null,3000627.94,"N/A",null,null," ","0","0","0","0","0","0","N/A"," "," "," "," "," "," "," ","False",1,null,0,5,0,0,401769,401769,0,0,0,0,0,"-","Liabilities",0]
["Cash And Equivalent","TBI","KFHICASH","TradeCrVal",0,0,0,1,401769,0,0,0,0,0,0,0,"KFH iCash Investment Fund","MYR",365,"KF","","MYR","TBI","Cash And Equivalent","",null,null,null,null,null,null,null,null,"CASH AND EQUIVALENT",1,0,0,0,null,"",null,null,null,null,null,null,null,"Creditor Broker","MohdZul",null,null,"KFH iCash Investment Fund",null,3000627.94,"N/A",null,null," ","0","0","0","0","0","0","N/A"," "," "," "," "," "," "," ","False",1,null,0,5,0,0,401769,401769,0,0,0,0,0,"-","Liabilities",0]
["Cash And Equivalent","TBI","KFHICASH","MngDb",0,0,0,1,401769,0,0,0,0,0,0,0,"KFH iCash Investment Fund","MYR",365,"KF","","MYR","TBI","Cash And Equivalent","",null,null,null,null,null,null,null,null,"CASH AND EQUIVALENT",1,0,0,0,null,"",null,null,null,null,null,null,null,"Others","MohdZul",null,null,"KFH iCash Investment Fund",null,3000627.94,"N/A",null,null," ","0","0","0","0","0","0","N/A"," "," "," "," "," "," "," ","False",1,null,0,5,0,0,401769,401769,0,0,0,0,0,"-","Liabilities",0]
["Cash And Equivalent","TBI","KFHICASH","MngCr",0,0,0,1,401769,0,0,0,0,0,0,0,"KFH iCash Investment Fund","MYR",365,"KF","","MYR","TBI","Cash And Equivalent","",null,null,null,null,null,null,null,null,"CASH AND EQUIVALENT",1,0,0,0,null,"",null,null,null,null,null,null,null,"Others","MohdZul",null,null,"KFH iCash Investment Fund",null,3000627.94,"N/A",null,null," ","0","0","0","0","0","0","N/A"," "," "," "," "," "," "," ","False",1,null,0,5,0,0,401769,401769,0,0,0,0,0,"-","Liabilities",0]
["Cash And Equivalent","TBI","KFHICASH","DivVal",0,0,0,1,401769,0,0,0,0,0,0,0,"KFH iCash Investment Fund","MYR",365,"KF","","MYR","TBI","Cash And Equivalent","",null,null,null,null,null,null,null,null,"CASH AND EQUIVALENT",1,0,0,0,null,"",null,null,null,null,null,null,null,"Dividend Receivable","MohdZul",null,null,"KFH iCash Investment Fund",null,3000627.94,"N/A",null,null," ","0","0","0","0","0","0","N/A"," "," "," "," "," "," "," ","False",1,null,0,5,0,0,401769,401769,0,0,0,0,0,"-","Liabilities",0]
["Cash And Equivalent","TBI","KFHICASH","DivTaxRec",0,0,0,1,401769,0,0,0,0,0,0,0,"KFH iCash Investment Fund","MYR",365,"KF","","MYR","TBI","Cash And Equivalent","",null,null,null,null,null,null,null,null,"CASH AND EQUIVALENT",1,0,0,0,null,"",null,null,null,null,null,null,null,"Others","MohdZul",null,null,"KFH iCash Investment Fund",null,3000627.94,"N/A",null,null," ","0","0","0","0","0","0","N/A"," "," "," "," "," "," "," ","False",1,null,0,5,0,0,401769,401769,0,0,0,0,0,"-","Liabilities",0]
["Cash And Equivalent","TBI","KFHICASH","OtherDbVal",0,0,0,1,401769,0,0,0,0,0,0,0,"KFH iCash Investment Fund","MYR",365,"KF","","MYR","TBI","Cash And Equivalent","",null,null,null,null,null,null,null,null,"CASH AND EQUIVALENT",1,0,0,0,null,"",null,null,null,null,null,null,null,"Others","MohdZul",null,null,"KFH iCash Investment Fund",null,3000627.94,"N/A",null,null," ","0","0","0","0","0","0","N/A"," "," "," "," "," "," "," ","False",1,null,0,5,0,0,401769,401769,0,0,0,0,0,"-","Liabilities",0]
["Cash And Equivalent","TBI","KFHICASH","OtherCrVal",0,-7000,-7000,1,401769,-7000,0,0,0,0,0,0,"KFH iCash Investment Fund","MYR",365,"KF","","MYR","TBI","Cash And Equivalent","",null,null,null,null,null,null,null,null,"CASH AND EQUIVALENT",1,0,0,0,null,"",null,null,null,null,null,null,null,"Others","MohdZul",null,null,"KFH iCash Investment Fund",null,3000627.94,"N/A",null,null," ","0","0","0","0","0","0","N/A"," "," "," "," "," "," "," ","False",1,null,0,5,-0.23328450377623292,0,401769,401769,0,0,0,0,0,"-","Liabilities",0]
{"$rows_left_out":14}
{"sheet":"InFund","index":13,"n_rows":488,"n_cols":86,"rows_kept":488,"cut":false,"hidden":true,"merged":[]}
[]
["qFundCode","FundName","FundCurrency","AltFundCode","StartDate","Status","MaxUnits","ManagerFee","SwitchFlag","qFundComCategory","qTrailerComType","PriceRounding","FeederManager","FeederCom","FeederTrailerRate","qFundClassCode","qFundType","qFundStructure","FundUniverse","IslamicFlag","Benchmark","FundTenure","Manager","Trustee","Custodian","SubCustodian","qBankAccountCode","SettlementLag","LaunchDate","MinFundSize","MinInvestment","MinAccBalance","InitialOfferPeriod","MaturityDate","FinancialYearEnd","DistributionPolicy","InvestmentPolicy","TrailerRate1","TrailerRate2","LastKeyInBy","LastKeyInDate","ForeignFlag","UTFlag","FG1","FG2","ContactPerson","Address","qCity","PostCode","qState","qCountry","Email","Website","Tel","Fax","IC","KWSPCode","qIndexBenchmark","qIndexBenchmarkPlus","StampDutyFlag","Islamic","ValuationMethod","FundCycle","qModalCode","BondProcess","ExtBnkAcc","PayMgtFeeFlag","PayOthFeeFlag","HiddenName1","HiddenName2","HiddenAdd1","HiddenAdd2","HiddenAdd3","UPCapSettLeg","KeyInDate","KeyInBy","ExpFlag","MonitorFlag","RollEOYFlag","SkipLimitCheck","FundCountryID","MaxPriceRise","MaxPriceFall","EndInitOffPeriod","InitOffPrice","qStrategyCode"]
["1","AFFIN EQUITY FUND","MYR","N/A","2013-05-28","A",1,1,false,"FC1","A",0,"DDD",1,1,"B","A","E","Domestic",false,"A",1,"AAA","BBB","CCC","CCC","2",1,"2013-05-28",1,1,1,"2013-05-28","2013-05-28","2013-05-28","a","a",0,0,"Admin",41443.718565162038,1,0,"","","AL-KABIR BIN MOHD ALI","SUITE 4.01,4TH FLOOR WISMA ALI BAWAL 2,NO 11,JALAN TANDANG,46050 PETALING JAYA","SEPJ","46050           ","SEL","MY","alkabir@hamodal.com.my","","012-2626021                                                                                                                                           ","                                                                                                                                                      ","790622-10-6029","","KLSER",0,0,0,0,0,"",0,"N/A",0,0,"","","","","",0,41109.743133067132,"mazuin",false,1,1,false,"MY",0,0,40922,0,"DF"]
["KFHICASH","KFH iCash Investment Fund","MYR","KFHICASH","2013-01-01","A",1000000,1,false,"FC1","A",0,"DDD",1,0,"B","A","E","Domestic",false,"A",1,"AAA","BBB","CCC","CCC","2",1,"2013-01-01",1000,1000,1000,"2013-01-01","3000-01-01","3000-01-01","a","a",1E-3,0,"Admin",41514.497222106482,1,0,"","","BAY BEE CHOO","A-04-09, CEMARA APARTMENT, JALAN SP3, 56000 KUALA LUMPUR."," KL","56000           "," ","MY","","","012-2279397                                                                                                                                           ","                                                                                                                                                      ","521213-08-5778","","KLCI",0,0,0,0,0,"",0,"N/A",0,0,"N/A","N/A","N/A","N/A","N/A",0,41341.626405671297,"admin",false,1,0,false,"MY",0,0,2,0,"DF"]
[null,null,null,null,null,null,null,null,null,null,null,null,null,null,null,null,null,null,null,null,null,null,null,null,null,null,1,"2010-01-01",1000,10,10,"2010-01-01","2010-01-01","2010-01-01","A","A","mich",40179,0,"NOFEE","NOFEE",1,0,"","","BOEY CHEE KEONG","76 JALAN DAWN INAI 15, SUNWAY SPK, DAMANSARA ","KL","52200           ","WP","MY","","","012-3300834                                                                                                                                           ","                                                                                                                                                      ","761012-07-5437","boey1012@yahoo.com.my","KLCI",0,0,0,0,0,"",0,"N/A",0,0,"N/A","N/A","N/A","N/A","N/A",0,40928.516229745372,"mazuin",false,1,0,false,"MY",0,0,2,0,"DF"]
[null,null,null,null,null,null,null,null,null,null,null,null,null,null,null,null,null,null,null,null,null,null,null,null,null,null,1,"2010-01-01",1000,10,10,"2010-01-01","2010-01-01","2010-01-01","A","A","mich",40179,0,"NOFEE","NOFEE",1,0,"","","CHUA ENG HUI","75B, JALAN KEDAI BARU, BUKIT PASIR, MUAR, JOHAR"," ","84300           "," ","MY","","","012-6287233                                                                                                                                           ","                                                                                                                                                      ","561019-01-6337","","KLCI",0,0,0,0,0,"",0,"N/A",0,0,"N/A","N/A","N/A","N/A","N/A",0,40855.660833333335,"ken",false,1,0,false,"MY",0,0,2,0,"DF"]
[null,null,null,null,null,null,null,null,null,null,null,null,null,null,null,null,null,null,null,null,null,null,null,null,null,null,1,"2010-01-01",1000,10,10,"2010-01-01","2010-01-01","2010-01-01","A","A","leann",41368.662719907406,0,"NOFEE","NOFEE",1,0,"","","CHARMAINE LAI SHU MING","TB-06-6, KEN DAMANSARA CONDOMINIUM, JALAN SS2/72, 47300 PETALING JAYA, SELANGOR"," PJ","47300           ","SEL","MY","charmainelai@gmail.com","","012-3272977                                                                                                                                           ","                                                                                                                                                      ","820616-10-5702","","KLCI",0,0,0,0,0,"",0,"N/A",0,0,"N/A","N/A","N/A","N/A","N/A",0,40855.635752314818,"ken",false,1,0,false,"MY",0,0,2,0,"DF"]
[null,null,null,null,null,null,null,null,null,null,null,null,null,null,null,null,null,null,null,null,null,null,null,null,null,null,1,"2010-01-01",1000,10,10,"2010-01-01","2010-01-01","2010-01-01","A","A","leann",41358.635162037041,0,"NOFEE","NOFEE",1,0,"","","CHEN HOCK MEET","2-12-2, ENDAH VILLA CONDO, JLN 2/149B, TMN SRI ENDAH, SRI PETALING"," ","57000           ","KL","MY","","","012-6514008                                                                                                                                           ","                                                                                                                                                      ","740406-06-5386","","KLCI",0,0,0,0,0,"",0,"N/A",0,0,"N/A","N/A","N/A","N/A","N/A",0,40855.636018518519,"ken",false,1,0,false,"MY",0,0,2,0,"DF"]
[null,null,null,null,null,null,null,null,null,null,null,null,null,null,null,null,null,null,null,null,null,null,null,null,null,null,1,"2010-01-01",1000,10,10,"2010-01-01","2010-01-01","2010-01-01","A","A","leann",41351.46429398148,0,"NOFEE","NOFEE",1,0,"","","CHONG HIN SANG","NO.8 JLN. A, JALAN JAMBU DI JALAN KUCHING","KL","52000           ","WP","MY","","","012-3223928, 03-62573712                                                                                                                              ","                                                                                                                                                      ","500828-10-5285","","KLCI",0,0,0,0,0,"",0,"N/A",0,0,"N/A","N/A","N/A","N/A","N/A",0,40855.636261574073,"ken",false,1,0,false,"MY",0,0,2,0,"DF"]
[null,null,null,null,null,null,null,null,null,null,null,null,null,null,null,null,null,null,null,null,null,null,null,null,null,null,1,"2010-01-01",1000,10,10,"2010-01-01","2010-01-01","2010-01-01","A","A","mich",40179,0,"NOFEE","NOFEE",1,0,"","","CHOO KWEE CHIN","NO.5, LORONG 2, JALAN PE16A, TAMAN PAYA EMAS, MELAKA ","MK","75250           ","MLK","MY","ckweechin@yahoo.com","","012-6181108                                                                                                                                           ","                                                                                                                                                      ","731002-04-5392","","KLCI",0,0,0,0,0,"",0,"N/A",0,0,"N/A","N/A","N/A","N/A","N/A",0,41145.743522453704,"jessica",false,1,0,false,"MY",0,0,2,0,"DF"]
{"$rows_left_out":479}
{"sheet":"InAccByFundHst","index":14,"n_rows":30,"n_cols":38,"rows_kept":30,"cut":false,"hidden":true,"merged":[]}
[]
["number","AccountCAT","unit","amt","category","qFundCode",null,null,null,null,null,null,null,null,null,null,null,null,null,null,null,null,null,null,null,null,"SettlementLag","LaunchDate","MinFundSize","MinInvestment","MinAccBalance","InitialOfferPeriod","MaturityDate","FinancialYearEnd","DistributionPolicy","InvestmentPolicy","LastKeyInBy","LastKeyInDate"]
[1,"CUTAInst","00:00:00","00:00:00","CUTAInst","KFHICASH",null,null,null,null,null,null,null,null,null,null,null,null,null,null,null,null,null,null,null,null,1,"2010-01-01",1000,10,10,"2010-01-01","2010-01-01","2010-01-01","A","A","mich",40179]
[1,"IntNRP","1908-03-18","1908-03-18T15:02:52.800","IntNRP","KFHICASH",null,null,null,null,null,null,null,null,null,null,null,null,null,null,null,null,null,null,null,null,1,"2010-01-01",1000,10,10,"2010-01-01","2010-01-01","2010-01-01","A","A","admin",41380.760338969907]
[null,null,null,null,null,null,null,null,null,null,null,null,null,null,null,null,null,null,null,null,null,null,null,null,null,null,1,"2010-01-01",1000,10,10,"2010-01-01","2010-01-01","2010-01-01","A","A","mich",40179]
[null,null,null,null,null,null,null,null,null,null,null,null,null,null,null,null,null,null,null,null,null,null,null,null,null,null,1,"2010-01-01",1000,10,10,"2010-01-01","2010-01-01","2010-01-01","A","A","mich",40179]
[null,null,null,null,null,null,null,null,null,null,null,null,null,null,null,null,null,null,null,null,null,null,null,null,null,null,1,"2010-01-01",1000,10,10,"2010-01-01","2010-01-01","2010-01-01","A","A","leann",41368.662719907406]
[null,null,null,null,null,null,null,null,null,null,null,null,null,null,null,null,null,null,null,null,null,null,null,null,null,null,1,"2010-01-01",1000,10,10,"2010-01-01","2010-01-01","2010-01-01","A","A","leann",41358.635162037041]
[null,null,null,null,null,null,null,null,null,null,null,null,null,null,null,null,null,null,null,null,null,null,null,null,null,null,1,"2010-01-01",1000,10,10,"2010-01-01","2010-01-01","2010-01-01","A","A","leann",41351.46429398148]
[null,null,null,null,null,null,null,null,null,null,null,null,null,null,null,null,null,null,null,null,null,null,null,null,null,null,1,"2010-01-01",1000,10,10,"2010-01-01","2010-01-01","2010-01-01","A","A","mich",40179]
{"$rows_left_out":20}