{"text_format":"1","workbook":"xlsx","n_sheets":15,"sheets":["Riskk","Login","Main","WSMain","WSList","WS1","WS2","WS3","WS4","WS5","WS6","InTran","InInvPort","InFund","InAccByFundHst"],"not_rendered":{"charts":0,"images":39,"macros":1,"external_links":0,"defined_names":82,"comments":0,"pivot_tables":2},"unopened":[],"bounds":{"document_bytes":16777216,"sheet_cells":100000,"rows_first":2000,"rows_last":500,"rows_between":2000,"halvings":0,"cell_chars":16384,"cell_head_chars":4096},"cells_cut":0,"cells_raw":0,"read":"whole","date_system":"1900"}

{"sheet":"Riskk","index":0,"n_rows":5,"n_cols":11,"rows_kept":5,"cut":false,"hidden":true,"merged":[]}
["linda","UPSW",null,null,null,null,null,{"$f":"COUNT(H3:H20)","v":0},false]
[null,"Userid",null,null,null,null,null,"Main/sub","Caption","On Action","NewGroup"]
[3,"UserLevel"]
["2006-05-09T11:19:39","LoginTime"]
[null,"LogoutTime"]

{"sheet":"Login","index":1,"n_rows":18,"n_cols":10,"rows_kept":18,"cut":false,"hidden":false,"merged":[]}
[]
[null,"Riskk",null,null,null,null,null,"Box 389, Lot 7.16, Wisma Central, Jln Ampang, 50450 Kuala Lumpur"]
[null,"Sdn Bhd (CN 388306K)"]
[]
[]
[]
[]
[]
[null,"SC REPORT"]
[]
[]
[]
[]
[]
[]
[]
[]
[null,null,null,null,null,null,null,null,null,"`"]

{"sheet":"Main","index":2,"n_rows":18,"n_cols":11,"rows_kept":18,"cut":false,"hidden":true,"merged":[]}
["Riskk ",null,null,"Box 389, Lot 7.16, Wisma Central, Jln Ampang, 50450 Kuala Lumpur"]
["Sdn Bhd (CN 388306K)"]
[]
[]
[null,"Report Detail",null,null,null,null,null,null,null,"Sheet","Print"]
[null,"Company  :","KFH Asset Management Sdn Bhd",null,null,null,null,null,null,"WSMain","YES"]
[null,"Fund  :","KFHICASH",null,null,null,null,null,null,"WSList","YES"]
[null,"Fund Name  :",{"$f":"VLOOKUP(FundCode,InFund!$A:$D,2,0)","v":"KFH iCash Investment Fund"},null,null,null,null,null,null,"WS1","YES"]
[null,"Inception Date  :",{"$f":"TEXT(DATEVALUE(VLOOKUP(FundCode,InFund!$A:$E,5,0)),\"dd-MMM-yy\")","v":"01-Jan-13"},null,null,null,null,null,null,"WS2","YES"]
[null,"Start Of Year  :",{"$f":"EOMONTH(EOM,-MONTH(EOM))+1","v":"2013-01-01"},null,null,null,null,null,null,"WS3","YES"]
[null,"End of Last Month  :",{"$f":"EOMONTH(C12,-1)","v":"2013-07-31"},null,null,null,null,null,null,"WS4","YES"]
[null,"Report As At  :","2013-08-31",null,null,null,null,null,null,"WS5","YES"]
[null,"Index Bench Mark  :",{"$f":"VLOOKUP(FundCode,InFund!A:T,20,0)","v":false},null,null,null,null,null,null,"WS6","YES"]
[null,"Fund Currency :",{"$f":"VLOOKUP(FundCode,InFund!$A:$F,3,0)","v":"MYR"}]
[]
[]
[null,"Current Date :",{"$f":"TEXT(NOW(),\"DD-MMM-YY\")","v":"28-Jan-15"}]
[null,"Current Time :",{"$f":"TEXT(NOW(),\"HH:MM:SS\")","v":"14:41:00"}]

{"sheet":"WSMain","index":3,"n_rows":24,"n_cols":7,"rows_kept":24,"cut":false,"hidden":true,"merged":[[14,6,14,7],[13,6,13,8],[10,3,10,8]]}
[]
[null,null,null,"                                                 SECURITIES COMMISSION"]
[null,null,null,"WHOLESALE FUND RETURNS"]
[]
[{"$f":"EDATE(EOM,0)","v":"2013-08-31"},null,null,"DECLARATION/VERIFICATION FORM"]
[null,null,null,{"$f":"\"For the Month Ended \" & TEXT(EOM,\"MMM yyyy\")","v":"For the Month Ended Aug 2013"}]
[null,null,null,"Management Company ",null,{"$f":"\": \" &CompanyName","v":": KFH Asset Management Sdn Bhd"}]
[null,null,null,"Trustee  ",null,{"$f":"\": \" & VLOOKUP(FundCode,InFund!A:X,23,0)","v":": AAA"}]
[null,null,null,"Fund (s)",null,{"$f":"\": \" &FundName","v":": KFH iCash Investment Fund"}]
[]
[null,null,null,"The Capital Markets and Services Act 2007 and the Guidelines on Wholesale Funds require person(s) submitting or cause to be submitted, any statement or information to the Commission to ensure that the information submitted is not false or misleading and there is no material omission in any respects. Non-compliance with the requirement shall subject the person to the sanctions and penalties prescribed under the Act and/or the Guidelines."]
[null,null,"2007-06-12","Fund Management Company Declaration",null,null,"Designated Person Declaration"]
[]
[null,null,null,"1. The attached returns are complete, true and accurate ",null,null,"1. The attached returns are complete, true and accurate "]
[null,null,null,"    to the best of my knowledge and belief.",null,null,"     to the best of my knowledge and belief."]
[]
[null,null,null,"Signature :",null,null,"Signature :"]
[]
[]
[null,null,null,"Name :",null,null,"Name :"]
[]
[null,null,null,"Designation :",null,null,"Designation :"]
[]
[null,null,null,"Date :",null,null,"Date :"]

{"sheet":"WSList","index":4,"n_rows":18,"n_cols":8,"rows_kept":18,"cut":false,"hidden":true,"merged":[[10,3,10,8]]}
[]
[null,null,null,"                                  SECURITIES COMMISSION"]
[null,null,null,"WHOLESALE FUND RETURNS"]
[]
[null,null,null,"CHCEKLIST"]
[{"$f":"EDATE(EOM,0)","v":"2013-08-31"},null,null,{"$f":"\"For the Month Ended \" & TEXT(EOM,\"MMM yyyy\")","v":"For the Month Ended Aug 2013"}]
[]
[null,null,null,"Management Company ",null,{"$f":"\": \" &CompanyName","v":": KFH Asset Management Sdn Bhd"}]
[null,null,null,"Fund ",null,{"$f":"\": \" &FundName","v":": KFH iCash Investment Fund"}]
[]
[null,null,"2007-06-12","WHOLESALE FUND RETURNS"]
[]
[null,null,null,"WS 1",null,"Number of Accounts",null,"Y"]
[null,null,null,"WS 2",null,"Units in Circulation",null,"Y"]
[null,null,null,"WS 3",null,"Subscription and Redemption",null,"Y"]
[null,null,null,"WS 4",null,"Sales by Channels of Distribution",null,"Y"]
[null,null,null,"WS 5",null,"Profile of Unit Holders",null,"Y"]
[null,null,null,"WS 6",null,"Investment Portfolio",null,"Y"]

{"sheet":"WS1","index":5,"n_rows":17,"n_cols":15,"rows_kept":17,"cut":false,"hidden":true,"merged":[[15,3,15,14],[16,3,16,14],[11,3,12,3],[11,4,11,5],[11,6,11,7],[11,8,11,9],[11,10,11,11],[11,12,12,12],[1,3,1,14],[3,3,3,14],[9,7,9,14],[10,3,10,14],[11,13,12,13],[11,14,12,14]]}
[null,null,null,null,null,null,null,null,null,null,null,null,null,null,"WS 1"]
[null,null,null," SECURITIES COMMISSION"]
[null,null,null,"WHOLESALE FUND RETURNS"]
[]
[null,null,null,"NUMBER OF ACCOUNTS"]
[{"$f":"EDATE(EOM,0)","v":"2013-08-31"}]
[]
[null,null,null,"Management Company ",null,null,null,{"$f":"\": \" &CompanyName","v":": KFH Asset Management Sdn Bhd"}]
[null,null,null,"Name of Fund",null,null,null,{"$f":"\": \" &FundName","v":": KFH iCash Investment Fund"}]
[null,null,null,"Month Ended",null,null,null,{"$f":"\":  \" & TEXT(EOM, \"dd mmm yyyy\")","v":":  31 Aug 2013"}]
[null,null,null,"No. of Accounts"]
[null,null,null,"Individual","Institutions",null,"IUTA",null,"Others",null,"CUTA",null,"Total Individual","Total Institution","Grand Total"]
[null,null,null,null,"Related-parties","Non related-parties","Individual","Institution","Individual","Institution","Individual","Institution"]
[null,null,null,{"$f":"SUMIF(InAccByFundHst!B:B,\"Indv\",InAccByFundHst!A:A)","v":0},{"$f":"SUMIF(InAccByFundHst!B:B,\"IntRLP\",InAccByFundHst!A:A)","v":0},{"$f":"SUMIF(InAccByFundHst!B:B,\"IntNRP\",InAccByFundHst!A:A)","v":1},{"$f":"SUMIF(InAccByFundHst!B:B,\"IUTAIndv\",InAccByFundHst!A:A)","v":0},{"$f":"SUMIF(InAccByFundHst!B:B,\"IUTAInst\",InAccByFundHst!A:A)","v":0},{"$f":"SUMIF(InAccByFundHst!B:B,\"OthIndv\",InAccByFundHst!A:A)","v":0},{"$f":"SUMIF(InAccByFundHst!B:B,\"OthInst\",InAccByFundHst!A:A)","v":0},{"$f":"SUMIF(InAccByFundHst!B:B,\"CUTAIndv\",InAccByFundHst!A:A)","v":0},{"$f":"SUMIF(InAccByFundHst!B:B,\"CUTAInst\",InAccByFundHst!A:A)","v":1},{"$f":"D14+G14+I14+K14","v":0},{"$f":"E14+F14+H14+J14+L14","v":2},{"$f":"M14+N14","v":2}]
[null,null,null,"Notes:"]
[null,null,null,"1. Amounts should agree with corresponding amounts in WS 5."]
[null,null,null,"2. Include accounts held by related party IUTA on its own accord."]

{"sheet":"WS2","index":6,"n_rows":17,"n_cols":13,"rows_kept":17,"cut":false,"hidden":true,"merged":[[12,12,13,12],[16,3,16,12],[17,3,17,12],[1,3,1,12],[3,3,3,12],[9,7,9,12],[10,3,10,12],[12,3,13,3],[12,4,12,5],[11,6,11,7],[11,10,11,11],[11,8,11,9],[11,3,11,5]]}
[null,null,null,null,null,null,null,null,null,null,null,null,"WS 2"]
[null,null,null," SECURITIES COMMISSION"]
[null,null,null,"WHOLESALE FUND RETURNS"]
[]
[null,null,null,"UNITS IN CIRCULATION"]
[{"$f":"EDATE(EOM,0)","v":"2013-08-31"}]
[]
[null,null,null,"Management Company ",null,null,null,{"$f":"\": \" &CompanyName","v":": KFH Asset Management Sdn Bhd"}]
[null,null,null,"Name of Fund",null,null,null,{"$f":"\": \" &FundName","v":": KFH iCash Investment Fund"}]
[null,null,null,"Month Ended",null,null,null,{"$f":"\":  \" & TEXT(EOM, \"dd mmm yyyy\")","v":":  31 Aug 2013"}]
[null,null,null,"Units in Circulation ('000 units)"]
[null,null,null,"Fund Management Company",null,null,"IUTA",null,"CUTA",null,"Others"]
[null,null,null,"Individual","Institutions",null,null,null,null,null,null,null,"Total"]
[null,null,null,null,"Related-parties","Non related-parties","Individual","Institution","Individual","Institution","Individual","Institution"]
[null,null,null,{"$f":"SUMIF(InAccByFundHst!B:B,\"Indv\",InAccByFundHst!C:C)","v":0},{"$f":"SUMIF(InAccByFundHst!B:B,\"IntRLP\",InAccByFundHst!C:C)","v":0},{"$f":"SUMIF(InAccByFundHst!B:B,\"IntNRP\",InAccByFundHst!C:C)","v":3000},{"$f":"SUMIF(InAccByFundHst!B:B,\"IUTAIndv\",InAccByFundHst!C:C)","v":0},{"$f":"SUMIF(InAccByFundHst!B:B,\"IUTAInst\",InAccByFundHst!C:C)","v":0},{"$f":"SUMIF(InAccByFundHst!B:B,\"CUTAIndv\",InAccByFundHst!C:C)","v":0},{"$f":"SUMIF(InAccByFundHst!B:B,\"CUTAInst\",InAccByFundHst!C:C)","v":0},{"$f":"SUMIF(InAccByFundHst!B:B,\"OthIndv\",InAccByFundHst!C:C)","v":0},{"$f":"SUMIF(InAccByFundHst!B:B,\"OthInst\",InAccByFundHst!C:C)","v":0},{"$f":"D15+E15+F15+G15+H15+I15+J15+K15+L15","v":3000}]
[null,null,null,"Notes:"]
[null,null,null,"1. Amounts should agree with corresponding amounts in WS 5."]

{"sheet":"WS3","index":7,"n_rows":16,"n_cols":9,"rows_kept":16,"cut":false,"hidden":true,"merged":[[15,3,15,8],[1,3,1,8],[3,3,3,8],[9,5,9,8],[10,3,10,4],[10,5,10,6],[2,3,2,8],[4,3,4,8],[10,7,10,8]]}
[null,null,null,null,null,null,null,null,"WS 3"]
[null,null,null,"  SECURITIES COMMISSION"]
[null,null,null,"WHOLESALE FUND RETURNS"]
[]
[null,null,null,"SUBSCRIPTION AND REDEMPTION"]
[{"$f":"EDATE(EOM,0)","v":"2013-08-31"}]
[]
[null,null,null,"Management Company ",null,{"$f":"\": \" &CompanyName","v":": KFH Asset Management Sdn Bhd"}]
[null,null,null,"Name of Fund ",null,{"$f":"\": \" &FundName","v":": KFH iCash Investment Fund"}]
[null,null,null,"Month Ended",null,{"$f":"\":  \" & TEXT(EOM, \"dd mmm yyyy\")","v":":  31 Aug 2013"}]
[null,null,null,"Subscription",null,"Redemption",null,"Net Subscription/ (Net Redemption)"]
[null,null,null,"(RM '000)","('000 units)","(RM '000)","('000 units)","(RM '000)","('000 units)"]
[null,null,null,{"$f":"SUMIF(InTran!D:D,\"UP\",InTran!B:B)","v":84500},{"$f":"SUMIF(InTran!D:D,\"UP\",InTran!C:C)","v":84500},{"$f":"SUMIF(InTran!D:D,\"UR\",InTran!B:B)","v":-81529.421499999997},{"$f":"SUMIF(InTran!D:D,\"UR\",InTran!C:C)","v":-81500},{"$f":"D13+F13","v":2970.5785000000033},{"$f":"E13+G13","v":3000}]
[]
[null,null,null,"Notes:"]
[null,null,null,"1. Figures should correspond with sales figure in WS4."]

{"sheet":"WS4","index":8,"n_rows":17,"n_cols":12,"rows_kept":17,"cut":false,"hidden":true,"merged":[[16,3,16,11],[10,3,10,4],[10,5,10,8],[10,9,11,9],[10,10,11,10],[10,11,11,11],[1,3,1,11],[3,3,3,11],[9,6,9,11],[2,3,2,11],[4,3,4,11]]}
[null,null,null,null,null,null,null,null,null,null,null,"WS 4"]
[null,null,null,"   SECURITIES COMMISSION"]
[null,null,null,"WHOLESALE FUND RETURNS"]
[]
[null,null,null,"SALES BY CHANNELS OF DISTRIBUTION"]
[{"$f":"EDATE(EOM,0)","v":"2013-08-31"}]
[]
[null,null,null,"Management Company ",null,null,{"$f":"\": \" &CompanyName","v":": KFH Asset Management Sdn Bhd"}]
[null,null,null,"Name of Fund ",null,null,{"$f":"\": \" &FundName","v":": KFH iCash Investment Fund"}]
[null,null,null,"Month Ended",null,null,{"$f":"\":  \" & TEXT(EOM, \"dd mmm yyyy\")","v":":  31 Aug 2013"}]
[null,null,null,"Fund Maangement Company",null,"IUTA",null,null,null,"CUTA               (RM '000)","Others             (RM '000)","Total Sales      (RM '000)"]
[null,null,null,"Direct                 (RM '000)","Unit Trust Consultants       (RM '000)","Bank                          (RM '000)","UTMC                        (RM '000)","Stock Broking Company                   (RM '000)","Others             (RM '000)"]
[null,null,null,{"$f":"SUMIF(InTran!A:A,\"Direct\",InTran!B:B)","v":0},{"$f":"SUMIF(InTran!A:A,\"UTCon\",InTran!B:B)","v":0},{"$f":"SUMIF(InTran!A:A,\"IUTABank\",InTran!B:B)","v":0},{"$f":"SUMIF(InTran!A:A,\"UTMC\",InTran!B:B)","v":0},{"$f":"SUMIF(InTran!A:A,\"StkBroker\",InTran!B:B)","v":0},{"$f":"SUMIF(InTran!A:A,\"IUTAOth\",InTran!B:B)","v":0},{"$f":"SUMIF(InTran!A:A,\"CUTA\",InTran!B:B)","v":-29.42149999999674},{"$f":"SUMIF(InTran!A:A,\"Oth\",InTran!B:B)","v":0},{"$f":"D13+E13+F13+G13+H13+I13+J13+K13","v":-29.42149999999674}]
[]
[null,null,null,"Notes:"]
[null,null,null,"1. Distribution via (please specify):"]
[null,null,null,"2. figures should correspond with sales figure in WS3."]

{"sheet":"WS5","index":9,"n_rows":15,"n_cols":14,"rows_kept":15,"cut":false,"hidden":true,"merged":[[1,3,1,6],[4,3,4,6],[2,3,2,6]]}
[null,null,null,null,null,null,"WS 5"]
[null,null,null,"  SECURITIES COMMISSION"]
[null,null,null,"WHOLESALE FUND RETURNS"]
[]
[null,null,null,"PROFILE OF UNIT HOLDERS"]
[{"$f":"EDATE(EOM,0)","v":"2013-08-31"}]
[]
[null,null,null,"Management Company ",null,{"$f":"\": \" & CompanyName","v":": KFH Asset Management Sdn Bhd"}]
[null,null,null,"Name of Fund",null,{"$f":"\": \" & FundName","v":": KFH iCash Investment Fund"}]
[null,null,null,"Month Ended",null,{"$f":"\": \" & TEXT(EOM,\"dd mmm yyyy\")","v":": 31 Aug 2013"},null,null,null,null,"category","(Multiple Items)"]
[null,null,null,"Category of Unit Holders","Value of Account Holding","No of Accounts","No of Units Held"]
[null,null,null,null,"(RM '000)",null,"('000 units)",null,null,null,"Row Labels","Sum of amt","Count of number","Sum of unit"]
[null,null,null,{"$f":"IF(K13=\"\",\"\",K13)","v":"CUTAInst"},0,1,0,null,null,null,"CUTAInst",0,1,0]
[null,null,null,"IntNRP",3000.6270023148149,1,3000,null,null,null,"IntNRP",3000.6270023148149,1,3000]
[null,null,null,"Total",{"$f":"IF(L15=\"\",\"\",L15)","v":3000.6270023148149},{"$f":"IF(M15=\"\",\"\",M15)","v":2},{"$f":"IF(N15=\"\",\"\",N15)","v":3000},null,null,null,"Grand Total",3000.6270023148149,2,3000]

{"sheet":"WS6","index":10,"n_rows":25,"n_cols":19,"rows_kept":25,"cut":false,"hidden":true,"merged":[[1,3,1,8],[4,3,4,8],[2,3,2,8]]}
[null,null,null,null,null,null,null,null,"WS 6"]
[null,null,null,"  SECURITIES COMMISSION"]
[null,null,null,"WHOLESALE FUND RETURNS"]
[]
[null,null,null,"INVESTMENT PORTFOLIO"]
[{"$f":"EDATE(EOM,0)","v":"2013-08-31"}]
[]
[null,null,null,"Management Company ",null,{"$f":"\": \" & CompanyName","v":": KFH Asset Management Sdn Bhd"}]
[null,null,null,"Name of Fund ",null,{"$f":"\": \" & FundName","v":": KFH iCash Investment Fund"}]
[null,null,null,"Month Ended",null,{"$f":"\": \" & TEXT(EOM,\"dd mmm yyyy\")","v":": 31 Aug 2013"}]
[null,null,null,"Class of Security","Status","Type","Exchange/Market","Country","Value "]
[null,null,null,null,null,null,null,null,"(RM '000)",null,null,"Row Labels","qRptSequence","Class","Status","StockTypeDesc","ExchgName","Country","Sum of MarketValueFC"]
[null,null,null,{"$f":"IF(N13=\"\",IF(L13 =\"\",\"\",L13),IF(N13 =\"Cash And Equivalent\",\"Liabilities\",IF(N13 =\"Cash And Equivalent Total\",\"Liabilities Total\",N13)))","v":"Placements of Deposits"},{"$f":"IF(M13=5,\"\",IF(O13=\"\",\"\",O13))","v":"N/A"},{"$f":"IF(P13=\"\",\"\",P13)","v":"Wakalah"},{"$f":"IF(M13=5,\"\",IF(Q13=\"\",\"\",Q13))","v":"N/A"},{"$f":"IF(M13=5,\"\",IF(R13=\"\",\"\",R13))","v":"Malaysia"},{"$f":"IF(S13=\"\",\"\",S13/1000)","v":3000.7643800000001},null,null,"Assets",4,"Placements of Deposits","N/A","Wakalah","N/A","Malaysia",3000764.38]
[null,null,null,"Placements of Deposits Total","","","","",3000.7643800000001,null,null,null,4,"Placements of Deposits Total",null,null,null,null,3000764.38]
[null,null,null,"Assets Total","","","","",3000.7643800000001,null,null,"Assets Total",null,null,null,null,null,null,3000764.38]
[null,null,null,"Liabilities","","Debtor Broker","","",0,null,null,"Liabilities",5,"Cash And Equivalent","N/A","Debtor Broker","N/A","-",0]
[null,null,null,"","","Creditor Broker","","",0,null,null,null,5,null,null,"Creditor Broker","N/A","-",0]
[null,null,null,"","","Others","","",-9.7567200000000014,null,null,null,5,null,null,"Others","N/A","-",-9756.7200000000012]
[null,null,null,"","","Dividend Receivable","","",0,null,null,null,5,null,null,"Dividend Receivable","N/A","-",0]
[null,null,null,"","","Tax Payable","","",0,null,null,null,5,null,null,"Tax Payable","N/A","-",0]
[null,null,null,"","","Bank Balance","","",9.6202800000000011,null,null,null,5,null,null,"Bank Balance","N/A","-",9620.2800000000007]
[null,null,null,"","","Bank Balance - Foreign","","",0,null,null,null,5,null,null,"Bank Balance - Foreign","N/A","-",0]
[null,null,null,"Liabilities Total","","","","",-0.13644000000000051,null,null,null,5,"Cash And Equivalent Total",null,null,null,null,-136.44000000000051]
[null,null,null,"NET ASSET VALUE (NAV)","","","","",3000.6279399999994,null,null,"Liabilities Total",null,null,null,null,null,null,-136.44000000000051]
[null,null,null,null,"","","","",null,null,null,"Grand Total",null,null,null,null,null,null,3000627.9399999995]

{"sheet":"InTran","index":11,"n_rows":4,"n_cols":6,"rows_kept":4,"cut":false,"hidden":true,"merged":[]}
["qAgentType","GrossProceed","Units","qTrnCode","ValueDate","qFundCode"]
["CUTA",81500,81500,"UP","2013-08-23","KFHICASH"]
["CUTA",-81529.421499999997,-81500,"UR","2013-08-27","KFHICASH"]
["N/A",3000,3000,"UP","2013-08-28","KFHICASH"]

{"sheet":"InInvPort","index":12,"n_rows":23,"n_cols":90,"rows_kept":23,"cut":false,"hidden":true,"merged":[]}
["Class","qProductType","qFundCode","qStockCode","UnitFaceValue","MarketValueSC","MarketValueFC","ExchangeRate","MaturityDateCSH","CostFC","CostSC","AccruedInterestFC","AccruedInterestSC","UnrealisedGainsStock","UnrealisedGainsExchg","PriceCurr","FundName","FundCurrency","MaxTenor","qCompanyID","StockName","StockCurrency","qAssetClass","AssetClassDesc","SectorName","Frequency","ExcelBasis","Coupon","MaturityDateBND","Term","qCPCode","CPName","CurrencyName","ProductTypeDesc","EQTSource","AmortAccreation","ExPreAcq","ExPreAcqSC","IssuedSize","Exchange","IslamicFlag","IssuerName","IssuerGrpName","qStockType","Board","qBondType","BndDesc","StockTypeDesc","qManagerCode","qCountryID","FreezeUnit","FundDesc","RatingUsed","NAV","ExchgName","qCshType","CshTypeDesc","CashFlag","DebitAmtSC","CreditAmtSC","ConsoTotalSC","DebitAmtFC","CreditAmtFC","ConsoTotalFC","Status","RptGrpDesc","qRptGrp1ID","RptGrp1Desc","qRptGrp2ID","RptGrp2Desc","ShortGL","GLCode","ValuationGL","UTFlag","qKLSESector","ValuationMethod","qRptSequence","fPercNAV","PurchaseYTM","PurchaseDate","MarketValueDate","BookValue","ValueYTM","ValGains","PreAcqSC","PreAcqFC","Country","AssetLia","LastMarketValue","LastMarketValue"]
["Placements of Deposits","CSH","KFHICASH","RPE*MYR*KUWAIT",3000000,3000764.38,3000764.38,1,41547,3000000,3000000,764.38,764.38,0,0,0,"KFH iCash Investment Fund","MYR",365,"KF","RPE*MYR*KUWAIT","MYR","CSH","Cash","Money Market Placement",null,null,null,null,null,"KUWAITFIN","Kuwait Finance House (Malaysia) Berhad","Ringgit Malaysia","MONEY MARKET",1,0,0,0,0,"",1,"Kuwait Fin","N/A",null,null,null,null,"Wakalah","MohdZul","MY",null,"KFH iCash Investment Fund",null,3000627.94,"N/A","RPE","Wakalah"," ","0","0","0","0","0","0","N/A"," "," "," "," "," "," "," ","False",1,96,0,4,100.00454704824217,3.1E-2,41515,41517,3000764.38,0,509.59,0,0,"Malaysia","Assets",0]
["Cash And Equivalent","TBI","KFHICASH","TradeDrVal",0,0,0,1,401769,0,0,0,0,0,0,0,"KFH iCash Investment Fund","MYR",365,"KF","","MYR","TBI","Cash And Equivalent","",null,null,null,null,null,null,null,null,"CASH AND EQUIVALENT",1,0,0,0,null,"",null,null,null,null,null,null,null,"Debtor Broker","MohdZul",null,null,"KFH iCash Investment Fund",null,3000627.94,"N/A",null,null," ","0","0","0","0","0","0","N/A"," "," "," "," "," "," "," ","False",1,null,0,5,0,0,401769,401769,0,0,0,0,0,"-","Liabilities",0]
["Cash And Equivalent","TBI","KFHICASH","TradeCrVal",0,0,0,1,401769,0,0,0,0,0,0,0,"KFH iCash Investment Fund","MYR",365,"KF","","MYR","TBI","Cash And Equivalent","",null,null,null,null,null,null,null,null,"CASH AND EQUIVALENT",1,0,0,0,null,"",null,null,null,null,null,null,null,"Creditor Broker","MohdZul",null,null,"KFH iCash Investment Fund",null,3000627.94,"N/A",null,null," ","0","0","0","0","0","0","N/A"," "," "," "," "," "," "," ","False",1,null,0,5,0,0,401769,401769,0,0,0,0,0,"-","Liabilities",0]
["Cash And Equivalent","TBI","KFHICASH","MngDb",0,0,0,1,401769,0,0,0,0,0,0,0,"KFH iCash Investment Fund","MYR",365,"KF","","MYR","TBI","Cash And Equivalent","",null,null,null,null,null,null,null,null,"CASH AND EQUIVALENT",1,0,0,0,null,"",null,null,null,null,null,null,null,"Others","MohdZul",null,null,"KFH iCash Investment Fund",null,3000627.94,"N/A",null,null," ","0","0","0","0","0","0","N/A"," "," "," "," "," "," "," ","False",1,null,0,5,0,0,401769,401769,0,0,0,0,0,"-","Liabilities",0]
["Cash And Equivalent","TBI","KFHICASH","MngCr",0,0,0,1,401769,0,0,0,0,0,0,0,"KFH iCash Investment Fund","MYR",365,"KF","","MYR","TBI","Cash And Equivalent","",null,null,null,null,null,null,null,null,"CASH AND EQUIVALENT",1,0,0,0,null,"",null,null,null,null,null,null,null,"Others","MohdZul",null,null,"KFH iCash Investment Fund",null,3000627.94,"N/A",null,null," ","0","0","0","0","0","0","N/A"," "," "," "," "," "," "," ","False",1,null,0,5,0,0,401769,401769,0,0,0,0,0,"-","Liabilities",0]
["Cash And Equivalent","TBI","KFHICASH","DivVal",0,0,0,1,401769,0,0,0,0,0,0,0,"KFH iCash Investment Fund","MYR",365,"KF","","MYR","TBI","Cash And Equivalent","",null,null,null,null,null,null,null,null,"CASH AND EQUIVALENT",1,0,0,0,null,"",null,null,null,null,null,null,null,"Dividend Receivable","MohdZul",null,null,"KFH iCash Investment Fund",null,3000627.94,"N/A",null,null," ","0","0","0","0","0","0","N/A"," "," "," "," "," "," "," ","False",1,null,0,5,0,0,401769,401769,0,0,0,0,0,"-","Liabilities",0]
["Cash And Equivalent","TBI","KFHICASH","DivTaxRec",0,0,0,1,401769,0,0,0,0,0,0,0,"KFH iCash Investment Fund","MYR",365,"KF","","MYR","TBI","Cash And Equivalent","",null,null,null,null,null,null,null,null,"CASH AND EQUIVALENT",1,0,0,0,null,"",null,null,null,null,null,null,null,"Others","MohdZul",null,null,"KFH iCash Investment Fund",null,3000627.94,"N/A",null,null," ","0","0","0","0","0","0","N/A"," "," "," "," "," "," "," ","False",1,null,0,5,0,0,401769,401769,0,0,0,0,0,"-","Liabilities",0]
["Cash And Equivalent","TBI","KFHICASH","OtherDbVal",0,0,0,1,401769,0,0,0,0,0,0,0,"KFH iCash Investment Fund","MYR",365,"KF","","MYR","TBI","Cash And Equivalent","",null,null,null,null,null,null,null,null,"CASH AND EQUIVALENT",1,0,0,0,null,"",null,null,null,null,null,null,null,"Others","MohdZul",null,null,"KFH iCash Investment Fund",null,3000627.94,"N/A",null,null," ","0","0","0","0","0","0","N/A"," "," "," "," "," "," "," ","False",1,null,0,5,0,0,401769,401769,0,0,0,0,0,"-","Liabilities",0]
["Cash And Equivalent","TBI","KFHICASH","OtherCrVal",0,-7000,-7000,1,401769,-7000,0,0,0,0,0,0,"KFH iCash Investment Fund","MYR",365,"KF","","MYR","TBI","Cash And Equivalent","",null,null,null,null,null,null,null,null,"CASH AND EQUIVALENT",1,0,0,0,null,"",null,null,null,null,null,null,null,"Others","MohdZul",null,null,"KFH iCash Investment Fund",null,3000627.94,"N/A",null,null," ","0","0","0","0","0","0","N/A"," "," "," "," "," "," "," ","False",1,null,0,5,-0.23328450377623292,0,401769,401769,0,0,0,0,0,"-","Liabilities",0]
["Cash And Equivalent","TBI","KFHICASH","TaxProvVal",0,0,0,1,401769,0,0,0,0,0,0,0,"KFH iCash Investment Fund","MYR",365,"KF","","MYR","TBI","Cash And Equivalent","",null,null,null,null,null,null,null,null,"CASH AND EQUIVALENT",1,0,0,0,null,"",null,null,null,null,null,null,null,"Others","MohdZul",null,null,"KFH iCash Investment Fund",null,3000627.94,"N/A",null,null," ","0","0","0","0","0","0","N/A"," "," "," "," "," "," "," ","False",1,null,0,5,0,0,401769,401769,0,0,0,0,0,"-","Liabilities",0]
["Cash And Equivalent","TBI","KFHICASH","DefTaxProvVal",0,0,0,1,401769,0,0,0,0,0,0,0,"KFH iCash Investment Fund","MYR",365,"KF","","MYR","TBI","Cash And Equivalent","",null,null,null,null,null,null,null,null,"CASH AND EQUIVALENT",1,0,0,0,null,"",null,null,null,null,null,null,null,"Others","MohdZul",null,null,"KFH iCash Investment Fund",null,3000627.94,"N/A",null,null," ","0","0","0","0","0","0","N/A"," "," "," "," "," "," "," ","False",1,null,0,5,0,0,401769,401769,0,0,0,0,0,"-","Liabilities",0]
["Cash And Equivalent","TBI","KFHICASH","ProvDistVal",0,0,0,1,401769,0,0,0,0,0,0,0,"KFH iCash Investment Fund","MYR",365,"KF","","MYR","TBI","Cash And Equivalent","",null,null,null,null,null,null,null,null,"CASH AND EQUIVALENT",1,0,0,0,null,"",null,null,null,null,null,null,null,"Others","MohdZul",null,null,"KFH iCash Investment Fund",null,3000627.94,"N/A",null,null," ","0","0","0","0","0","0","N/A"," "," "," "," "," "," "," ","False",1,null,0,5,0,0,401769,401769,0,0,0,0,0,"-","Liabilities",0]
["Cash And Equivalent","TBI","KFHICASH","MngFee_BF",0,-2309.2800000000002,-2309.2800000000002,1,401769,-2309.2800000000002,0,0,0,0,0,0,"KFH iCash Investment Fund","MYR",365,"KF","","MYR","TBI","Cash And Equivalent","",null,null,null,null,null,null,null,null,"CASH AND EQUIVALENT",1,0,0,0,null,"",null,null,null,null,null,null,null,"Others","MohdZul",null,null,"KFH iCash Investment Fund",null,3000627.94,"N/A",null,null," ","0","0","0","0","0","0","N/A"," "," "," "," "," "," "," ","False",1,null,0,5,-7.695989126862561E-2,0,401769,401769,0,0,0,0,0,"-","Liabilities",0]
["Cash And Equivalent","TBI","KFHICASH","MngFeeRebate_BF",0,0,0,1,401769,0,0,0,0,0,0,0,"KFH iCash Investment Fund","MYR",365,"KF","","MYR","TBI","Cash And Equivalent","",null,null,null,null,null,null,null,null,"CASH AND EQUIVALENT",1,0,0,0,null,"",null,null,null,null,null,null,null,"Others","MohdZul",null,null,"KFH iCash Investment Fund",null,3000627.94,"N/A",null,null," ","0","0","0","0","0","0","N/A"," "," "," "," "," "," "," ","False",1,null,0,5,0,0,401769,401769,0,0,0,0,0,"-","Liabilities",0]
["Cash And Equivalent","TBI","KFHICASH","TrusteeFee_BF",0,-228.24,-228.24,1,401769,-228.24,0,0,0,0,0,0,"KFH iCash Investment Fund","MYR",365,"KF","","MYR","TBI","Cash And Equivalent","",null,null,null,null,null,null,null,null,"CASH AND EQUIVALENT",1,0,0,0,null,"",null,null,null,null,null,null,null,"Others","MohdZul",null,null,"KFH iCash Investment Fund",null,3000627.94,"N/A",null,null," ","0","0","0","0","0","0","N/A"," "," "," "," "," "," "," ","False",1,null,0,5,-7.6064078774124863E-3,0,401769,401769,0,0,0,0,0,"-","Liabilities",0]
["Cash And Equivalent","TBI","KFHICASH","AuditorFee_BF",0,-219.2,-219.2,1,401769,-219.2,0,0,0,0,0,0,"KFH iCash Investment Fund","MYR",365,"KF","","MYR","TBI","Cash And Equivalent","",null,null,null,null,null,null,null,null,"CASH AND EQUIVALENT",1,0,0,0,null,"",null,null,null,null,null,null,null,"Others","MohdZul",null,null,"KFH iCash Investment Fund",null,3000627.94,"N/A",null,null," ","0","0","0","0","0","0","N/A"," "," "," "," "," "," "," ","False",1,null,0,5,-7.3051376039643227E-3,0,401769,401769,0,0,0,0,0,"-","Liabilities",0]
["Cash And Equivalent","TBI","KFHICASH","CustodianFee_BF",0,0,0,1,401769,0,0,0,0,0,0,0,"KFH iCash Investment Fund","MYR",365,"KF","","MYR","TBI","Cash And Equivalent","",null,null,null,null,null,null,null,null,"CASH AND EQUIVALENT",1,0,0,0,null,"",null,null,null,null,null,null,null,"Others","MohdZul",null,null,"KFH iCash Investment Fund",null,3000627.94,"N/A",null,null," ","0","0","0","0","0","0","N/A"," "," "," "," "," "," "," ","False",1,null,0,5,0,0,401769,401769,0,0,0,0,0,"-","Liabilities",0]
["Cash And Equivalent","TBI","KFHICASH","BrokerageFee_BF",0,0,0,1,401769,0,0,0,0,0,0,0,"KFH iCash Investment Fund","MYR",365,"KF","","MYR","TBI","Cash And Equivalent","",null,null,null,null,null,null,null,null,"CASH AND EQUIVALENT",1,0,0,0,null,"",null,null,null,null,null,null,null,"Others","MohdZul",null,null,"KFH iCash Investment Fund",null,3000627.94,"N/A",null,null," ","0","0","0","0","0","0","N/A"," "," "," "," "," "," "," ","False",1,null,0,5,0,0,401769,401769,0,0,0,0,0,"-","Liabilities",0]
["Cash And Equivalent","TBI","KFHICASH","OthVal",0,0,0,1,401769,0,0,0,0,0,0,0,"KFH iCash Investment Fund","MYR",365,"KF","","MYR","TBI","Cash And Equivalent","",null,null,null,null,null,null,null,null,"CASH AND EQUIVALENT",1,0,0,0,null,"",null,null,null,null,null,null,null,"Others","MohdZul",null,null,"KFH iCash Investment Fund",null,3000627.94,"N/A",null,null," ","0","0","0","0","0","0","N/A"," "," "," "," "," "," "," ","False",1,null,0,5,0,0,401769,401769,0,0,0,0,0,"-","Liabilities",0]
["Cash And Equivalent","TBI","KFHICASH","TaxVal",0,0,0,1,401769,0,0,0,0,0,0,0,"KFH iCash Investment Fund","MYR",365,"KF","","MYR","TBI","Cash And Equivalent","",null,null,null,null,null,null,null,null,"CASH AND EQUIVALENT",1,0,0,0,null,"",null,null,null,null,null,null,null,"Tax Payable","MohdZul",null,null,"KFH iCash Investment Fund",null,3000627.94,"N/A",null,null," ","0","0","0","0","0","0","N/A"," "," "," "," "," "," "," ","False",1,null,0,5,0,0,401769,401769,0,0,0,0,0,"-","Liabilities",0]
["Cash And Equivalent","TBI","KFHICASH","BankVal",0,9620.2800000000007,9620.2800000000007,1,401769,9620.2800000000007,0,0,0,0,0,0,"KFH iCash Investment Fund","MYR",365,"KF","","MYR","TBI","Cash And Equivalent","",null,null,null,null,null,null,null,null,"CASH AND EQUIVALENT",1,0,0,0,null,"",null,null,null,null,null,null,null,"Bank Balance","MohdZul",null,null,"KFH iCash Investment Fund",null,3000627.94,"N/A",null,null," ","0","0","0","0","0","0","N/A"," "," "," "," "," "," "," ","False",1,null,0,5,0.32060889228405975,0,401769,401769,0,0,0,0,0,"-","Liabilities",0]
["Cash And Equivalent","TBI","KFHICASH","BankVal-FX",0,0,0,1,401769,0,0,0,0,0,0,0,"KFH iCash Investment Fund","MYR",365,"KF","","MYR","TBI","Cash And Equivalent","",null,null,null,null,null,null,null,null,"CASH AND EQUIVALENT",1,0,0,0,null,"",null,null,null,null,null,null,null,"Bank Balance - Foreign","MohdZul",null,null,"KFH iCash Investment Fund",null,3000627.94,"N/A",null,null," ","0","0","0","0","0","0","N/A"," "," "," "," "," "," "," ","False",1,null,0,5,0,0,401769,401769,0,0,0,0,0,"-","Liabilities",0]

{"sheet":"InFund","index":13,"n_rows":488,"n_cols":86,"rows_kept":488,"cut":false,"hidden":true,"merged":[]}
[]
["qFundCode","FundName","FundCurrency","AltFundCode","StartDate","Status","MaxUnits","ManagerFee","SwitchFlag","qFundComCategory","qTrailerComType","PriceRounding","FeederManager","FeederCom","FeederTrailerRate","qFundClassCode","qFundType","qFundStructure","FundUniverse","IslamicFlag","Benchmark","FundTenure","Manager","Trustee","Custodian","SubCustodian","qBankAccountCode","SettlementLag","LaunchDate","MinFundSize","MinInvestment","MinAccBalance","InitialOfferPeriod","MaturityDate","FinancialYearEnd","DistributionPolicy","InvestmentPolicy","TrailerRate1","TrailerRate2","LastKeyInBy","LastKeyInDate","ForeignFlag","UTFlag","FG1","FG2","ContactPerson","Address","qCity","PostCode","qState","qCountry","Email","Website","Tel","Fax","IC","KWSPCode","qIndexBenchmark","qIndexBenchmarkPlus","StampDutyFlag","Islamic","ValuationMethod","FundCycle","qModalCode","BondProcess","ExtBnkAcc","PayMgtFeeFlag","PayOthFeeFlag","HiddenName1","HiddenName2","HiddenAdd1","HiddenAdd2","HiddenAdd3","UPCapSettLeg","KeyInDate","KeyInBy","ExpFlag","MonitorFlag","RollEOYFlag","SkipLimitCheck","FundCountryID","MaxPriceRise","MaxPriceFall","EndInitOffPeriod","InitOffPrice","qStrategyCode"]
["1","AFFIN EQUITY FUND","MYR","N/A","2013-05-28","A",1,1,false,"FC1","A",0,"DDD",1,1,"B","A","E","Domestic",false,"A",1,"AAA","BBB","CCC","CCC","2",1,"2013-05-28",1,1,1,"2013-05-28","2013-05-28","2013-05-28","a","a",0,0,"Admin",41443.718565162038,1,0,"","","AL-KABIR BIN MOHD ALI","SUITE 4.01,4TH FLOOR WISMA ALI BAWAL 2,NO 11,JALAN TANDANG,46050 PETALING JAYA","SEPJ","46050           ","SEL","MY","alkabir@hamodal.com.my","","012-2626021                                                                                                                                           ","                                                                                                                                                      ","790622-10-6029","","KLSER",0,0,0,0,0,"",0,"N/A",0,0,"","","","","",0,41109.743133067132,"mazuin",false,1,1,false,"MY",0,0,40922,0,"DF"]
["KFHICASH","KFH iCash Investment Fund","MYR","KFHICASH","2013-01-01","A",1000000,1,false,"FC1","A",0,"DDD",1,0,"B","A","E","Domestic",false,"A",1,"AAA","BBB","CCC","CCC","2",1,"2013-01-01",1000,1000,1000,"2013-01-01","3000-01-01","3000-01-01","a","a",1E-3,0,"Admin",41514.497222106482,1,0,"","","BAY BEE CHOO","A-04-09, CEMARA APARTMENT, JALAN SP3, 56000 KUALA LUMPUR."," KL","56000           "," ","MY","","","012-2279397                                                                                                                                           ","                                                                                                                                                      ","521213-08-5778","","KLCI",0,0,0,0,0,"",0,"N/A",0,0,"N/A","N/A","N/A","N/A","N/A",0,41341.626405671297,"admin",false,1,0,false,"MY",0,0,2,0,"DF"]
[null,null,null,null,null,null,null,null,null,null,null,null,null,null,null,null,null,null,null,null,null,null,null,null,null,null,1,"2010-01-01",1000,10,10,"2010-01-01","2010-01-01","2010-01-01","A","A","mich",40179,0,"NOFEE","NOFEE",1,0,"","","BOEY CHEE KEONG","76 JALAN DAWN INAI 15, SUNWAY SPK, DAMANSARA ","KL","52200           ","WP","MY","","","012-3300834                                                                                                                                           ","                                                                                                                                                      ","761012-07-5437","boey1012@yahoo.com.my","KLCI",0,0,0,0,0,"",0,"N/A",0,0,"N/A","N/A","N/A","N/A","N/A",0,40928.516229745372,"mazuin",false,1,0,false,"MY",0,0,2,0,"DF"]
[null,null,null,null,null,null,null,null,null,null,null,null,null,null,null,null,null,null,null,null,null,null,null,null,null,null,1,"2010-01-01",1000,10,10,"2010-01-01","2010-01-01","2010-01-01","A","A","mich",40179,0,"NOFEE","NOFEE",1,0,"","","CHUA ENG HUI","75B, JALAN KEDAI BARU, BUKIT PASIR, MUAR, JOHAR"," ","84300           "," ","MY","","","012-6287233                                                                                                                                           ","                                                                                                                                                      ","561019-01-6337","","KLCI",0,0,0,0,0,"",0,"N/A",0,0,"N/A","N/A","N/A","N/A","N/A",0,40855.660833333335,"ken",false,1,0,false,"MY",0,0,2,0,"DF"]
[null,null,null,null,null,null,null,null,null,null,null,null,null,null,null,null,null,null,null,null,null,null,null,null,null,null,1,"2010-01-01",1000,10,10,"2010-01-01","2010-01-01","2010-01-01","A","A","leann",41368.662719907406,0,"NOFEE","NOFEE",1,0,"","","CHARMAINE LAI SHU MING","TB-06-6, KEN DAMANSARA CONDOMINIUM, JALAN SS2/72, 47300 PETALING JAYA, SELANGOR"," PJ","47300           ","SEL","MY","charmainelai@gmail.com","","012-3272977                                                                                                                                           ","                                                                                                                                                      ","820616-10-5702","","KLCI",0,0,0,0,0,"",0,"N/A",0,0,"N/A","N/A","N/A","N/A","N/A",0,40855.635752314818,"ken",false,1,0,false,"MY",0,0,2,0,"DF"]
[null,null,null,null,null,null,null,null,null,null,null,null,null,null,null,null,null,null,null,null,null,null,null,null,null,null,1,"2010-01-01",1000,10,10,"2010-01-01","2010-01-01","2010-01-01","A","A","leann",41358.635162037041,0,"NOFEE","NOFEE",1,0,"","","CHEN HOCK MEET","2-12-2, ENDAH VILLA CONDO, JLN 2/149B, TMN SRI ENDAH, SRI PETALING"," ","57000           ","KL","MY","","","012-6514008                                                                                                                                           ","                                                                                                                                                      ","740406-06-5386","","KLCI",0,0,0,0,0,"",0,"N/A",0,0,"N/A","N/A","N/A","N/A","N/A",0,40855.636018518519,"ken",false,1,0,false,"MY",0,0,2,0,"DF"]
[null,null,null,null,null,null,null,null,null,null,null,null,null,null,null,null,null,null,null,null,null,null,null,null,null,null,1,"2010-01-01",1000,10,10,"2010-01-01","2010-01-01","2010-01-01","A","A","leann",41351.46429398148,0,"NOFEE","NOFEE",1,0,"","","CHONG HIN SANG","NO.8 JLN. A, JALAN JAMBU DI JALAN KUCHING","KL","52000           ","WP","MY","","","012-3223928, 03-62573712                                                                                                                              ","                                                                                                                                                      ","500828-10-5285","","KLCI",0,0,0,0,0,"",0,"N/A",0,0,"N/A","N/A","N/A","N/A","N/A",0,40855.636261574073,"ken",false,1,0,false,"MY",0,0,2,0,"DF"]
[null,null,null,null,null,null,null,null,null,null,null,null,null,null,null,null,null,null,null,null,null,null,null,null,null,null,1,"2010-01-01",1000,10,10,"2010-01-01","2010-01-01","2010-01-01","A","A","mich",40179,0,"NOFEE","NOFEE",1,0,"","","CHOO KWEE CHIN","NO.5, LORONG 2, JALAN PE16A, TAMAN PAYA EMAS, MELAKA ","MK","75250           ","MLK","MY","ckweechin@yahoo.com","","012-6181108                                                                                                                                           ","                                                                                                                                                      ","731002-04-5392","","KLCI",0,0,0,0,0,"",0,"N/A",0,0,"N/A","N/A","N/A","N/A","N/A",0,41145.743522453704,"jessica",false,1,0,false,"MY",0,0,2,0,"DF"]
[null,null,null,null,null,null,null,null,null,null,null,null,null,null,null,null,null,null,null,null,null,null,null,null,null,null,1,"2010-01-01",1000,10,10,"2010-01-01","2010-01-01","2010-01-01","A","A","mich",40179,0,"NOFEE","NOFEE",1,0,"","","CATHERINE LAM","NO.12, JALAN 5/21","PJ","46000           ","SEL","MY","","","012-3128301                                                                                                                                           ","                                                                                                                                                      ","530703-05-5322","","KLCI",0,0,0,0,0,"",0,"N/A",0,0,"N/A","N/A","N/A","N/A","N/A",0,41170.522963344905,"jessica",false,1,0,false,"MY",0,0,2,0,"DF"]
[null,null,null,null,null,null,null,null,null,null,null,null,null,null,null,null,null,null,null,null,null,null,null,null,null,null,1,"2010-01-01",1000,10,10,"2010-01-01","2010-01-01","2010-01-01","A","A","mich",40179,0,"NOFEE","NOFEE",1,0,"","","CHUNG LIH MIAN & YONG HAI YEN","Lorong Murni, House 6, Lot 19, Taman Murni Kolombong, 88450 Kota Kinabalu","SBKK","88450           ","SAB","MY","lm.chung@hotmail.com","","019-8134328                                                                                                                                           ","                                                                                                                                                      ","670729-12-5426","","KLCI",0,0,0,0,0,"",0,"N/A",0,0,"","","","","",0,41165.641728703704,"hanina",false,1,1,false,"MY",0,-250,2,0,"DF"]
[null,null,null,null,null,null,null,null,null,null,null,null,null,null,null,null,null,null,null,null,null,null,null,null,null,null,1,"2010-01-01",1000,10,10,"2010-01-01","2010-01-01","2010-01-01","A","A","leann",41368.662835648145,0,"NOFEE","NOFEE",1,0,"","","CHONG MIONG LING","CYBER CITY APT. LOT 1B-3A-2, JALAN PENAMPANG KEPAYAN","KK","88300           ","SBH","MY","","","016-8388087                                                                                                                                           ","                                                                                                                                                      ","540317-12-5491","","KLCI",0,0,0,0,0,"",0,"N/A",0,0,"N/A","N/A","N/A","N/A","N/A",0,41165.387489039349,"mazuin",false,1,0,false,"MY",0,0,2,0,"DF"]
[null,null,null,null,null,null,null,null,null,null,null,null,null,null,null,null,null,null,null,null,null,null,null,null,null,null,1,"2010-01-01",1000,10,10,"2010-01-01","2010-01-01","2010-01-01","A","A","mich",40179,0,"NOFEE","NOFEE",1,0,"","","CHUNG SU KIUN","P. O. BOX 10526, 88805 KOTA KINABALU, SABAH"," ","88805           "," ","MY","","","016-8302910                                                                                                                                           ","                                                                                                                                                      ","591215-12-5319","","KLCI",0,0,0,0,0,"",0,"N/A",0,0,"N/A","N/A","N/A","N/A","N/A",0,41138.393827743057,"mazuin",false,1,0,false,"MY",0,0,2,0,"DF"]
[null,null,null,null,null,null,null,null,null,null,null,null,null,null,null,null,null,null,null,null,null,null,null,null,null,null,1,"2010-01-01",1000,10,10,"2010-01-01","2010-01-01","2010-01-01","A","A","mich",40179,0,"NOFEE","NOFEE",1,0,"","","CHENG SOOK MING","PVD 3-204, JLN. PERDANA 2/1, PANDAN PERDANA","KL","55300           ","WP","MY","chengsu_myn@yahoo.com","","012-7171617                                                                                                                                           ","                                                                                                                                                      ","730426-14-5368","","KLCI",0,0,0,0,0,"",0,"N/A",0,0,"N/A","N/A","N/A","N/A","N/A",0,40855.636689814812,"ken",false,1,0,false,"MY",0,0,2,0,"DF"]
[null,null,null,null,null,null,null,null,null,null,null,null,null,null,null,null,null,null,null,null,null,null,null,null,null,null,1,"2010-01-01",1000,10,10,"2010-01-01","2010-01-01","2010-01-01","A","A","mich",40179,0,"NOFEE","NOFEE",1,0,"","","CHIN SIN YEAN","F-10-19, METROPOLITAN SQUARE CONDO, NO.2 JALAN PJU 8/1, DAMANSARA PERDANA","PJ","47820           ","SEL","MY","sinyean@gmail.com","","012-2339175                                                                                                                                           ","                                                                                                                                                      ","770128-07-5222","","KLCI",0,0,0,0,0,"",0,"N/A",0,0,"N/A","N/A","N/A","N/A","N/A",0,41057.620876851855,"jessica",false,1,0,false,"MY",0,0,2,0,"DF"]
[null,null,null,null,null,null,null,null,null,null,null,null,null,null,null,null,null,null,null,null,null,null,null,null,null,null,1,"2010-01-01",1000,10,10,"2010-01-01","2010-01-01","2010-01-01","A","A","admin",41043.510740740741,0,"NOFEE","NOFEE",1,0,"","","FOH HONG HIN","67 JALAN SS21/46, DAMANSARA UTAMA, 47400 PETALING JAYA, SELANGOR"," ","47400           ","KL","MY","","","016-3555138                                                                                                                                           ","                                                                                                                                                      ","580508-04-5415","","KLCI",0,0,0,0,0,"",0,"N/A",0,0,"N/A","N/A","N/A","N/A","N/A",0,40928.516626273151,"mazuin",false,1,0,false,"MY",0,0,2,0,"DF"]
[null,null,null,null,null,null,null,null,null,null,null,null,null,null,null,null,null,null,null,null,null,null,null,null,null,null,1,"2010-01-01",1000,10,10,"2010-01-01","2010-01-01","2010-01-01","A","A","mich",40179,0,"NOFEE","NOFEE",1,0,"","","FOONG LI LIN","59  JALAN TERASEK, BANGSAR BARU, 59100 KUALA LUMPUR"," ","59100           "," ","MY","","","012-2212105                                                                                                                                           ","                                                                                                                                                      ","700521-10-5228","","KLCI",0,0,0,0,0,"",0,"N/A",0,0,"N/A","N/A","N/A","N/A","N/A",0,41170.522850347224,"jessica",false,1,0,false,"MY",0,0,2,0,"DF"]
[null,null,null,null,null,null,null,null,null,null,null,null,null,null,null,null,null,null,null,null,null,null,null,null,null,null,1,"3000-01-01",1,100,1,"3000-01-01","3000-01-01","3000-01-01","1","1","leann",41366.758275462962,0,"NOFEE","NOFEE",1,0,"","","GERARD MARIE DE SOUZA","5 RK 5/12, RASAH KEMAYAN, 70300 SEREMBAN 2, NEGERI SEMBILAN."," ","70300           "," ","MY","","","017-3402503                                                                                                                                           ","                                                                                                                                                      ","560105-71-5121","","KLCI",0,0,0,0,0,"",0,"N/A",0,0,"N/A","N/A","N/A","N/A","N/A",0,40934.367777893516,"mazuin",false,1,0,false,"MY",0,0,2,0,"DF"]
[null,null,null,null,null,null,null,null,null,null,null,null,null,null,null,null,null,null,null,null,null,null,null,null,null,null,1,"0001-01-01",1,2,0,"0001-01-01","0001-01-01","0001-01-01","B","B","mich",40983,0,"NOFEE","NOFEE",1,0,"","","HOR CHAN WYE","54E, 1ST FLOOR, PERSIARAN BAYAN INDAH, BAYAN LEPAS, PENANG","","11900           ","","MY","","","016-4211728                                                                                                                                           ","                                                                                                                                                      ","571006-07-5425","wyecool@yahool.com","KLCI",0,0,0,0,0,"",0,"N/A",0,0,"N/A","N/A","N/A","N/A","N/A",0,40647.671388888892,"mazuin",false,1,0,false,"MY",0,0,2,0,"DF"]
[null,null,null,null,null,null,null,null,null,null,null,null,null,null,null,null,null,null,null,null,null,null,null,null,null,null,2,"3000-01-01",10000000,10000,10000,"3000-01-01","3000-01-01","3000-01-01","1234","1234","jess",41081.777129629627,0,"NOFEE","NOFEE",1,0,"","","HONG MENG FONG","NO.20, TAMAN SRI LEDANG, TANGKAT, JOHOR "," ","84900           ","","MY","fong2328@yahoo.com","","02-82682688                                                                                                                                           ","                                                                                                                                                      ","651210-01-5550","","KLCI",0,0,0,0,0,"",0,"N/A",0,0,"N/A","N/A","N/A","N/A","N/A",0,41130.387842627315,"mazuin",false,1,0,false,"MY",0,0,2,0,"DF"]
[null,null,null,null,null,null,null,null,null,null,null,null,null,null,null,null,null,null,null,null,null,null,null,null,null,null,1,"2011-05-15",10000000000000,1000,10000,"2011-07-15","3000-01-01","2012-06-15","123456789123456789123456789123456789123456789","123","jess",41082.528252314813,0,"NOFEE","NOFEE",1,0,"","","HUANG PEI LIN@NG PEI LIN & PATTY HUANG@PATTY NG","P.O.Box 11320, 88814 Kota Kinabalu, Sabah","SBKK","88814           ","SAB","MY","peilin_huang@hotmail.com","","016-8339292                                                                                                                                           ","                                                                                                                                                      ","750408-12-5230 ","","KLCI",0,0,0,0,0,"",0,"N/A",0,0,"","","","","",0,41150.685051238426,"jessica",false,1,1,false,"MY",0,-250,2,0,"DF"]
[null,null,null,null,null,null,null,null,null,null,null,null,null,null,null,null,null,null,null,null,null,null,null,null,null,null,3,"2003-01-01",10000000000,1000,1000,"2003-03-01","2023-01-01","2013-01-01","1234","123","jess",41082.526643518519,0,"NOFEE","NOFEE",1,0,"","","JABARAJ VINCENT A/L DEVARAKAM","17-02, EAST BLOCK FRASER TOWERS, 92, JALAN 5/60, OFF JALAN GASING, GASING HEIGHTS, 46000 PJ"," ","46000           "," ","MY","","","019-3801011                                                                                                                                           ","                                                                                                                                                      ","651207-08-6075","","KLCI",0,0,0,0,0,"",0,"N/A",0,0,"N/A","N/A","N/A","N/A","N/A",0,40855.662708333337,"ken",false,1,0,false,"MY",0,0,2,0,"DF"]
[null,null,null,null,null,null,null,null,null,null,null,null,null,null,null,null,null,null,null,null,null,null,null,null,null,null,3,"2002-01-01",10000000000,1000,1000,"2002-03-01","2022-01-01","2012-01-01","1234","123","jess",41082.51871527778,0,"NOFEE","NOFEE",1,0,"","","JISING @ JOHNNY BIN GUANSING","P.O BOX 632, 88858 TANJUNG ARU,  KOTA KINABALU","SBKK","88858           ","SAB","MY","jjguansing88@gmail.com",""," 012-8386388                                                                                                                                          ","                                                                                                                                                      ","511229-12-5181","","KLSER",0,0,0,0,0,"",0,"N/A",0,0,"","","","","",0,41131.375072835646,"jessica",false,1,1,false,"MY",0,0,380,0,"DF"]
[null,null,null,null,null,null,null,null,null,null,null,null,null,null,null,null,null,null,null,null,null,null,null,null,null,null,1,"2011-06-15",10000000000000,1000,10000,"2011-07-15","3000-01-01","2012-06-15","123456789123456789123456789123456789123456789","123","jess",41075.733020833337,0,"NOFEE","NOFEE",1,0,"","","JAMIL HAJAR BIN ABDUL MUTTALIB","7 JALAN SS3/86,47300 PETALING JAYA","SEPJ","47300           ","SEL","MY","jhmuttalib@gmail.com","","012-3365888                                                                                                                                           ","                                                                                                                                                      ","500331-08-5039","","KLSER",0,0,0,0,0,"",0,"N/A",0,0,"","","","","",0,41109.743516898146,"mazuin",false,1,1,false,"MY",0,0,40922,0,"DF"]
[null,null,null,null,null,null,null,null,null,null,null,null,null,null,null,null,null,null,null,null,null,null,null,null,null,null,1,"2010-03-15",10000000000000,1000,10000,"2011-07-15","3000-01-01","2012-03-15","123456789123456789123456789123456789123456789","123","jess",41082.530300925922,0,"NOFEE","NOFEE",1,0,"","","KAMARUZAMAN BIN SAPARI","NO.4, BLOK 5, TANJUNG PUTERI APARTMENT, 81700 PASIR GUDANG, JOHOR."," ","81700           "," ","MY"," ","","                                                                                                                                                      ","                                                                                                                                                      ","560629-01-5919","","KLCI",0,0,0,0,0,"",0,"N/A",0,0,"N/A","N/A","N/A","N/A","N/A",0,41068.728268252315,"mazuin",false,1,0,false,"MY",0,0,2,0,"DF"]
[null,null,null,null,null,null,null,null,null,null,null,null,null,null,null,null,null,null,null,null,null,null,null,null,null,null,1,"2010-06-15",10000000000000,1000,10000,"2010-07-15","3000-01-01","2012-06-15","123456789123456789123456789123456789123456789","123","jess",41082.527349537035,0,"NOFEE","NOFEE",1,0,"","","VICTOR KONG JOON KHIONG","LOT 1407, JALAN JERAMI 5, OFF JALAN PUJUT 6, MIRI, SARAWAK"," ","98000           ","SW","MY","","","019-8556586                                                                                                                                           ","                                                                                                                                                      ","500609-13-5273","","KLCI",0,0,0,0,0,"",0,"N/A",0,0,"N/A","N/A","N/A","N/A","N/A",0,41165.388298495367,"mazuin",false,1,0,false,"MY",0,0,2,0,"DF"]
[null,null,null,null,null,null,null,null,null,null,null,null,null,null,null,null,null,null,null,null,null,null,null,null,null,null,3,"2002-06-01",10000000000,1000,1000,"2002-03-01","2022-06-01","2012-06-01","1234","123","jess",41082.521817129629,0,"NOFEE","NOFEE",1,0,"","","KOPERASI PEKERJA BOMBA DAN PENYELAMAT MALAYSIA BERHAD","TINGKAT 3, BALAI BOMBA DAN PENYELAMAT CHOW KIT, JALAN HAJI HUSSEIN","KL","50300           ","","MY","","","03-26944436                                                                                                                                           ","                                                                                                                                                      ","74/14.4.84","wyecool@yahool.com","KLCI",0,0,0,0,0,"",0,"N/A",0,0,"N/A","N/A","N/A","N/A","N/A",0,41086.394864733797,"mazuin",false,1,0,false,"MY",0,0,2,0,"DF"]
[null,null,null,null,null,null,null,null,null,null,null,null,null,null,null,null,null,null,null,null,null,null,null,null,null,null,3,"2003-03-01",10000000000,1000,1000,"2003-04-01","2022-01-01","2012-03-01","1234","123","jess",41082.53261574074,0,"NOFEE","NOFEE",1,0,"","","KOH YEE VON","NO. 11, Lorong PJU 3/16A, Tropicana Indah, 47410 Petaling Jaya, Selangor","","47410           ","SEL","MY","","","016-2052132                                                                                                                                           ","                                                                                                                                                      ","680113-10-6226","","KLCI",0,0,0,0,0,"",0,"N/A",0,0,"N/A","N/A","N/A","N/A","N/A",0,41026.466345289351,"jessica",false,1,0,false,"MY",0,0,2,0,"DF"]
[null,null,null,null,null,null,null,null,null,null,null,null,null,null,null,null,null,null,null,null,null,null,null,null,null,null,3,"2002-01-01",10000000000,1000,1000,"2002-03-01","2022-01-01","2012-01-01","1234","123","jess",41082.51871527778,0,"NOFEE","NOFEE",1,0,"","","LOH CHING TYAN","NO.12, JALAN 14/2, SERDANG UTAMA, SERI KEMBANGAN"," ","43300           "," ","MY","","","016-2218679                                                                                                                                           ","                                                                                                                                                      ","740424-14-5160","","KLCI",0,0,0,0,0,"",0,"N/A",0,0,"N/A","N/A","N/A","N/A","N/A",0,40855.637384259258,"ken",false,1,0,false,"MY",0,0,2,0,"DF"]
[null,null,null,null,null,null,null,null,null,null,null,null,null,null,null,null,null,null,null,null,null,null,null,null,null,null,3,"2002-01-01",10000000000,1000,1000,"2002-03-01","2022-01-01","2012-01-01","1234","123","jess",41082.51871527778,0,"NOFEE","NOFEE",1,0,"","","LIM GOID LIAN","25, JALAN 7/27D, SEKSYEN 6, WANGSA MAJU"," ","53300           ","KL","MY","","","012-2161590                                                                                                                                           ","                                                                                                                                                      ","700709-10-5596","","KLCI",0,0,0,0,0,"",0,"N/A",0,0,"N/A","N/A","N/A","N/A","N/A",0,40855.637615740743,"ken",false,1,0,false,"MY",0,0,2,0,"DF"]
[null,null,null,null,null,null,null,null,null,null,null,null,null,null,null,null,null,null,null,null,null,null,null,null,null,null,365,0,0,0,0,0,0,3,0,0,"TA",390,0,"NOFEE","NOFEE",1,0,"","","LING HWA KUONG","NO. 34, GROUND FLOOR, MEDAN JAYA, 97000, BINTULU, SARAWAK, MALAYSIA."," ","97000           ","SR","MY","","","019-8858690                                                                                                                                           ","                                                                                                                                                      ","660728-13-5789","","KLCI",0,0,0,0,0,"",0,"N/A",0,0,"N/A","N/A","N/A","N/A","N/A",0,41092.390221793983,"mazuin",false,1,0,false,"MY",0,0,2,0,"DF"]
[null,null,null,null,null,null,null,null,null,null,null,null,null,null,null,null,null,null,null,null,null,null,null,null,null,null,365,0,0,0,0,0,0,3,0,0,"TA",380,0,"NOFEE","NOFEE",1,0,"","","LIEW HWA LI","11 JLN. SB INDAH 1/17, TMN. SG BESI INDAH, SRI KEMBANGAN"," ","43300           ","SEL","MY","","","03-89419010, 016-2277439                                                                                                                              ","                                                                                                                                                      ","680301-10-6848","","KLCI",0,0,0,0,0,"",0,"N/A",0,0,"N/A","N/A","N/A","N/A","N/A",0,40855.63784722222,"ken",false,1,0,false,"MY",0,0,2,0,"DF"]
[null,null,null,null,null,null,null,null,null,null,null,null,null,null,null,null,null,null,null,null,null,null,null,null,null,null,365,0,0,0,0,0,0,3,0,0,"TA",301,0,"NOFEE","NOFEE",1,0,"","","LOI HENG YUE","No. 182, Jalan Lembah, Taman Tasek, 80200 Johor Bahru","JOJB","80200           ","JOH","MY","hyloi16@streamyx.com","","012-7891661                                                                                                                                           ","                                                                                                                                                      ","460323-71-5164","","KLCI",0,0,0,0,0,"",0,"N/A",0,0,"","","","","",0,41130.388034374999,"mazuin",false,1,1,false,"MY",0,0,2,0,"DF"]
[null,null,null,null,null,null,null,null,null,null,null,null,null,null,null,null,null,null,null,null,null,null,null,null,null,null,365,0,0,0,0,0,0,3,0,0,"TA",339,0,"NOFEE","NOFEE",1,0,"","","NORLIZA BINTI SUKRAN","12 JALAN 11, SELAYANG BARU, 68100 BATU CAVES, SELANGOR"," ","68100           "," ","MY","","","019-3197400                                                                                                                                           ","                                                                                                                                                      ","670902-10-5964","","KLCI",0,0,0,0,0,"",0,"N/A",0,0,"N/A","N/A","N/A","N/A","N/A",0,41122.379946840279,"jessica",false,1,0,false,"MY",0,0,2,0,"DF"]
[null,null,null,null,null,null,null,null,null,null,null,null,null,null,null,null,null,null,null,null,null,null,null,null,null,null,365,0,0,0,0,0,0,3,0,0,"TA",336,0,"NOFEE","NOFEE",1,0,"","","LIEW KOK HON","BLOCK A 14-02, JALIL DAMAI APT, JALAN 14/155C, BANDAR BUKIT JALIL","KL","57000           "," WP","MY","","","012-2788215                                                                                                                                           ","                                                                                                                                                      ","750711-10-5507","","KLCI",0,0,0,0,0,"",0,"N/A",0,0,"N/A","N/A","N/A","N/A","N/A",0,40889.386006944442,"hanina",false,1,0,false,"MY",0,0,2,0,"DF"]
[null,null,null,null,null,null,null,null,null,null,null,null,null,null,null,null,null,null,null,null,null,null,null,null,null,null,365,0,0,0,0,0,0,3,0,0,"TA",391,0,"NOFEE","NOFEE",1,0,"","","LIM KIM SAN","NO.4, 2ND FLOOR, JALAN MOHD. SAID TAHIR 1, PUSAT PERNIAGAAN SAID TAHIR, MUAR, JOHOR"," ","84000           ","JB","MY","kslim5934@yahoo.com","","012-6805888                                                                                                                                           ","                                                                                                                                                      ","761126-01-5934","","KLCI",0,0,0,0,0,"",0,"N/A",0,0,"N/A","N/A","N/A","N/A","N/A",0,41130.388211689817,"mazuin",false,1,0,false,"MY",0,0,2,0,"DF"]
[null,null,null,null,null,null,null,null,null,null,null,null,null,null,null,null,null,null,null,null,null,null,null,null,null,null,365,0,0,0,0,0,0,3,0,0,"TA",302,0,"NOFEE","NOFEE",1,0,"","","LOW MENG SWEE","No. 26, Jalan Impian Emas 7, Taman Impian Emas, 81300 Skudai, Johor","JOSD","81300           ","JOH","MY","","","012-7817537                                                                                                                                           ","                                                                                                                                                      ","631110-01-5897","","KLCI",0,0,0,0,0,"",0,"N/A",0,0,"","","","","",0,41110.695963391205,"mazuin",false,1,1,false,"MY",0,0,2,0,"DF"]
[null,null,null,null,null,null,null,null,null,null,null,null,null,null,null,null,null,null,null,null,null,null,null,null,null,null,365,0,0,0,0,0,0,3,0,0,"TA",307,0,"NOFEE","NOFEE",1,0,"","","LEONG SUN WEI & CHIN SIN KEN","P.O.Box No. 239, Likas, 88856 Kota Kinabalu, Sabah.","SBKK","88856           ","SAB","MY","cfo@i-skill.com","","012-2848888                                                                                                                                           ","                                                                                                                                                      ","751219-11-5097","","KLCI",0,0,0,0,0,"",0,"N/A",0,0,"","","","","",0,41157.39298290509,"mazuin",false,1,1,false,"MY",0,-250,2,0,"DF"]
[null,null,null,null,null,null,null,null,null,null,null,null,null,null,null,null,null,null,null,null,null,null,null,null,null,null,365,0,0,0,0,0,0,3,0,0,"TA",343,0,"NOFEE","NOFEE",1,0,"","","LAU YEU KHING","LOT 1374, JALAN FRIENDSHIP 4A, 98000 MIRI, SARAWAK"," ","98000           "," SRW","MY","","","012-8771369                                                                                                                                           ","                                                                                                                                                      ","480229-13-5110","","KLCI",0,0,0,0,0,"",0,"N/A",0,0,"N/A","N/A","N/A","N/A","N/A",0,41092.390364236111,"mazuin",false,1,0,false,"MY",0,0,2,0,"DF"]
[null,null,null,null,null,null,null,null,null,null,null,null,null,null,null,null,null,null,null,null,null,null,null,null,null,null,365,0,0,0,0,0,0,3,0,0,"TA",257,0,"NOFEE","NOFEE",1,0,"","","MUK SAI TAT","83, JALAN TERASEK 2, BANGSA BARU, 59100 KUALA LUMPUR"," ","59100           ","KL","MY","stmuk63@gmail.com","","012-2812200                                                                                                                                           ","                                                                                                                                                      ","630719-10-7121","","KLCI",0,0,0,0,0,"",0,"N/A",0,0,"N/A","N/A","N/A","N/A","N/A",0,40855.638368055559,"ken",false,1,0,false,"MY",0,0,2,0,"DF"]
[null,null,null,null,null,null,null,null,null,null,null,null,null,null,null,null,null,null,null,null,null,null,null,null,null,null,365,0,0,0,0,0,0,3,0,0,"TA",340,0,"NOFEE","NOFEE",1,0,"","","MAH YUET OI","14 JALAN PANTAI 9/7"," PJ","46000           ","SEL","MY","","","                                                                                                                                                      ","                                                                                                                                                      ","420422-10-5074","phngtaitai@hotmail.com","KLCI",0,0,0,0,0,"",0,"N/A",0,0,"N/A","N/A","N/A","N/A","N/A",0,40641.529606481483,"mazuin",false,1,0,false,"MY",0,0,2,0,"DF"]
[null,null,null,null,null,null,null,null,null,null,null,null,null,null,null,null,null,null,null,null,null,null,null,null,null,null,365,0,0,0,0,0,0,3,0,0,"TA",392,0,"NOFEE","NOFEE",1,0,"","","NG CHENG HIONG","NO.34, JALAN DELIMA, TAMAN MAHARANI, JALAN BAKRI, MUAR, JOHOR"," ","84000           ","JB","MY","","","012-6113811                                                                                                                                           ","                                                                                                                                                      ","670306-01-5997","","KLCI",0,0,0,0,0,"",0,"N/A",0,0,"N/A","N/A","N/A","N/A","N/A",0,41130.388364965278,"mazuin",false,1,0,false,"MY",0,0,2,0,"DF"]
[null,null,null,null,null,null,null,null,null,null,null,null,null,null,null,null,null,null,null,null,null,null,null,null,null,null,365,0,0,0,0,0,0,3,0,0,"TA",248,0,"NOFEE","NOFEE",1,0,"","","NIK MOHAMAD PENA BIN NIK MUSTAPHA","LOT 5431, TINGKAT 1 (B) , JALAN J9, FASA 6, TAMAN MELAWATI, 53100 KUALA LUMPUR.","KL","53100           ","WP","MY"," ","","019-3290118                                                                                                                                           ","                                                                                                                                                      ","501108-03-5105","","KLCI",0,0,0,0,0,"",0,"N/A",0,0,"N/A","N/A","N/A","N/A","N/A",0,41143.640496840279,"ken",false,1,0,false,"MY",0,0,2,0,"DF"]
[null,null,null,null,null,null,null,null,null,null,null,null,null,null,null,null,null,null,null,null,null,null,null,null,null,null,365,0,0,0,0,0,0,3,0,0,"TA",253,0,"NOFEE","NOFEE",1,0,"","","NGOH MEE FONG","D-5-9, RUMAH PANGCA SEGAR PERDANA, JALAN SP, TAMAN SEGAR PERDANA, 43200 CHERAS, SELANGOR."," ","                ","SEL","MY","","","019-6738128                                                                                                                                           ","                                                                                                                                                      ","780414-05-5002","","KLCI",0,0,0,0,0,"",0,"N/A",0,0,"N/A","N/A","N/A","N/A","N/A",0,40855.63858796296,"ken",false,1,0,false,"MY",0,0,2,0,"DF"]
[null,null,null,null,null,null,null,null,null,null,null,null,null,null,null,null,null,null,null,null,null,null,null,null,null,null,365,0,0,0,0,0,0,3,0,0,"TA",337,0,"NOFEE","NOFEE",1,0,"","","NG SOON JING","NO.61 NADIA PARKHOME, PERSIARAN RESIDEN, DESA PARKCITY","KL","52200           ","WP","MY","","","012-2072448                                                                                                                                           ","                                                                                                                                                      ","730802-14-5901","nick@ttfgroup.com","KLCI",0,0,0,0,0,"",0,"N/A",0,0,"N/A","N/A","N/A","N/A","N/A",0,40855.638807870368,"ken",false,1,0,false,"MY",0,0,2,0,"DF"]
[null,null,null,null,null,null,null,null,null,null,null,null,null,null,null,null,null,null,null,null,null,null,null,null,null,null,365,0,0,0,0,0,0,3,0,0,"TA",395,0,"NOFEE","NOFEE",1,0,"","","CATHERINE NGOH SWEE SIAH","NO.7, JLN. JASA MERDEKA16, TAMAN DATUK TAMBY CHIK KARIM, BATU BERENDAM, MELAKA"," ","75350           ","MK","MY","catherine.ngoh@gmail.com","","012-2605556                                                                                                                                           ","                                                                                                                                                      ","750922-04-5372","","KLCI",0,0,0,0,0,"",0,"N/A",0,0,"N/A","N/A","N/A","N/A","N/A",0,41130.388496064814,"mazuin",false,1,0,false,"MY",0,0,2,0,"DF"]
[null,null,null,null,null,null,null,null,null,null,null,null,null,null,null,null,null,null,null,null,null,null,null,null,null,null,365,0,0,0,0,0,0,3,0,0,"TA",339,0,"NOFEE","NOFEE",1,0,"","","NG TONG ENG NEE LIM SIEW ENG","54 JALAN 2/1, TAMAN TUN ABDUL RAZAK, AMPANG"," ","68000           ","SEL","MY","","","                                                                                                                                                      ","                                                                                                                                                      ","370514-71-5184","gwwnng88@gmail.com","KLCI",0,0,0,0,0,"",0,"N/A",0,0,"N/A","N/A","N/A","N/A","N/A",0,41080.388208182871,"mazuin",false,1,0,false,"MY",0,0,2,0,"DF"]
[null,null,null,null,null,null,null,null,null,null,null,null,null,null,null,null,null,null,null,null,null,null,null,null,null,null,365,0,0,0,0,0,0,3,0,0,"TA",347,0,"NOFEE","NOFEE",1,0,"","","OH AIK TEONG MICHAEL","72 JALAN KERUING, BUKIT BANDARAYA, BANGSA","KL","59100           ","WP","MY","","","012-2279952                                                                                                                                           ","                                                                                                                                                      ","580721-07-5103","","KLCI",0,0,0,0,0,"",0,"N/A",0,0,"N/A","N/A","N/A","N/A","N/A",0,41080.388301157407,"mazuin",false,1,0,false,"MY",0,0,2,0,"DF"]
[null,null,null,null,null,null,null,null,null,null,null,null,null,null,null,null,null,null,null,null,null,null,null,null,null,null,365,0,0,0,0,0,0,3,0,0,"TA",319,0,"NOFEE","NOFEE",1,0,"","","MR ONG HAY THONG","29, JLN DESA RESIDEN 2, LEVENUE, DESA PARKCITY","KL","52200           ","WP","MY","wes_ong@yahoo.com","","019-3331490                                                                                                                                           ","                                                                                                                                                      ","390914-08-5829","","KLCI",0,0,0,0,0,"",0,"N/A",0,0,"N/A","N/A","N/A","N/A","N/A",0,40855.639027777775,"ken",false,1,0,false,"MY",0,0,2,0,"DF"]
[null,null,null,null,null,null,null,null,null,null,null,null,null,null,null,null,null,null,null,null,null,null,null,null,null,null,365,0,0,0,0,0,0,3,0,0,"TA",289,0,"NOFEE","NOFEE",1,0,"","","MR RAZMAN BIN MOHAMED","28, JALAN BU 1/4,TAMAN BUKIT UTAMA,BUKIT ANTARABANGSA,68000 AMPANG SELANGOR","SEAP","68000           ","SEL","MY","razman3n@yahoo.com","","019-3811964                                                                                                                                           ","                                                                                                                                                      ","641220-08-5035","","KLSER",0,0,0,0,0,"",0,"N/A",0,0,"","","","","",0,41123.370782025464,"jessica",false,1,1,false,"MY",0,0,40922,0,"DF"]
[null,null,null,null,null,null,null,null,null,null,null,null,null,null,null,null,null,null,null,null,null,null,null,null,null,null,365,0,0,0,0,0,0,3,0,0,"TA",303,0,"NOFEE","NOFEE",1,0,"","","MOHAMED RAIHAN ABU BAKAR","2,JALAN USJ 4/2 SUBANG JAYA","SESJ","46700           ","SEL","MY","raihanab@gmail.com","","012-3208261                                                                                                                                           ","                                                                                                                                                      ","630105-01-5695","","KLSER",0,0,0,0,0,"",0,"N/A",0,0,"","","","","",0,41109.743741701386,"mazuin",false,1,1,false,"MY",0,0,40922,0,"DF"]
[null,null,null,null,null,null,null,null,null,null,null,null,null,null,null,null,null,null,null,null,null,null,null,null,null,null,365,0,0,0,0,0,0,3,0,0,"TA",344,0,"NOFEE","NOFEE",1,0,"","","MOHAMED SALLEH BIN AHMAD","NO.198, JALAN MUTIARA, GOMBAK SETIA","KL","53100           ","","MY","","","012-3995094                                                                                                                                           ","                                                                                                                                                      ","411211-10-5045","","KLCI",0,0,0,0,0,"",0,"N/A",0,0,"N/A","N/A","N/A","N/A","N/A",0,41134.396327812501,"jessica",false,1,0,false,"MY",0,0,2,0,"DF"]
[null,null,null,null,null,null,null,null,null,null,null,null,null,null,null,null,null,null,null,null,null,null,null,null,null,null,365,0,0,0,0,0,0,3,0,0,"TA",338,0,"NOFEE","NOFEE",1,0,"","","SOO BEE LENG","16 JALAN PJU 3/12E, TROPICANA INDAH RESORT HOMES","PJ","47410           ","SEL","MY","","","017-3716332                                                                                                                                           ","                                                                                                                                                      ","700521-10-5332","","KLCI",0,0,0,0,0,"",0,"N/A",0,0,"N/A","N/A","N/A","N/A","N/A",0,40855.639224537037,"ken",false,1,0,false,"MY",0,0,2,0,"DF"]
[null,null,null,null,null,null,null,null,null,null,null,null,null,null,null,null,null,null,null,null,null,null,null,null,null,null,365,0,0,0,0,0,0,3,0,0,"TA",357,0,"NOFEE","NOFEE",1,0,"","","SOO BEE YUAN","NO.19, JALAN MERAK, BATU 3, JALAN IPOH, 51100 KUALA LUMPUR."," KL","51100           "," WP","MY"," ","","012-2577888                                                                                                                                           ","                                                                                                                                                      ","660913-10-6146","","KLCI",0,0,0,0,0,"",0,"N/A",0,0,"N/A","N/A","N/A","N/A","N/A",0,40855.639444444445,"ken",false,1,0,false,"MY",0,0,2,0,"DF"]
[null,null,null,null,null,null,null,null,null,null,null,null,null,null,null,null,null,null,null,null,null,null,null,null,null,null,365,0,0,0,0,0,0,3,0,0,"TA",394,0,"NOFEE","NOFEE",1,0,"","","SIA CHIU PING","NO.20, TAMAN SRI LEDANG,TANGKAK, JOHOR"," ","84900           ","JB","MY","","","019-7254148                                                                                                                                           ","                                                                                                                                                      ","690321-01-5432","","KLCI",0,0,0,0,0,"",0,"N/A",0,0,"N/A","N/A","N/A","N/A","N/A",0,41130.388756053238,"mazuin",false,1,0,false,"MY",0,0,2,0,"DF"]
[null,null,null,null,null,null,null,null,null,null,null,null,null,null,null,null,null,null,null,null,null,null,null,null,null,null,365,0,0,0,0,0,0,3,0,0,"TA",347,0,"NOFEE","NOFEE",1,0,"","","SIOW CHOCK SHUME","D-5-9, RUMAH PANGSA SEGAR PERDANA, JALAN SP, TAMAN SEGAR PERDANA, CHERAS, SELANGOR","","43200           ","SEL","MY","","","                                                                                                                                                      ","                                                                                                                                                      ","760311-05-5079","","KLCI",0,0,0,0,0,"",0,"N/A",0,0,"N/A","N/A","N/A","N/A","N/A",0,40855.639664351853,"ken",false,1,0,false,"MY",0,0,2,0,"DF"]
[null,null,null,null,null,null,null,null,null,null,null,null,null,null,null,null,null,null,null,null,null,null,null,null,null,null,365,0,0,0,0,0,0,3,0,0,"TA",356,0,"NOFEE","NOFEE",1,0,"","","TAN SEENG HONG","28, JALAN TELAWI 8, BANGSAR BARU, 59100 KUALA LUMPUR."," KL","59100           "," WP","MY","tsp289@yahoo.com","","03-90756191                                                                                                                                           ","03-90756936                                                                                                                                           ","751018-14-5505","","KLCI",0,0,0,0,0,"",0,"N/A",0,0,"N/A","N/A","N/A","N/A","N/A",0,40701.437650462962,"hanina",false,1,0,false,"MY",0,0,2,0,"DF"]
[null,null,null,null,null,null,null,null,null,null,null,null,null,null,null,null,null,null,null,null,null,null,null,null,null,null,365,0,0,0,0,0,0,3,0,0,"TA",340,0,"NOFEE","NOFEE",1,0,"","","SOO LIAN SING","NO.27, JLN. PJU 1A/29A, ARA DAMANSARA","PJ","47301           ","SEL","MY","","","                                                                                                                                                      ","                                                                                                                                                      ","750604-14-5589","","KLCI",0,0,0,0,0,"",0,"N/A",0,0,"N/A","N/A","N/A","N/A","N/A",0,41057.621402812503,"jessica",false,1,0,false,"MY",0,0,2,0,"DF"]
[null,null,null,null,null,null,null,null,null,null,null,null,null,null,null,null,null,null,null,null,null,null,null,null,null,null,365,0,0,0,0,0,0,3,0,0,"TA",350,0,"NOFEE","NOFEE",1,0,"","","CHAI SAM MIN","NO.616, JALAN LIMAU 7, PUJUT 5B,98000 MIRI, SARAWAK, MALAYSIA","MR","98000           ","SRK","MY","chengsu_myn@yahoo.com","chaism@gmail.com","085-660353 / 014-3911553                                                                                                                              ","                                                                                                                                                      ","540622-13-5223","","KLCI",0,0,0,0,0,"",0,"N/A",0,0,"N/A","N/A","N/A","N/A","N/A",0,40879.390648148146,"hanina",false,1,0,false,"MY",0,0,2,0,"DF"]
[null,null,null,null,null,null,null,null,null,null,null,null,null,null,null,null,null,null,null,null,null,null,null,null,null,null,365,0,0,0,0,0,0,3,0,0,"TA",254,0,"NOFEE","NOFEE",1,0,"","","SIOW SUN WOON","3-1 C, JALAN PERDANA 6/6, PANDAN PERDANA, 55300 KUALA LUMPUR"," ","                ","KL","MY","","","019-2777620                                                                                                                                           ","                                                                                                                                                      ","740606-05-5027","","KLCI",0,0,0,0,0,"",0,"N/A",0,0,"N/A","N/A","N/A","N/A","N/A",0,40855.640069444446,"ken",false,1,0,false,"MY",0,0,2,0,"DF"]
[null,null,null,null,null,null,null,null,null,null,null,null,null,null,null,null,null,null,null,null,null,null,null,null,null,null,365,0,0,0,0,0,0,3,0,0,"TA",342,0,"NOFEE","NOFEE",1,0,"","","SOO SOOK YEE","NO.7, JALAN BADAM SATU, TAMAN CHERAS"," ","56100           ","KL","MY","sherinesoo@hotmail.com","","012-3699783                                                                                                                                           ","                                                                                                                                                      ","680307-10-5918","","KLCI",0,0,0,0,0,"",0,"N/A",0,0,"N/A","N/A","N/A","N/A","N/A",0,40855.64025462963,"ken",false,1,0,false,"MY",0,0,2,0,"DF"]
[null,null,null,null,null,null,null,null,null,null,null,null,null,null,null,null,null,null,null,null,null,null,null,null,null,null,365,0,0,0,0,0,0,3,0,0,"TA",308,0,"NOFEE","NOFEE",1,0,"","","LEE SOO WEN & KAM KIAN CHUAN @ KAM KIAN CHUANG","210, TAMAN KINAMOUNT, 88300, KOTA KINABALU, SABAH","SBKK","88300           ","SAB","MY","leesoowen@hotmail.com","","014-3533023                                                                                                                                           ","                                                                                                                                                      ","800406-08-5821","","KLCI",0,0,0,0,0,"",0,"N/A",0,0,"","","","","",0,41166.725088854168,"mazuin",false,1,1,false,"MY",0,-250,2,0,"DF"]
[null,null,null,null,null,null,null,null,null,null,null,null,null,null,null,null,null,null,null,null,null,null,null,null,null,null,365,0,0,0,0,0,0,3,0,0,"TA",337,0,"NOFEE","NOFEE",1,0,"","","TANG CHEE KEONG","8 JALAN UP 3/3, UKAY PERDANA, AMPANG"," ","68000           ","SEL","MY","","","                                                                                                                                                      ","                                                                                                                                                      ","560309-14-5167","allantangck@gmail.com","KLCI",0,0,0,0,0,"",0,"N/A",0,0,"N/A","N/A","N/A","N/A","N/A",0,41100.401034606482,"mazuin",false,1,0,false,"MY",0,0,2,0,"DF"]
[null,null,null,null,null,null,null,null,null,null,null,null,null,null,null,null,null,null,null,null,null,null,null,null,null,null,365,0,0,0,0,0,0,3,0,0,"TA",340,0,"NOFEE","NOFEE",1,0,"","","TAN GEOT NGE","UNIT 69, ADIVA DESA PARKCITY, PERSIARAN RESIDEN","KL","52200           "," WP","MY","","","012-3413712                                                                                                                                           ","                                                                                                                                                      ","580316-10-6148","","KLCI",0,0,0,0,0,"",0,"N/A",0,0,"N/A","N/A","N/A","N/A","N/A",0,40855.640462962961,"ken",false,1,0,false,"MY",0,0,2,0,"DF"]
[null,null,null,null,null,null,null,null,null,null,null,null,null,null,null,null,null,null,null,null,null,null,null,null,null,null,365,0,0,0,0,0,0,3,0,0,"TA",344,0,"NOFEE","NOFEE",1,0,"","","TEH HEE TIAN","29 CANGKAT DESA, TAMAN DESA, OLD KLANG ROAD","KL","58100           ","WP","MY","","","019-2330013                                                                                                                                           ","                                                                                                                                                      ","640927-10-5074","theresateh09@gmail.com","KLCI",0,0,0,0,0,"",0,"N/A",0,0,"N/A","N/A","N/A","N/A","N/A",0,41080.3885366088,"mazuin",false,1,0,false,"MY",0,0,2,0,"DF"]
[null,null,null,null,null,null,null,null,null,null,null,null,null,null,null,null,null,null,null,null,null,null,null,null,null,null,365,0,0,0,0,0,0,3,0,0,"TA",393,0,"NOFEE","NOFEE",1,0,"","","TAN JIN KIAT","LOT 1065, LORONG 1, JALAN PUJUT EMAS 1, 98000 MIRI, SARAWAK"," ","98000           ","SW","MY","","","016-8685498 / 085-665146                                                                                                                              ","                                                                                                                                                      ","590612-10-6061","","KLCI",0,0,0,0,0,"",0,"N/A",0,0,"N/A","N/A","N/A","N/A","N/A",0,41155.737941631945,"mazuin",false,1,0,false,"MY",0,0,2,0,"DF"]
[null,null,null,null,null,null,null,null,null,null,null,null,null,null,null,null,null,null,null,null,null,null,null,null,null,null,365,0,0,0,0,0,0,3,0,0,"TA",340,0,"NOFEE","NOFEE",1,0,"","","TEO KION YEU","28 JALAN KP 2/6, BANDAR PUTRA PERMAI, SERI KEMBANGAN"," ","43300           ","SEL","MY","","","                                                                                                                                                      ","                                                                                                                                                      ","721122-01-6159","teokionyeu@hotmail.com","KLCI",0,0,0,0,0,"",0,"N/A",0,0,"N/A","N/A","N/A","N/A","N/A",0,40855.640659722223,"ken",false,1,0,false,"MY",0,0,2,0,"DF"]
[null,null,null,null,null,null,null,null,null,null,null,null,null,null,null,null,null,null,null,null,null,null,null,null,null,null,365,0,0,0,0,0,0,3,0,0,"TA",341,0,"NOFEE","NOFEE",1,0,"","","TAN MEW CHING","22 JALAN RK 4/25, RASAH KEMAYANG, 70300 SEREMBAN, NEGERI SEMBILAN."," ","70300           "," ","MY","","","019-2726398                                                                                                                                           ","                                                                                                                                                      ","540104-08-5772","","KLCI",0,0,0,0,0,"",0,"N/A",0,0,"N/A","N/A","N/A","N/A","N/A",0,41130.389186493056,"mazuin",false,1,0,false,"MY",0,0,2,0,"DF"]
[null,null,null,null,null,null,null,null,null,null,null,null,null,null,null,null,null,null,null,null,null,null,null,null,null,null,365,0,0,0,0,0,0,3,0,0,"TA",336,0,"NOFEE","NOFEE",1,0,"","","TAN POO EM","NO. 38, JLN. LTIS BAYU, VALENCIA RESORTS HOMES","SG.BU","47000           ","SEL","MY","","","                                                                                                                                                      ","                                                                                                                                                      ","540219-08-5182","","KLCI",0,0,0,0,0,"",0,"N/A",0,0,"N/A","N/A","N/A","N/A","N/A",0,40855.640844907408,"ken",false,1,0,false,"MY",0,0,2,0,"DF"]
[null,null,null,null,null,null,null,null,null,null,null,null,null,null,null,null,null,null,null,null,null,null,null,null,null,null,365,0,0,0,0,0,0,3,0,0,"TA",349,0,"NOFEE","NOFEE",1,0,"","","TAN SIOK FUI","NO-6-8 PRIMA SETAPAK II, JALAN GOMBAK SEJAHTERA, GOMBAK, KUALA LUMPUR","","53300           ","KL","MY","","","                                                                                                                                                      ","                                                                                                                                                      ","741110-13-5546","","KLCI",0,0,0,0,0,"",0,"N/A",0,0,"N/A","N/A","N/A","N/A","N/A",0,40855.641076388885,"ken",false,1,0,false,"MY",0,0,2,0,"DF"]
[null,null,null,null,null,null,null,null,null,null,null,null,null,null,null,null,null,null,null,null,null,null,null,null,null,null,365,0,0,0,0,0,0,3,0,0,"TA",339,0,"NOFEE","NOFEE",1,0,"","","TEO SIEW HONG","78, JALAN SUADAMAI 2/2A, BANDAR TUN HUSSEIN ONN, CHERAS, KAJANG","","43200           ","SEL","MY","","","                                                                                                                                                      ","                                                                                                                                                      ","630927-01-6208","","KLCI",0,0,0,0,0,"",0,"N/A",0,0,"N/A","N/A","N/A","N/A","N/A",0,40855.641273148147,"ken",false,1,0,false,"MY",0,0,2,0,"DF"]
[null,null,null,null,null,null,null,null,null,null,null,null,null,null,null,null,null,null,null,null,null,null,null,null,null,null,365,0,0,0,0,0,0,3,0,0,"TA",395,0,"NOFEE","NOFEE",1,0,"","","TING SII ING","LOT 2507, BOULEVARD CENTRE, JALAN PERMAISURI PUJUT, MIRI, SARAWAK"," ","98000           ","SW","MY","","","012-8283835                                                                                                                                           ","                                                                                                                                                      ","520721-71-5102","","KLCI",0,0,0,0,0,"",0,"N/A",0,0,"N/A","N/A","N/A","N/A","N/A",0,41165.387895486114,"mazuin",false,1,0,false,"MY",0,0,2,0,"DF"]
[null,null,null,null,null,null,null,null,null,null,null,null,null,null,null,null,null,null,null,null,null,null,null,null,null,null,365,0,0,0,0,0,0,3,0,0,"TA",351,0,"NOFEE","NOFEE",1,0,"","","TAN SAY PENG","NO.16, JALAN JESSELTON, 10450 PENANG","PN","10450           "," ","MY","say_peng_tan@dell.com","","04-2289911 / 012-4388628                                                                                                                              ","                                                                                                                                                      ","620127-08-5361","","KLCI",0,0,0,0,0,"",0,"N/A",0,0,"N/A","N/A","N/A","N/A","N/A",0,41100.400321412038,"mazuin",false,1,0,false,"MY",0,0,2,0,"DF"]
[null,null,null,null,null,null,null,null,null,null,null,null,null,null,null,null,null,null,null,null,null,null,null,null,null,null,365,0,0,0,0,0,0,3,0,0,"TA",345,0,"NOFEE","NOFEE",1,0,"","","W MOHD SHARIF BIN WAN MUDA","NO.35, JALAN F4, TAMAN MELAWATI, 53100 KUALA LUMPUR.","KL","53100           ","WP","MY","","","019-2367169                                                                                                                                           ","                                                                                                                                                      ","750307-11-5359","","KLCI",0,0,0,0,0,"",0,"N/A",0,0,"N/A","N/A","N/A","N/A","N/A",0,41165.388039004632,"mazuin",false,1,0,false,"MY",0,0,2,0,"DF"]
[null,null,null,null,null,null,null,null,null,null,null,null,null,null,null,null,null,null,null,null,null,null,null,null,null,null,365,0,0,0,0,0,0,3,0,0,"TA",342,0,"NOFEE","NOFEE",1,0,"","","WONG SUE FONG","57 JLN. SUNGKAI, OFF JALAN IPOH, BATU 3 3/4","KL","51100           ","WP","MY","","","03-62531646, 012-2739151                                                                                                                              ","                                                                                                                                                      ","731228-10-5650","","KLCI",0,0,0,0,0,"",0,"N/A",0,0,"N/A","N/A","N/A","N/A","N/A",0,40855.642048611109,"ken",false,1,0,false,"MY",0,0,2,0,"DF"]
[null,null,null,null,null,null,null,null,null,null,null,null,null,null,null,null,null,null,null,null,null,null,null,null,null,null,365,0,0,0,0,0,0,3,0,0,"TA",339,0,"NOFEE","NOFEE",1,0,"","","YAP CHEW MEI","11 JALAN SUADAMAI 2/1A, BANDAR TUN HUSSEIN ONN, CHERAS, BATU 9 CHERAS"," ","43200           ","SEL","MY","","","016-2779963                                                                                                                                           ","                                                                                                                                                      ","710624-10-5334","","KLCI",0,0,0,0,0,"",0,"N/A",0,0,"N/A","N/A","N/A","N/A","N/A",0,41057.621641666665,"jessica",false,1,0,false,"MY",0,0,2,0,"DF"]
[null,null,null,null,null,null,null,null,null,null,null,null,null,null,null,null,null,null,null,null,null,null,null,null,null,null,365,0,0,0,0,0,0,3,0,0,"TA",380,0,"NOFEE","NOFEE",1,0,"","","YAP PECK MOI","NO.16, TAMAN MERANTI,MANTIN"," ","71700           ","NS","MY","","","012-3395765                                                                                                                                           ","                                                                                                                                                      ","690516-05-5426","","KLCI",0,0,0,0,0,"",0,"N/A",0,0,"N/A","N/A","N/A","N/A","N/A",0,41057.62248125,"jessica",false,1,0,false,"MY",0,0,2,0,"DF"]
[null,null,null,null,null,null,null,null,null,null,null,null,null,null,null,null,null,null,null,null,null,null,null,null,null,null,365,0,0,0,0,0,0,3,0,0,"TA",339,0,"NOFEE","NOFEE",1,0,"","","YEAT SIAW PING","102A JLN. BRP 5/3, BUKIT RAHMAN PUTRA","SBULU","47000           ","SEL","MY","","","016-2399668                                                                                                                                           ","                                                                                                                                                      ","630702-08-6037","","KLCI",0,0,0,0,0,"",0,"N/A",0,0,"N/A","N/A","N/A","N/A","N/A",0,40855.643067129633,"ken",false,1,0,false,"MY",0,0,2,0,"DF"]
[null,null,null,null,null,null,null,null,null,null,null,null,null,null,null,null,null,null,null,null,null,null,null,null,null,null,365,0,0,0,0,0,0,3,0,0,"TA",304,0,"NOFEE","NOFEE",1,0,"","","YEO TECK CHIN","1642 JALAN BEREMBANG 3,98000 MIRI","SRMR","98000           ","SAR","MY","sytc@streamyx.com","","0199-8856833                                                                                                                                          ","                                                                                                                                                      ","541016-135383","","KLSER",0,0,0,0,0,"",0,"N/A",0,0,"","","","","",0,41165.388460451388,"mazuin",false,1,1,false,"MY",0,0,40922,0,"DF"]
[null,null,null,null,null,null,null,null,null,null,null,null,null,null,null,null,null,null,null,null,null,null,null,null,null,null,365,0,0,0,0,0,0,3,0,1,"TA",1,0,"NOFEE","NOFEE",1,0,"","","MR ANG KIM CHAN @ ANG KIM CHIA","5 Jalan 1/8, Taman Merbok,","MEBA","75450           ","MEL","MY","","","                                                                                                                                                      ","                                                                                                                                                      ","0198229","","KLCI",0,0,0,0,0,"",0,"N/A",0,0,"N/A","N/A","N/A","N/A","N/A",0,40683.430983796294,"arasu",false,1,0,false,"MY",0,0,2,0,"DF"]
[null,null,null,null,null,null,null,null,null,null,null,null,null,null,null,null,null,null,null,null,null,null,null,null,null,null,365,0,0,0,0,0,0,3,0,1,"TA",2,0,"NOFEE","NOFEE",1,0,"","","MR ANG KOK SEONG","5 Jalan 1/8, Taman Merbok,","MEBA","75450           ","MEL","MY","","","                                                                                                                                                      ","                                                                                                                                                      ","530927-08-5651","","KLCI",0,0,0,0,0,"",0,"N/A",0,0,"N/A","N/A","N/A","N/A","N/A",0,40683.431805555556,"arasu",false,1,0,false,"MY",0,0,2,0,"DF"]
[null,null,null,null,null,null,null,null,null,null,null,null,null,null,null,null,null,null,null,null,null,null,null,null,null,null,365,0,0,0,0,0,0,3,0,1,"TA",3,0,"NOFEE","NOFEE",1,0,"","","","","","                ","","","","","                                                                                                                                                      ","                                                                                                                                                      ","","","KLCI",0,0,0,0,0,"",0,"N/A",0,0,"N/A","N/A","N/A","N/A","N/A",0,39913.735300925924,"mazuin",false,1,0,false,"MY",0,0,2,0,"DF"]
[null,null,null,null,null,null,null,null,null,null,null,null,null,null,null,null,null,null,null,null,null,null,null,null,null,null,365,0,0,0,0,0,0,3,0,-1,"TA",4,0,"NOFEE","NOFEE",1,0,"","","Yen ","34th Floor Menara TA One","","                ","","MY","","","03-20721277 ext 1238                                                                                                                                  ","                                                                                                                                                      ","500827-07-5088","","KLCI",0,0,0,0,0,"",0,"N/A",0,0,"N/A","N/A","N/A","N/A","N/A",0,40928.424237812498,"mazuin",false,1,0,false,"MY",0,0,2,0,"DF"]
[null,null,null,null,null,null,null,null,null,null,null,null,null,null,null,null,null,null,null,null,null,null,null,null,null,null,365,0,0,0,0,0,0,3,0,1,"TA",5,0,"NOFEE","NOFEE",1,0,"","","","","","                ","","","","","                                                                                                                                                      ","                                                                                                                                                      ","","","KLCI",0,0,0,0,0,"",0,"N/A",0,0,"N/A","N/A","N/A","N/A","N/A",0,39913.742812500001,"mazuin",false,1,0,false,"MY",0,0,2,0,"DF"]
[null,null,null,null,null,null,null,null,null,null,null,null,null,null,null,null,null,null,null,null,null,null,null,null,null,null,365,0,0,0,0,0,0,2,0,-1,"TA",93,0,"NOFEE","NOFEE",0,0,"","","","","","                ","","","","","                                                                                                                                                      ","                                                                                                                                                      ","","","KLCI",0,0,0,0,0,"",0,"N/A",0,0,"N/A","N/A","N/A","N/A","N/A",0,40928.410874305555,"mazuin",false,1,0,false,"MY",0,0,2,0,"DF"]
[null,null,null,null,null,null,null,null,null,null,null,null,null,null,null,null,null,null,null,null,null,null,null,null,null,null,365,0,0,0,0,0,0,3,0,-1,"TA",6,0,"NOFEE","NOFEE",1,0,"","","Joshua Lim","Level 7, Bangunan ARB, Jalan Semantan, Damansara Heights, 50490 KL","","                ","","","","","03-20846486                                                                                                                                           ","03-20955469                                                                                                                                           ","","","KLCI",0,0,0,0,0,"",0,"N/A",0,0,"N/A","N/A","N/A","N/A","N/A",0,40928.423944756942,"mazuin",false,1,0,false,"MY",0,0,2,0,"DF"]
[null,null,null,null,null,null,null,null,null,null,null,null,null,null,null,null,null,null,null,null,null,null,null,null,null,null,365,0,0,0,0,0,0,3,0,1,"TA",7,0,"NOFEE","NOFEE",1,0,"","","","","","                ","","","","","                                                                                                                                                      ","                                                                                                                                                      ","","","KLCI",0,0,0,0,0,"",0,"N/A",0,0,"N/A","N/A","N/A","N/A","N/A",0,40655.47042824074,"mazuin",false,1,0,false,"MY",0,0,2,0,"DF"]
[null,null,null,null,null,null,null,null,null,null,null,null,null,null,null,null,null,null,null,null,null,null,null,null,null,null,365,0,0,0,0,0,0,2,0,-1,"TA",94,0,"NOFEE","NOFEE",0,0,"","","","","","                ","","","","","                                                                                                                                                      ","                                                                                                                                                      ","","","KLCI",0,0,0,0,0,"",0,"N/A",0,0,"N/A","N/A","N/A","N/A","N/A",0,40928.411144791666,"mazuin",false,1,0,false,"MY",0,0,2,0,"DF"]
[null,null,null,null,null,null,null,null,null,null,null,null,null,null,null,null,null,null,null,null,null,null,null,null,null,null,365,0,0,0,0,0,0,3,0,-1,"TA",8,0,"NOFEE","NOFEE",1,0,"","","","","","                ","","","","","                                                                                                                                                      ","                                                                                                                                                      ","","","KLCI",0,0,0,0,0,"",0,"N/A",0,0,"N/A","N/A","N/A","N/A","N/A",0,40996.730080821762,"mazuin",false,1,0,false,"MY",0,0,2,0,"DF"]
[null,null,null,null,null,null,null,null,null,null,null,null,null,null,null,null,null,null,null,null,null,null,null,null,null,null,365,0,0,0,0,0,0,3,0,1,"TA",9,0,"NOFEE","NOFEE",1,0,"","","","","","                ","","","","","                                                                                                                                                      ","                                                                                                                                                      ","","","KLCI",0,0,0,0,0,"",0,"N/A",0,0,"N/A","N/A","N/A","N/A","N/A",0,40655.470659722225,"mazuin",false,1,0,false,"MY",0,0,2,0,"DF"]
[null,null,null,null,null,null,null,null,null,null,null,null,null,null,null,null,null,null,null,null,null,null,null,null,null,null,365,0,0,0,0,0,0,3,0,-1,"TA",10,0,"NOFEE","NOFEE",1,0,"","","","","","                ","","","","","                                                                                                                                                      ","                                                                                                                                                      ","","","KLCI",0,0,0,0,0,"",0,"N/A",0,0,"N/A","N/A","N/A","N/A","N/A",0,40928.423447488429,"mazuin",false,1,0,false,"MY",0,0,2,0,"DF"]
[null,null,null,null,null,null,null,null,null,null,null,null,null,null,null,null,null,null,null,null,null,null,null,null,null,null,365,0,0,0,0,0,0,3,0,-1,"TA",11,0,"NOFEE","NOFEE",1,0,"","","","","","                ","","","","","                                                                                                                                                      ","                                                                                                                                                      ","","","KLCI",0,0,0,0,0,"",0,"N/A",0,0,"N/A","N/A","N/A","N/A","N/A",0,40928.423311539351,"mazuin",false,1,0,false,"MY",0,0,2,0,"DF"]
[null,null,null,null,null,null,null,null,null,null,null,null,null,null,null,null,null,null,null,null,null,null,null,null,null,null,365,0,0,0,0,0,0,3,0,0,"TA",12,0,"NOFEE","NOFEE",1,0,"","","Mr. Oh Kim Sun","Suite E-06-14, Wisma Sunrise, Plaza Mont Kiara, No.2, Jalan Mont Kiara, 50480 KL","","                ","","","sunming@streamyx.com","","03-62032128                                                                                                                                           ","                                                                                                                                                      ","","","KLCI",0,0,0,0,0,"",0,"N/A",0,0,"N/A","N/A","N/A","N/A","N/A",0,41130.390066168984,"mazuin",false,1,0,false,"MY",0,0,2,0,"DF"]
[null,null,null,null,null,null,null,null,null,null,null,null,null,null,null,null,null,null,null,null,null,null,null,null,null,null,365,0,0,0,0,0,0,3,0,1,"TA",13,0,"NOFEE","NOFEE",1,0,"","","","","","                ","","","","","                                                                                                                                                      ","                                                                                                                                                      ","","","KLCI",0,0,0,0,0,"",0,"N/A",0,0,"N/A","N/A","N/A","N/A","N/A",0,39916.705937500003,"mazuin",false,1,0,false,"MY",0,0,2,0,"DF"]
[null,null,null,null,null,null,null,null,null,null,null,null,null,null,null,null,null,null,null,null,null,null,null,null,null,null,365,0,0,0,0,0,0,3,0,1,"TA",14,0,"NOFEE","NOFEE",1,0,"","","","","","                ","","","","","                                                                                                                                                      ","                                                                                                                                                      ","","","KLCI",0,0,0,0,0,"",0,"N/A",0,0,"N/A","N/A","N/A","N/A","N/A",0,40655.47084490741,"mazuin",false,1,0,false,"MY",0,0,2,0,"DF"]
[null,null,null,null,null,null,null,null,null,null,null,null,null,null,null,null,null,null,null,null,null,null,null,null,null,null,365,0,0,0,0,0,0,3,0,-1,"TA",15,0,"NOFEE","NOFEE",1,0,"","","","","","                ","","","","","                                                                                                                                                      ","                                                                                                                                                      ","","","KLCI",0,0,0,0,0,"",0,"N/A",0,0,"N/A","N/A","N/A","N/A","N/A",0,40996.730275462964,"mazuin",false,1,0,false,"MY",0,0,2,0,"DF"]
[null,null,null,null,null,null,null,null,null,null,null,null,null,null,null,null,null,null,null,null,null,null,null,null,null,null,365,0,0,0,0,0,0,2,0,1,"TA",95,0,"NOFEE","NOFEE",0,0,"","","","","","                ","","","","","                                                                                                                                                      ","                                                                                                                                                      ","","","KLCI",0,0,0,0,0,"",0,"N/A",0,0,"N/A","N/A","N/A","N/A","N/A",0,39192.437476851854,"mazuin",false,1,0,false,"MY",0,0,2,0,"DF"]
[null,null,null,null,null,null,null,null,null,null,null,null,null,null,null,null,null,null,null,null,null,null,null,null,null,null,365,0,0,0,0,0,0,3,0,1,"TA",16,0,"NOFEE","NOFEE",1,0,"","","","","","                ","","","","","                                                                                                                                                      ","                                                                                                                                                      ","","","KLCI",0,0,0,0,0,"",0,"N/A",0,0,"N/A","N/A","N/A","N/A","N/A",0,39916.709594907406,"mazuin",false,1,0,false,"MY",0,0,2,0,"DF"]
[null,null,null,null,null,null,null,null,null,null,null,null,null,null,null,null,null,null,null,null,null,null,null,null,null,null,365,0,0,0,0,0,0,3,0,-1,"TA",17,0,"NOFEE","NOFEE",1,0,"","","","","","                ","","","","","                                                                                                                                                      ","                                                                                                                                                      ","","","KLCI",0,0,0,0,0,"",0,"N/A",0,0,"N/A","N/A","N/A","N/A","N/A",0,40928.411430439817,"mazuin",false,1,0,false,"MY",0,0,2,0,"DF"]
[null,null,null,null,null,null,null,null,null,null,null,null,null,null,null,null,null,null,null,null,null,null,null,null,null,null,365,0,0,0,0,0,0,2,0,-1,"TA",96,0,"NOFEE","NOFEE",0,0,"","","","","","                ","","","","","                                                                                                                                                      ","                                                                                                                                                      ","","","KLCI",0,0,0,0,0,"",0,"N/A",0,0,"N/A","N/A","N/A","N/A","N/A",0,40928.411612268515,"mazuin",false,1,0,false,"MY",0,0,2,0,"DF"]
[null,null,null,null,null,null,null,null,null,null,null,null,null,null,null,null,null,null,null,null,null,null,null,null,null,null,365,0,0,0,0,0,0,3,0,1,"TA",18,0,"NOFEE","NOFEE",1,0,"","","","","","                ","","","","","                                                                                                                                                      ","                                                                                                                                                      ","","","KLCI",0,0,0,0,0,"",0,"N/A",0,0,"N/A","N/A","N/A","N/A","N/A",0,40655.471134259256,"mazuin",false,1,0,false,"MY",0,0,2,0,"DF"]
[null,null,null,null,null,null,null,null,null,null,null,null,null,null,null,null,null,null,null,null,null,null,null,null,null,null,365,0,0,0,0,0,0,3,0,0,"TA",230,0,"NOFEE","NOFEE",1,0,"","","CALVIN LAU CHUEN YIEN","19 BU 7/8, BANDAR UTAMA, PETALING JAYA, SELANGOR","PJ","47800           ","SL","MY","","CALVINLAU@LAVINNY.COM","012-3993396                                                                                                                                           ","                                                                                                                                                      ","840331-14-5397","","KLCI",0,0,0,0,0,"",0,"N/A",0,0,"N/A","N/A","N/A","N/A","N/A",0,40928.425328159719,"mazuin",false,1,0,false,"MY",0,0,2,0,"DF"]
[null,null,null,null,null,null,null,null,null,null,null,null,null,null,null,null,null,null,null,null,null,null,null,null,null,null,365,0,0,0,0,0,0,3,0,0,"TA",19,0,"NOFEE","NOFEE",1,0,"","","MR ALEX CHIN YIN LIONG","Director, Care Ind Products Sdn Bhd 31-35 Jalan TPJ 9, Taman Perindustrian Jaya,","SESJ","47200           ","SEL","MY","","","                                                                                                                                                      ","                                                                                                                                                      ","12566 5-X","","KLCI",0,0,0,0,0,"",0,"N/A",0,0,"N/A","N/A","N/A","N/A","N/A",0,40683.435312499998,"arasu",false,1,0,false,"MY",0,0,2,0,"DF"]
[null,null,null,null,null,null,null,null,null,null,null,null,null,null,null,null,null,null,null,null,null,null,null,null,null,null,365,0,0,0,0,0,0,3,0,0,"TA",306,0,"NOFEE","NOFEE",1,0,"","","CHENG CHING LEANG","NO.36, JALAN SS 19/5B","SEL.","47500           ","","MA","","","013-3409456                                                                                                                                           ","                                                                                                                                                      ","640521-07-5637","","KLCI",0,0,0,0,0,"",0,"N/A",0,0,"N/A","N/A","N/A","N/A","N/A",0,41115.678940243059,"mazuin",false,1,0,false,"MY",0,0,2,0,"DF"]
[null,null,null,null,null,null,null,null,null,null,null,null,null,null,null,null,null,null,null,null,null,null,null,null,null,null,365,0,0,0,0,0,0,3,0,-1,"TA",20,0,"NOFEE","NOFEE",1,0,"","","MR KENNY YONG HAW NGEN","Finance Manager, Cement Ind. (Sabah) Sdn Bhd, Sepangar Industries Estate, P.O.Box 13525,","SBKK","88839           ","SAB","MY","hawngen@pd.jaring.my","","088-411006                                                                                                                                            ","088-411103                                                                                                                                            ","84476-D","","KLCI",0,0,0,0,0,"",0,"N/A",0,0,"N/A","N/A","N/A","N/A","N/A",0,40928.421995289355,"mazuin",false,1,0,false,"MY",0,0,2,0,"DF"]
[null,null,null,null,null,null,null,null,null,null,null,null,null,null,null,null,null,null,null,null,null,null,null,null,null,null,365,0,0,0,0,0,0,3,0,-1,"TA",21,0,"NOFEE","NOFEE",1,0,"","","DATO' CHAN KEONG HON","12 Jalan Kuantan,","WPKL","53200           ","WLP","MY","","","                                                                                                                                                      ","                                                                                                                                                      ","230911-10-5051","","KLCI",0,0,0,0,0,"",0,"N/A",0,0,"N/A","N/A","N/A","N/A","N/A",0,40928.421763460647,"mazuin",false,1,0,false,"MY",0,0,2,0,"DF"]
[null,null,null,null,null,null,null,null,null,null,null,null,null,null,null,null,null,null,null,null,null,null,null,null,null,null,365,0,0,0,0,0,0,3,0,-1,"TA",22,0,"NOFEE","NOFEE",1,0,"","","MR  CHEE KIN LOON","60 SS2/93,","SEPJ","47300           ","SEL","MY","","","                                                                                                                                                      ","                                                                                                                                                      ","A0642475","","KLCI",0,0,0,0,0,"",0,"N/A",0,0,"N/A","N/A","N/A","N/A","N/A",0,40928.421603506948,"mazuin",false,1,0,false,"MY",0,0,2,0,"DF"]
[null,null,null,null,null,null,null,null,null,null,null,null,null,null,null,null,null,null,null,null,null,null,null,null,null,null,365,1,0,0,0,0,0,3,0,-1,"TA",23,0,"0","0",1,0,"","","PUAN  MAZNAH ABDULLAH","The Head Of Investment, Commerce Life Assurance Bhd, Level 12, No 338, Jalan Tunku Abdul Rahman,","WPKL","50100           ","WLP","MY","","","                                                                                                                                                      ","                                                                                                                                                      ","197499-U","","KLCI",0,0,0,0,0,"",0,"N/A",0,0,"N/A","N/A","N/A","N/A","N/A",0,40928.425895138891,"mazuin",false,1,0,false,"MY",0,0,2,0,"DF"]
[null,null,null,null,null,null,null,null,null,null,null,null,null,null,null,null,null,null,null,null,null,null,null,null,null,null,365,0,0,0,0,0,0,3,0,-1,"TA",24,0,"NOFEE","NOFEE",1,0,"","","MR CHUNG MAN CHONG","C11-09 Marina Court Condo, Api Api Centre,","SBKK","88000           ","SAB","MY","","","                                                                                                                                                      ","                                                                                                                                                      ","H0133102","","KLCI",0,0,0,0,0,"",0,"N/A",0,0,"N/A","N/A","N/A","N/A","N/A",0,40928.421305208336,"mazuin",false,1,0,false,"MY",0,0,2,0,"DF"]
[null,null,null,null,null,null,null,null,null,null,null,null,null,null,null,null,null,null,null,null,null,null,null,null,null,null,365,0,0,0,0,0,0,3,0,1,"TA",25,0,"NOFEE","NOFEE",1,0,"","","MR CHUNG MAN CHONG","C11-09 Marina Court Condo, Api Api Centre,","SBKK","88000           ","SAB","MY","","","                                                                                                                                                      ","                                                                                                                                                      ","H0133102","","KLCI",0,0,0,0,0,"",0,"N/A",0,0,"N/A","N/A","N/A","N/A","N/A",0,40683.439745370371,"arasu",false,1,0,false,"MY",0,0,2,0,"DF"]
[null,null,null,null,null,null,null,null,null,null,null,null,null,null,null,null,null,null,null,null,null,null,null,null,null,null,365,0,0,0,0,0,0,3,0,1,"TA",339,0,"NOFEE","NOFEE",1,0,"","","CHAN POH KIM","UNIT 9A, 9TH FLOOR, WISMA  BUNI RAYA 10, JALAN RAJA LAUT"," KL","50350           ","WP","MY","","","012-2216239                                                                                                                                           ","                                                                                                                                                      ","E1107102A","","KLCI",0,0,0,0,0,"",0,"N/A",0,0,"N/A","N/A","N/A","N/A","N/A",0,40855.645196759258,"ken",false,1,0,false,"MY",0,0,2,0,"DF"]
[null,null,null,null,null,null,null,null,null,null,null,null,null,null,null,null,null,null,null,null,null,null,null,null,null,null,365,0,0,0,0,0,0,3,0,-1,"TA",100,0,"NOFEE","NOFEE",1,0,"","","MR CHIA SENG JOO","NO.12, JALN USJ 9/3D, SUBANG JAYA","USJ","47620           ","SEL","MY","","","03-56210596                                                                                                                                           ","03-56373853                                                                                                                                           ","680920-10-5449","","KLCI",0,0,0,0,0,"",0,"N/A",0,0,"N/A","N/A","N/A","N/A","N/A",0,40928.421124305554,"mazuin",false,1,0,false,"MY",0,0,2,0,"DF"]
[null,null,null,null,null,null,null,null,null,null,null,null,null,null,null,null,null,null,null,null,null,null,null,null,null,null,365,0,0,0,0,0,0,3,0,0,"TA",49,0,"NOFEE","NOFEE",1,0,"","","CHAN WAH KIANG","NO.3 LORONG GOLF, BANGI GOLF RESORT, BANDAR BARU BANGI, KAJANG","","43650           ","SEL","MY","","","012-3838495                                                                                                                                           ","                                                                                                                                                      ","591024-10-5811","","KLCI",0,0,0,0,0,"",0,"N/A",0,0,"N/A","N/A","N/A","N/A","N/A",0,40855.478622685187,"ken",false,1,0,false,"MY",0,0,2,0,"DF"]
[null,null,null,null,null,null,null,null,null,null,null,null,null,null,null,null,null,null,null,null,null,null,null,null,null,null,365,0,0,0,0,0,0,3,0,0,"TA",29,0,"NOFEE","NOFEE",1,0,"","","CHEONG WEN LEE","NO.13, JALAN BUKIT PRIMA 2D, TAMAN BUKIT PRIMA","KL","56000           ","W.P","MA","cheongwenlee@gmail.com","","012-3343329                                                                                                                                           ","                                                                                                                                                      ","760224-14-5623","","KLCI",0,0,0,0,0,"",0,"N/A",0,0,"N/A","N/A","N/A","N/A","N/A",0,40855.479050925926,"ken",false,1,0,false,"MY",0,0,2,0,"DF"]
[null,null,null,null,null,null,null,null,null,null,null,null,null,null,null,null,null,null,null,null,null,null,null,null,null,null,365,0,0,0,0,0,0,3,0,0,"TA",39,0,"NOFEE","NOFEE",1,0,"","","CHOON YOKE YING","no. 5, jalan 9/3","PJ","46000           ","SL","MA","alicechoon@gmail.com","","012-2277745                                                                                                                                           ","                                                                                                                                                      ","570501-08-7074","","KLCI",0,0,0,0,0,"",0,"N/A",0,0,"N/A","N/A","N/A","N/A","N/A",0,40855.479398148149,"ken",false,1,0,false,"MY",0,0,2,0,"DF"]
[null,null,null,null,null,null,null,null,null,null,null,null,null,null,null,null,null,null,null,null,null,null,null,null,null,null,365,0,0,0,0,0,0,3,0,-1,"TA",26,0,"0","0",1,0,"","","MR. DAVID LESLIE ALEXANDER HUN","Sinclair Knight Merz Sdn Bhd, Suite E-15-02, Block E, Plaza Mont Kiara , Mont Kiara,","WPKL","50480           ","WLP","MY","","","                                                                                                                                                      ","                                                                                                                                                      ","L5263953","","KLCI",0,0,0,0,0,"",0,"N/A",0,0,"N/A","N/A","N/A","N/A","N/A",0,40928.420932175926,"mazuin",false,1,0,false,"MY",0,0,2,0,"DF"]
[null,null,null,null,null,null,null,null,null,null,null,null,null,null,null,null,null,null,null,null,null,null,null,null,null,null,365,0,0,0,0,0,0,3,0,-1,"TA",27,0,"0","0",1,0,"","","","","","                ","","","","","                                                                                                                                                      ","                                                                                                                                                      ","","","KLCI",0,0,0,0,0,"",0,"N/A",0,0,"N/A","N/A","N/A","N/A","N/A",0,41143.417176157411,"jessica",false,1,0,false,"MY",0,0,2,0,"DF"]
[null,null,null,null,null,null,null,null,null,null,null,null,null,null,null,null,null,null,null,null,null,null,null,null,null,null,365,0,0,0,0,0,0,3,0,0,"TA",270,0,"NOFEE","NOFEE",1,0,"","","DUMMY","DUMMY","","                ",""," "," ","","                                                                                                                                                      ","                                                                                                                                                      "," ","","KLCI",0,0,0,0,0,"",0,"N/A",0,0,"N/A","N/A","N/A","N/A","N/A",0,41145.358447881947,"jessica",false,1,0,false,"MY",0,0,2,0,"DF"]
[null,null,null,null,null,null,null,null,null,null,null,null,null,null,null,null,null,null,null,null,null,null,null,null,null,null,365,0,0,0,0,0,0,3,0,-1,"TA",28,0,"NOFEE","NOFEE",1,0,"","","MR EDMUND.M.H.LEAN","LOT 9, JALAN PJS 11/1, BANDAR SUNWAY,","SESJ","46150           ","SEL","MY","","","                                                                                                                                                      ","                                                                                                                                                      ","570531-05-5539","","KLCI",0,0,0,0,0,"",0,"N/A",0,0,"N/A","N/A","N/A","N/A","N/A",0,40928.42061134259,"mazuin",false,1,0,false,"MY",0,0,2,0,"DF"]
[null,null,null,null,null,null,null,null,null,null,null,null,null,null,null,null,null,null,null,null,null,null,null,null,null,null,365,0,0,0,0,0,0,3,0,-1,"TA",29,0,"NOFEE","NOFEE",1,0,"","","MADAM LEE YIN","No 413 Taman Bersatu Bt 5 1/4, Pengkalan Kundur,","KDAS","06650           ","KED","MY","","","                                                                                                                                                      ","                                                                                                                                                      ","400207-08-5068","","KLCI",0,0,0,0,0,"",0,"N/A",0,0,"N/A","N/A","N/A","N/A","N/A",0,40928.420427893521,"mazuin",false,1,0,false,"MY",0,0,2,0,"DF"]
[null,null,null,null,null,null,null,null,null,null,null,null,null,null,null,null,null,null,null,null,null,null,null,null,null,null,365,0,0,0,0,0,0,3,0,1,"TA",30,0,"NOFEE","NOFEE",1,0,"","","","","","                ","","","","","                                                                                                                                                      ","                                                                                                                                                      ","","","KLCI",0,0,0,0,0,"",0,"N/A",0,0,"N/A","N/A","N/A","N/A","N/A",0,39917.624907407408,"mazuin",false,1,0,false,"MY",0,0,2,0,"DF"]
[null,null,null,null,null,null,null,null,null,null,null,null,null,null,null,null,null,null,null,null,null,null,null,null,null,null,365,0,0,0,0,0,0,3,0,-1,"TA",31,0,"NOFEE","NOFEE",1,0,"","","MR TAY KIM ANN","Director, Filtration Technology (M) Sdn Bhd NO. 31-35 Jalan TPJ 9, Taman Perindustrian Jaya,","SESJ","47200           ","SEL","MY","","","                                                                                                                                                      ","                                                                                                                                                      ","198376-U","","KLCI",0,0,0,0,0,"",0,"N/A",0,0,"N/A","N/A","N/A","N/A","N/A",0,40928.420204016205,"mazuin",false,1,0,false,"MY",0,0,2,0,"DF"]
[null,null,null,null,null,null,null,null,null,null,null,null,null,null,null,null,null,null,null,null,null,null,null,null,null,null,365,0,0,0,0,0,0,3,0,0,"TA",32,0,"NOFEE","NOFEE",1,0,"","","","","","                ","","","","","                                                                                                                                                      ","                                                                                                                                                      ","","","KLCI",0,0,0,0,0,"",0,"N/A",0,0,"N/A","N/A","N/A","N/A","N/A",0,40547.77443287037,"pleng",false,1,0,false,"MY",0,0,2,0,"DF"]
[null,null,null,null,null,null,null,null,null,null,null,null,null,null,null,null,null,null,null,null,null,null,null,null,null,null,0,0,0,0,0,0,0,3,0,0,"TA",311,0,"NOFEE","NOFEE",1,0,"","","GOH BOON HEONG & NG WHAI TECK","K-3A-03, BLOCK KASIH, M'AMAN CRIMSON, JALAN PJU 1A/41, PJU ARA JAYA,","SEPJ","47301           ","SEL","MY","aincgbh@gmail.com","","016-2222480                                                                                                                                           ","                                                                                                                                                      ","740906145585 ","","KLCI",0,0,0,0,0,"",0,"N/A",0,0,"","","","","",0,41170.72692306713,"hanina",false,1,1,false,"MY",0,-250,2,0,"DF"]
[null,null,null,null,null,null,null,null,null,null,null,null,null,null,null,null,null,null,null,null,null,null,null,null,null,null,365,0,0,0,0,0,0,3,0,0,"TA",350,0,"NOFEE","NOFEE",1,0,"","","GOH SEOW KHONG","NO. 23, JALAN BK 5B/1D, BANDAR KINRARA, 47180 PUCHONG, SELANGOR"," ","47180           ","SL","MY","","","012-2059600                                                                                                                                           ","                                                                                                                                                      ","680927-08-5401","","KLCI",0,0,0,0,0,"",0,"N/A",0,0,"N/A","N/A","N/A","N/A","N/A",0,41165.389301122683,"mazuin",false,1,0,false,"MY",0,0,2,0,"DF"]
[null,null,null,null,null,null,null,null,null,null,null,null,null,null,null,null,null,null,null,null,null,null,null,null,null,null,365,0,0,0,0,0,0,3,0,-1,"TA",33,0,"NOFEE","NOFEE",1,0,"","","ENCIK  HAFEZ BIN MOHAMED","NO. 8 JALAN SETIA MURNI 10, BUKIT DAMANSARA,","WPKL","50490           ","WLP","MY","hafez@allsports.com.my","","012-3020100                                                                                                                                           ","                                                                                                                                                      ","690719-01-5299","","KLCI",0,0,0,0,0,"",0,"N/A",0,0,"N/A","N/A","N/A","N/A","N/A",0,40928.420043136575,"mazuin",false,1,0,false,"MY",0,0,2,0,"DF"]
[null,null,null,null,null,null,null,null,null,null,null,null,null,null,null,null,null,null,null,null,null,null,null,null,null,null,365,0,0,0,0,0,0,3,0,-1,"TA",339,0,"NOFEE","NOFEE",1,0,"","","HARRISONS HOLDINGS (M) BERHAD","UNIT 9A, 9TH FLOOR, WISMA  BUNI RAYA, JALAN RAJA LAUT"," KL","50350           ","WP","MY","","","03-26983733                                                                                                                                           ","                                                                                                                                                      ","194675-H","","KLCI",0,0,0,0,0,"",0,"N/A",0,0,"N/A","N/A","N/A","N/A","N/A",0,40928.427695104168,"mazuin",false,1,0,false,"MY",0,0,2,0,"DF"]
[null,null,null,null,null,null,null,null,null,null,null,null,null,null,null,null,null,null,null,null,null,null,null,null,null,null,365,0,0,0,0,0,0,0,0,1,"TA",0,0,"NOFEE","NOFEE",0,0,"","","","","","                ","","","","","                                                                                                                                                      ","                                                                                                                                                      ","","","KLCI",0,0,0,0,0,"",0,"N/A",0,0,"N/A","N/A","N/A","N/A","N/A",0,39192.470416666663,"mazuin",false,0,0,false,"MY",0,0,2,0,"DF"]
[null,null,null,null,null,null,null,null,null,null,null,null,null,null,null,null,null,null,null,null,null,null,null,null,null,null,365,0,0,0,0,0,0,3,0,-1,"TA",34,0,"0","0",1,0,"","","MR DAVID HO CHAO CHUAN","BRIGHT SHELAND INTERNATIONAL CO.LTD, 23F-2, NO. 31, HAI PIEN ROAD,","TWKS","802             ","TAI","TW","","","                                                                                                                                                      ","                                                                                                                                                      ","","","KLCI",0,0,0,0,0,"",0,"N/A",0,0,"N/A","N/A","N/A","N/A","N/A",0,40928.419801886572,"mazuin",false,1,0,false,"MY",0,0,2,0,"DF"]
[null,null,null,null,null,null,null,null,null,null,null,null,null,null,null,null,null,null,null,null,null,null,null,null,null,null,365,0,0,0,0,0,0,3,0,0,"TA",316,0,"NOFEE","NOFEE",1,0,"","","MR HENG HOI NONG","NO.9 JLN. BUNGA RAYA 2/8","S.ALM","40000           ","SEL","MY","","","016-3331325                                                                                                                                           ","                                                                                                                                                      ","471223-10-5338","","KLCI",0,0,0,0,0,"",0,"N/A",0,0,"N/A","N/A","N/A","N/A","N/A",0,40855.479872685188,"ken",false,1,0,false,"MY",0,0,2,0,"DF"]
[null,null,null,null,null,null,null,null,null,null,null,null,null,null,null,null,null,null,null,null,null,null,null,null,null,null,365,0,0,0,0,0,0,3,0,-1,"TA",35,0,"NOFEE","NOFEE",1,0,"","","MADAM HUANG JUI-MEI","1 Regat Larut, Taman Lake View, 34000 Taiping,","PETP","34000           ","PER","MY","","","                                                                                                                                                      ","                                                                                                                                                      ","","","KLCI",0,0,0,0,0,"",0,"N/A",0,0,"N/A","N/A","N/A","N/A","N/A",0,40928.419589386576,"mazuin",false,1,0,false,"MY",0,0,2,0,"DF"]
[null,null,null,null,null,null,null,null,null,null,null,null,null,null,null,null,null,null,null,null,null,null,null,null,null,null,365,0,0,0,0,0,0,3,0,0,"TA",51,0,"NOFEE","NOFEE",1,0,"","","HO YAW HUEI","NO.2A, LARONG PJU 1/46D, AMAN SURIA DAMANSARA","PETAL","47301           ","SEL.","","yhho73@streamyx.com","","012-9796369                                                                                                                                           ","                                                                                                                                                      ","730108-08-5363","","KLCI",0,0,0,0,0,"",0,"N/A",0,0,"N/A","N/A","N/A","N/A","N/A",0,40855.481261574074,"ken",false,1,0,false,"MY",0,0,2,0,"DF"]
[null,null,null,null,null,null,null,null,null,null,null,null,null,null,null,null,null,null,null,null,null,null,null,null,null,null,365,0,0,0,0,0,0,3,0,1,"TA",36,0,"NOFEE","NOFEE",1,0,"","","DR CHAN SAU MENG","PENT HOUSE & MENARA CHAN, 138, JALAN AMPANG,","WPKL","50450           ","WLP","MY","","","                                                                                                                                                      ","                                                                                                                                                      ","","","KLCI",0,0,0,0,0,"",0,"N/A",0,0,"N/A","N/A","N/A","N/A","N/A",0,39912.626018518517,"mazuin",false,1,0,false,"MY",0,0,2,0,"DF"]
[null,null,null,null,null,null,null,null,null,null,null,null,null,null,null,null,null,null,null,null,null,null,null,null,null,null,365,0,0,0,0,0,0,3,0,1,"TA",37,0,"NOFEE","NOFEE",1,0,"","","","","","                ","","","","","                                                                                                                                                      ","                                                                                                                                                      ","","","KLCI",0,0,0,0,0,"",0,"N/A",0,0,"N/A","N/A","N/A","N/A","N/A",0,39917.625173611108,"mazuin",false,1,0,false,"MY",0,0,2,0,"DF"]
[null,null,null,null,null,null,null,null,null,null,null,null,null,null,null,null,null,null,null,null,null,null,null,null,null,null,365,0,0,0,0,0,0,3,0,-1,"TA",38,0,"NOFEE","NOFEE",1,0,"","","MR  KANG KIAN KIAT","c/o Yong Dan Mohamed Faiz Sdn Bhd, 51-10 Boulevart Mid Valley City Lingkaran Syed Putra,","WPKL","59200           ","WLP","MY","","","                                                                                                                                                      ","                                                                                                                                                      ","","","KLCI",0,0,0,0,0,"",0,"N/A",0,0,"N/A","N/A","N/A","N/A","N/A",0,40928.41917789352,"mazuin",false,1,0,false,"MY",0,0,2,0,"DF"]
[null,null,null,null,null,null,null,null,null,null,null,null,null,null,null,null,null,null,null,null,null,null,null,null,null,null,365,0,0,0,0,0,0,3,0,1,"TA",39,0,"NOFEE","NOFEE",1,0,"","","MR ANG KOK SEONG","5 Jalan 1/8, Taman Merbok Seksyen 1,","MEBA","75450           ","MEL","MY","","","                                                                                                                                                      ","                                                                                                                                                      ","","","KLCI",0,0,0,0,0,"",0,"N/A",0,0,"N/A","N/A","N/A","N/A","N/A",0,39919.676064814812,"mazuin",false,1,0,false,"MY",0,0,2,0,"DF"]
[null,null,null,null,null,null,null,null,null,null,null,null,null,null,null,null,null,null,null,null,null,null,null,null,null,null,365,0,0,0,0,0,0,3,0,1,"TA",101,0,"NOFEE","NOFEE",1,0,"","","","","","                ","","","","","                                                                                                                                                      ","                                                                                                                                                      ","","","KLCI",0,0,0,0,0,"",0,"N/A",0,0,"N/A","N/A","N/A","N/A","N/A",0,39624.459780092591,"pleng",false,1,0,false,"MY",0,0,2,0,"DF"]
[null,null,null,null,null,null,null,null,null,null,null,null,null,null,null,null,null,null,null,null,null,null,null,null,null,null,365,0,0,0,0,0,0,3,0,-1,"TA",40,0,"NOFEE","NOFEE",1,0,"","","MR ANG KWEE LAM","No.1 Jalan Kasturi 1/3, Taman Kasturi","MESM","75050           ","MEL","MY","","","                                                                                                                                                      ","                                                                                                                                                      ","","","KLCI",0,0,0,0,0,"",0,"N/A",0,0,"N/A","N/A","N/A","N/A","N/A",0,40928.418813888886,"mazuin",false,1,0,false,"MY",0,0,2,0,"DF"]
[null,null,null,null,null,null,null,null,null,null,null,null,null,null,null,null,null,null,null,null,null,null,null,null,null,null,365,0,0,0,0,0,0,3,0,0,"TA",345,0,"NOFEE","NOFEE",1,0,"","","LAU KIN WAI","315-F RIANA GREEN, JALAN TROPICANA UTARA, 47410 PETALING JAYA, SELANGOR."," ","47410           "," ","MY","","","012-50273588                                                                                                                                          ","                                                                                                                                                      ","760429-08-5505","","KLCI",0,0,0,0,0,"",0,"N/A",0,0,"N/A","N/A","N/A","N/A","N/A",0,41085.388906365741,"mazuin",false,1,0,false,"MY",0,0,2,0,"DF"]
[null,null,null,null,null,null,null,null,null,null,null,null,null,null,null,null,null,null,null,null,null,null,null,null,null,null,365,0,0,0,0,0,0,3,0,1,"TA",41,0,"NOFEE","NOFEE",1,0,"","","","","","                ","","","","","                                                                                                                                                      ","                                                                                                                                                      ","","","KLCI",0,0,0,0,0,"",0,"N/A",0,0,"N/A","N/A","N/A","N/A","N/A",0,39919.676226851851,"mazuin",false,1,0,false,"MY",0,0,2,0,"DF"]
[null,null,null,null,null,null,null,null,null,null,null,null,null,null,null,null,null,null,null,null,null,null,null,null,null,null,365,0,0,0,0,0,0,3,0,0,"TA",42,0,"NOFEE","NOFEE",1,0,"","","MR LEE FOO SANG","46 LORONG ZAABA, TAMAN TUN DR. ISMAIL","","60000           ","KL","MY","foosanglee@yahoo.com","","016-2156082, 03-77271232                                                                                                                              ","                                                                                                                                                      ","","","KLCI",0,0,0,0,0,"",0,"N/A",0,0,"N/A","N/A","N/A","N/A","N/A",0,40604.488958333335,"ken",false,1,0,false,"MY",0,0,2,0,"DF"]
[null,null,null,null,null,null,null,null,null,null,null,null,null,null,null,null,null,null,null,null,null,null,null,null,null,null,365,0,0,0,0,0,0,3,0,0,"TA",317,0,"NOFEE","NOFEE",1,0,"","","MR LIEW HIN CHOY","NO.5, JLN. USJ 6/2D, UEP SUBANG JAYA","SJ","47610           ","SEL","MY","edlkc@streamyx.com","","016-2692393                                                                                                                                           ","03-56376693                                                                                                                                           ","581001-10-5997","","KLCI",0,0,0,0,0,"",0,"N/A",0,0,"N/A","N/A","N/A","N/A","N/A",0,41015.607939930553,"mazuin",false,1,0,false,"MY",0,0,2,0,"DF"]
[null,null,null,null,null,null,null,null,null,null,null,null,null,null,null,null,null,null,null,null,null,null,null,null,null,null,365,0,0,0,0,0,0,3,0,-1,"TA",43,0,"NOFEE","NOFEE",1,0,"","","MADAM LIONG HOOILEE @ LEONG HO","12, MADIGEN DRE, GLEN WAVERLEY,","AUVI","3150            ","MLB","AU","dseah@gmspacific.com","","                                                                                                                                                      ","                                                                                                                                                      ","","","KLCI",0,0,0,0,0,"",0,"N/A",0,0,"N/A","N/A","N/A","N/A","N/A",0,40975.390825312497,"mazuin",false,1,0,false,"MY",0,0,2,0,"DF"]
[null,null,null,null,null,null,null,null,null,null,null,null,null,null,null,null,null,null,null,null,null,null,null,null,null,null,365,0,0,0,0,0,0,3,0,0,"TA",19,0,"NOFEE","NOFEE",1,0,"","","LAI KWOK WAI","16, JALAN DAGANG PERMAI3, TAMAN DAGANG PERMAI BARAT","AMPAN","68000           ","SEL","","","","012-2737168                                                                                                                                           ","                                                                                                                                                      ","700817-08-5545","","KLCI",0,0,0,0,0,"",0,"N/A",0,0,"N/A","N/A","N/A","N/A","N/A",0,40855.481921296298,"ken",false,1,0,false,"MY",0,0,2,0,"DF"]
[null,null,null,null,null,null,null,null,null,null,null,null,null,null,null,null,null,null,null,null,null,null,null,null,null,null,365,0,0,0,0,0,0,3,0,1,"TA",369,0,"NOFEE","NOFEE",1,0,"","","LIM KEE YEONG HOLDINGS SDN BHD","NO. 25, PERSIARAN INDUSTRI, BANDAR SRI DAMANSARA","KL","52200           ","W.P","MY","","","019-2205818                                                                                                                                           ","                                                                                                                                                      ","153881-P","","KLCI",0,0,0,0,0,"",0,"N/A",0,0,"N/A","N/A","N/A","N/A","N/A",0,40325.513541666667,"mazuin",false,1,0,false,"MY",0,0,2,0,"DF"]
[null,null,null,null,null,null,null,null,null,null,null,null,null,null,null,null,null,null,null,null,null,null,null,null,null,null,365,0,0,0,0,0,0,3,0,1,"TA",43,0,"NOFEE","NOFEE",1,0,"","","","","","                ","","","","","                                                                                                                                                      ","                                                                                                                                                      ","","","KLCI",0,0,0,0,0,"",0,"N/A",0,0,"N/A","N/A","N/A","N/A","N/A",0,39611.42633101852,"mazuin",false,1,0,false,"MY",0,0,2,0,"DF"]
[null,null,null,null,null,null,null,null,null,null,null,null,null,null,null,null,null,null,null,null,null,null,null,null,null,null,365,0,0,0,0,0,0,3,0,0,"TA",205,0,"NOFEE","NOFEE",1,0,"","","MR LEAN MUN HUAT","LOT 9, JALAN PJS 11/1, BANDAR SUNWAY","USJ","46150           ","SEL","MA","edmund@anchoret.com.my","","012-2972618                                                                                                                                           ","03-56342506                                                                                                                                           ","570521-05-5539","","KLCI",0,0,0,0,0,"",0,"N/A",0,0,"N/A","N/A","N/A","N/A","N/A",0,40855.482141203705,"ken",false,1,0,false,"MY",0,0,2,0,"DF"]
[null,null,null,null,null,null,null,null,null,null,null,null,null,null,null,null,null,null,null,null,null,null,null,null,null,null,365,0,0,0,0,0,0,3,0,1,"TA",394,0,"NOFEE","NOFEE",1,0,"","","LEE MEI MING","LOT 10740, JLN. 5, DESA ROS, KAJANG","  ","43000           ","SEL","MY","","","016-7153628                                                                                                                                           ","                                                                                                                                                      ","750709-10-5268","","KLCI",0,0,0,0,0,"",0,"N/A",0,0,"N/A","N/A","N/A","N/A","N/A",0,40536.668240740742,"ken",false,1,0,false,"MY",0,0,2,0,"DF"]
[null,null,null,null,null,null,null,null,null,null,null,null,null,null,null,null,null,null,null,null,null,null,null,null,null,null,365,0,0,0,0,0,0,3,0,-1,"TA",44,0,"NOFEE","NOFEE",1,0,"","","MADAM YEOW LEE FONG","A 1202, PRIMA 16, 1, JALAN 16/18,","SEPJ","46350           ","SEL","MY","","","                                                                                                                                                      ","                                                                                                                                                      ","","","KLCI",0,0,0,0,0,"",0,"N/A",0,0,"N/A","N/A","N/A","N/A","N/A",0,40928.418184837959,"mazuin",false,1,0,false,"MY",0,0,2,0,"DF"]
[null,null,null,null,null,null,null,null,null,null,null,null,null,null,null,null,null,null,null,null,null,null,null,null,null,null,365,0,0,0,0,0,0,3,0,-1,"TA",45,0,"NOFEE","NOFEE",1,0,"","","DATO' LIEW YEW CHUNG","Director, London Biscuits Berhad No.1 Jalan Istimewa 2, Taman Perindustrian Desa Cemerlang,","JOUT","81800           ","JOH","MY","","","                                                                                                                                                      ","                                                                                                                                                      ","","","KLCI",0,0,0,0,0,"",0,"N/A",0,0,"N/A","N/A","N/A","N/A","N/A",0,40928.418028125001,"mazuin",false,1,0,false,"MY",0,0,2,0,"DF"]
[null,null,null,null,null,null,null,null,null,null,null,null,null,null,null,null,null,null,null,null,null,null,null,null,null,null,365,0,0,0,0,0,0,3,0,-1,"TA",46,0,"NOFEE","NOFEE",1,0,"","","MR  LAWRENCE PEREIRA","99 Lorong Zaaba, Taman Tun Dr Ismail,","WPKL","60000           ","WLP","MY","","","                                                                                                                                                      ","                                                                                                                                                      ","","","KLCI",0,0,0,0,0,"",0,"N/A",0,0,"N/A","N/A","N/A","N/A","N/A",0,40928.417860381946,"mazuin",false,1,0,false,"MY",0,0,2,0,"DF"]
[null,null,null,null,null,null,null,null,null,null,null,null,null,null,null,null,null,null,null,null,null,null,null,null,null,null,365,0,0,0,0,0,0,3,0,1,"TA",50,0,"NOFEE","NOFEE",1,0,"","","LIM SOON HOCK","NO.2A, JALAN SL 3/3, BANDAR SG. LONG","KAJNG","43000           ","SEL","","shlim8@pd.jaring.my","","016-3329281                                                                                                                                           ","                                                                                                                                                      ","531125-10-5475","","KLCI",0,0,0,0,0,"",0,"N/A",0,0,"N/A","N/A","N/A","N/A","N/A",0,40385.628819444442,"mazuin",false,1,0,false,"MY",0,0,2,0,"DF"]
[null,null,null,null,null,null,null,null,null,null,null,null,null,null,null,null,null,null,null,null,null,null,null,null,null,null,365,0,0,0,0,0,0,3,0,0,"TA",369,0,"NOFEE","NOFEE",1,0,"","","LIEW SIN KONG","2-12-2, ENDAH VILLA CONDO, JALAN 2/149B, TMN. SRI ENDAH, SRI PETALING","","57000           ","KL","MY","","","012-3255311                                                                                                                                           ","                                                                                                                                                      ","730100-14-5461","","KLCI",0,0,0,0,0,"",0,"N/A",0,0,"N/A","N/A","N/A","N/A","N/A",0,40855.48232638889,"ken",false,1,0,false,"MY",0,0,2,0,"DF"]
[null,null,null,null,null,null,null,null,null,null,null,null,null,null,null,null,null,null,null,null,null,null,null,null,null,null,365,0,0,0,0,0,0,3,0,-1,"TA",47,0,"NOFEE","NOFEE",1,0,"","","MR LIM WEI FOOK","CATHAY MOTOR (M) SDN BHD, CATHAY BEARINGS SDN BHD 25, PERSIARAN INDUSTRI BANDAR SRI DAMANSARA,","WPKL","52200           ","WLP","MY","cathaygp@tm.net.my","","019-2205818                                                                                                                                           ","                                                                                                                                                      ","560423-10-5521","","KLCI",0,0,0,0,0,"",0,"N/A",0,0,"N/A","N/A","N/A","N/A","N/A",0,40928.4308121875,"mazuin",false,1,0,false,"MY",0,0,2,0,"DF"]
[null,null,null,null,null,null,null,null,null,null,null,null,null,null,null,null,null,null,null,null,null,null,null,null,null,null,365,0,0,0,0,0,0,3,0,-1,"TA",20,0,"NOFEE","NOFEE",1,0,"","","LEE WANG WANG","NO.4, JALAN SS 3/41A","PJ","47300           ","SL","MY","leewangwang@hotmail.com","","016-2082800                                                                                                                                           ","                                                                                                                                                      ","","","KLCI",0,0,0,0,0,"",0,"N/A",0,0,"N/A","N/A","N/A","N/A","N/A",0,40928.417645868052,"mazuin",false,1,0,false,"MY",0,0,2,0,"DF"]
[null,null,null,null,null,null,null,null,null,null,null,null,null,null,null,null,null,null,null,null,null,null,null,null,null,null,365,0,0,0,0,0,0,3,0,0,"TA",48,0,"NOFEE","NOFEE",1,0,"","","riskk.com","RISKK.COM","","                ","","","","","                                                                                                                                                      ","                                                                                                                                                      ","","","KLCI",0,0,0,0,0,"",0,"N/A",0,0,"N/A","N/A","N/A","N/A","N/A",0,40913.372349884259,"hanina",false,1,0,false,"MY",0,0,2,0,"DF"]
[null,null,null,null,null,null,null,null,null,null,null,null,null,null,null,null,null,null,null,null,null,null,null,null,null,null,365,0,0,0,0,0,0,3,0,0,"TA",49,0,"NOFEE","NOFEE",1,0,"","","Sally Soh","","","                ","","","mapt@streamyx.com","","                                                                                                                                                      ","                                                                                                                                                      ","","","KLCI",0,0,0,0,0,"",0,"N/A",0,0,"N/A","N/A","N/A","N/A","N/A",0,40547.774733796294,"pleng",false,1,0,false,"MY",0,0,2,0,"DF"]
[null,null,null,null,null,null,null,null,null,null,null,null,null,null,null,null,null,null,null,null,null,null,null,null,null,null,365,0,0,0,0,0,0,3,0,-1,"TA",50,0,"NOFEE","NOFEE",1,0,"","","PUAN  MARINA KAMALIAH BINTI AN","No. 8, Jalan Setia Murni 10, Bukit Damansara,","WPKL","50490           ","WLP","MY","","","                                                                                                                                                      ","                                                                                                                                                      ","","","KLCI",0,0,0,0,0,"",0,"N/A",0,0,"N/A","N/A","N/A","N/A","N/A",0,40928.431144062502,"mazuin",false,1,0,false,"MY",0,0,2,0,"DF"]
[null,null,null,null,null,null,null,null,null,null,null,null,null,null,null,null,null,null,null,null,null,null,null,null,null,null,365,0,0,0,0,0,0,3,0,0,"TA",342,0,"NOFEE","NOFEE",1,0,"","","MATTHEW TEE KAI WOON","NO.9 LINGKUNG DUTAMAS, DUTA TROPIKA, JLN SRI HARTAMAS"," ","50480           ","KL","MY","","","012-3777682, 03-61363333                                                                                                                              ","                                                                                                                                                      ","751125-14-5009","","KLCI",0,0,0,0,0,"",0,"N/A",0,0,"N/A","N/A","N/A","N/A","N/A",0,40855.482546296298,"ken",false,1,0,false,"MY",0,0,2,0,"DF"]
[null,null,null,null,null,null,null,null,null,null,null,null,null,null,null,null,null,null,null,null,null,null,null,null,null,null,365,0,0,0,0,0,0,3,0,-1,"TA",51,0,"NOFEE","NOFEE",1,0,"","","MADAM MELINDA CHIA YUET YOONG","9 Jalan Jemerlang Kuning, Sierramas,","SEBH","47000           ","SEL","MY","","","                                                                                                                                                      ","                                                                                                                                                      ","","","KLCI",0,0,0,0,0,"",0,"N/A",0,0,"N/A","N/A","N/A","N/A","N/A",0,40928.417411539354,"mazuin",false,1,0,false,"MY",0,0,2,0,"DF"]
[null,null,null,null,null,null,null,null,null,null,null,null,null,null,null,null,null,null,null,null,null,null,null,null,null,null,365,0,0,0,0,0,0,3,0,1,"TA",62,0,"NOFEE","NOFEE",1,0,"","","CHUNG MAN CHONG","C11-09, MARINA COURT, API API CENTRE, KOTA KINABALU","K.K","88000           ","","SB","robertchungmc@hotmail.com","","019-8506566                                                                                                                                           ","                                                                                                                                                      ","510705-12-5285","","KLCI",0,0,0,0,0,"",0,"N/A",0,0,"N/A","N/A","N/A","N/A","N/A",0,40827.420405092591,"mazuin",false,1,0,false,"MY",0,0,2,0,"DF"]
[null,null,null,null,null,null,null,null,null,null,null,null,null,null,null,null,null,null,null,null,null,null,null,null,null,null,365,0,0,0,0,0,0,3,0,0,"TA",52,0,"NOFEE","NOFEE",1,0,"","","ENCIK  MOHAMAD FAIZ BIN ABDUL ","79, Persiaran Impian Gemilang, Saujana Impian, ","Kajng","43000           ","SEL","MY","","Ref: Mr. Faiz","012-2396872                                                                                                                                           ","                                                                                                                                                      ","","","KLCI",0,0,0,0,0,"",0,"N/A",0,0,"N/A","N/A","N/A","N/A","N/A",0,40604.492268518516,"ken",false,1,0,false,"MY",0,0,2,0,"DF"]
[null,null,null,null,null,null,null,null,null,null,null,null,null,null,null,null,null,null,null,null,null,null,null,null,null,null,365,0,0,0,0,0,0,3,0,-1,"TA",272,0,"NOFEE","NOFEE",1,0,"","","MAK FONG MEE","C/O TA INVESTMENT MANAGEMENT BERHAD"," KL","50250           ","","MY","","","016-3023862                                                                                                                                           ","                                                                                                                                                      ","651128-05-5190","","KLCI",0,0,0,0,0,"",0,"N/A",0,0,"N/A","N/A","N/A","N/A","N/A",0,41066.514131053242,"jessica",false,1,0,false,"MY",0,0,2,0,"DF"]
[null,null,null,null,null,null,null,null,null,null,null,null,null,null,null,null,null,null,null,null,null,null,null,null,null,null,365,0,0,0,0,0,0,3,0,-1,"TA",53,0,"NOFEE","NOFEE",1,0,"","","MADAM LING KOK ING","1 Jalan BU 7/4, Bandar Utama,","SEPJ","47800           ","SEL","MY","","","                                                                                                                                                      ","                                                                                                                                                      ","","","KLCI",0,0,0,0,0,"",0,"N/A",0,0,"N/A","N/A","N/A","N/A","N/A",0,40928.416763344911,"mazuin",false,1,0,false,"MY",0,0,2,0,"DF"]
[null,null,null,null,null,null,null,null,null,null,null,null,null,null,null,null,null,null,null,null,null,null,null,null,null,null,365,0,0,0,0,0,0,3,0,-1,"TA",54,0,"NOFEE","NOFEE",1,0,"","","MR MUNIANDY A/L NALAIAH","Lot 96 No 2 Jalan Cinta Alam, Country Heights,","SEKJ","43000           ","SEL","MY","","","                                                                                                                                                      ","                                                                                                                                                      ","","","KLCI",0,0,0,0,0,"",0,"N/A",0,0,"N/A","N/A","N/A","N/A","N/A",0,40928.41660478009,"mazuin",false,1,0,false,"MY",0,0,2,0,"DF"]
[null,null,null,null,null,null,null,null,null,null,null,null,null,null,null,null,null,null,null,null,null,null,null,null,null,null,365,0,0,0,0,0,0,0,0,0,"TA",82,0,"NOFEE","NOFEE",0,0,"","","Mr. Jimmy Duis","4, Lorong Nibung 6, Taman Siputeh, 88300 Kota Kinabalu, Sabah","K.K","88300           ","Sabah","M","","","088-222852                                                                                                                                            ","                                                                                                                                                      ","","","KLCI",0,0,0,0,0,"",0,"",0,0,"N/A","N/A","N/A","N/A","N/A",0,40647.743391203701,"mazuin",false,1,0,false,"MY",0,0,2,0,"DF"]
[null,null,null,null,null,null,null,null,null,null,null,null,null,null,null,null,null,null,null,null,null,null,null,null,null,null,365,0,0,0,0,0,0,3,0,0,"TA",55,0,"NOFEE","NOFEE",1,0,"","","MR ALLAN ONG KHAY SOON","42 Bliga Cres, Malabar 2036, NSW 2036,","AUSD","2036            ","NSW","AU","","","                                                                                                                                                      ","                                                                                                                                                      ","","","KLCI",0,0,0,0,0,"",0,"N/A",0,0,"N/A","N/A","N/A","N/A","N/A",0,40928.453963425927,"mazuin",false,1,0,false,"MY",0,0,2,0,"DF"]
[null,null,null,null,null,null,null,null,null,null,null,null,null,null,null,null,null,null,null,null,null,null,null,null,null,null,365,0,0,0,0,0,0,3,0,0,"TA",3,0,"NOFEE","NOFEE",1,0,"","","ONG WENG HOONG","22, JALAN PUTRA BISTARI 2/2A, PUTRA HEIGHTS, SUBANG JAYA","","47650           ","SEL","MY","owhoong@tm.net.my","","012-3731073                                                                                                                                           ","03-51911294                                                                                                                                           ","731003-08-5767","","KLCI",0,0,0,0,0,"",0,"N/A",0,0,"N/A","N/A","N/A","N/A","N/A",0,40927.382523761575,"mazuin",false,1,0,false,"MY",0,0,2,0,"DF"]
[null,null,null,null,null,null,null,null,null,null,null,null,null,null,null,null,null,null,null,null,null,null,null,null,null,null,365,0,0,0,0,0,0,3,0,1,"TA",92,0,"NOFEE","NOFEE",1,0,"","","","","","                ","","","","","                                                                                                                                                      ","                                                                                                                                                      ","","","KLCI",0,0,0,0,0,"",0,"N/A",0,0,"N/A","N/A","N/A","N/A","N/A",0,39919.676550925928,"mazuin",false,1,0,false,"MY",0,0,2,0,"DF"]
[null,null,null,null,null,null,null,null,null,null,null,null,null,null,null,null,null,null,null,null,null,null,null,null,null,null,365,0,0,0,0,0,0,3,0,0,"TA",56,0,"NOFEE","NOFEE",1,0,"","","Encik Joidin Gahim","LOT 1.22, 2.22 & 3.22, KOMPLEKS ASIA CITY, KOTA KINABALU, SABAH, MALAYSIA"," ","88000           ","","MY","prsb1@tm.net.my","","088-216525                                                                                                                                            ","088-221607                                                                                                                                            ","","","KLCI",0,0,0,0,0,"",0,"N/A",0,0,"N/A","N/A","N/A","N/A","N/A",0,40753.653634259259,"pleng",false,1,0,false,"MY",0,0,2,0,"DF"]
[null,null,null,null,null,null,null,null,null,null,null,null,null,null,null,null,null,null,null,null,null,null,null,null,null,null,365,0,0,0,0,0,0,3,0,-1,"TA",57,0,"NOFEE","NOFEE",1,0,"","","MADAM LAU PHAIH YEAN","53 JALAN BU 4/11 Bandar Utama,","SEPJ","47800           ","SEL","MY","","","                                                                                                                                                      ","                                                                                                                                                      ","","","KLCI",0,0,0,0,0,"",0,"N/A",0,0,"N/A","N/A","N/A","N/A","N/A",0,40928.416290081019,"mazuin",false,1,0,false,"MY",0,0,2,0,"DF"]
[null,null,null,null,null,null,null,null,null,null,null,null,null,null,null,null,null,null,null,null,null,null,null,null,null,null,365,0,0,0,0,0,0,3,0,0,"TA",58,0,"NOFEE","NOFEE",1,0,"","","DATUK RUBY LEE","No.51 Jalan  5/4H,","SEPJ","46000           ","SEL","MY","","","                                                                                                                                                      ","                                                                                                                                                      ","","","KLCI",0,0,0,0,0,"",0,"N/A",0,0,"N/A","N/A","N/A","N/A","N/A",0,41015.485348807873,"mazuin",false,1,0,false,"MY",0,0,2,0,"DF"]
[null,null,null,null,null,null,null,null,null,null,null,null,null,null,null,null,null,null,null,null,null,null,null,null,null,null,365,0,0,0,0,0,0,3,0,0,"TA",227,0,"NOFEE","NOFEE",1,0,"","","ALWIN THIAN PHAIK YEONG","40 PSN WANGSA BAIDURI 3,","SJ","47500           ","SL","MY","","athian@streamyx.com","03-56382030/012-2501120                                                                                                                               ","                                                                                                                                                      ","661201-10-6206","","KLCI",0,0,0,0,0,"",0,"N/A",0,0,"N/A","N/A","N/A","N/A","N/A",0,40647.700787037036,"mazuin",false,1,0,false,"MY",0,0,2,0,"DF"]
[null,null,null,null,null,null,null,null,null,null,null,null,null,null,null,null,null,null,null,null,null,null,null,null,null,null,365,0,0,0,0,0,0,3,0,0,"TA",395,0,"NOFEE","NOFEE",1,0,"","","CHEAH AH CHOO@CHEAH SEOW CHOO","86, JALAN THEATRE"," IP","30300           ","PR","MY","","","019-5557637, 05-2882540                                                                                                                               ","                                                                                                                                                      ","440515-08-6157","","KLCI",0,0,0,0,0,"",0,"N/A",0,0,"N/A","N/A","N/A","N/A","N/A",0,40647.700925925928,"mazuin",false,1,0,false,"MY",0,0,2,0,"DF"]
[null,null,null,null,null,null,null,null,null,null,null,null,null,null,null,null,null,null,null,null,null,null,null,null,null,null,365,0,0,0,0,0,0,3,0,0,"TA",397,0,"NOFEE","NOFEE",1,0,"","","CHUA AH LAK","E2-29-2, BUKIT UTAMA CONDO 1, CHANGAT BUKIT UTAMA, BANDAR UTAMA, PETALING JAYA, 47800 SELANGOR"," PJ","47800           ","SL","MY","","alanchua888@gmail.com","012-8885080                                                                                                                                           ","                                                                                                                                                      ","480628-01-5167","","KLCI",0,0,0,0,0,"",0,"N/A",0,0,"N/A","N/A","N/A","N/A","N/A",0,40707.417071759257,"hanina",false,1,0,false,"MY",0,0,2,0,"DF"]
[null,null,null,null,null,null,null,null,null,null,null,null,null,null,null,null,null,null,null,null,null,null,null,null,null,null,365,0,0,0,0,0,0,3,0,0,"TA",418,0,"NOFEE","NOFEE",1,0,"","","CAROLINE CHIN LEH HOON","NO. 13, JALAN SL 14/2, BANDAR SG. LONG, 43000, KACANG, SELANGOR"," ","43000           ","SL","MY","","","012-3733249                                                                                                                                           ","                                                                                                                                                      ","690411-10-5714","","KLCI",0,0,0,0,0,"",0,"N/A",0,0,"N/A","N/A","N/A","N/A","N/A",0,41171.397043171295,"mazuin",false,1,0,false,"MY",0,0,2,0,"DF"]
[null,null,null,null,null,null,null,null,null,null,null,null,null,null,null,null,null,null,null,null,null,null,null,null,null,null,365,0,0,0,0,0,0,3,0,0,"TA",241,0,"NOFEE","NOFEE",1,0,"","","CHIN CHOY HOONG","303, BLOCK 4, PKNS APARTMENT, JALAN 4M, AMPANG JAYA, 68000 AMPANG, SELANGOR.","","68000           ","SEL","MY","lilian6183@yahoo.com","","03-42526422 /012-2066183                                                                                                                              ","                                                                                                                                                      ","570925-10-6320","","KLCI",0,0,0,0,0,"",0,"N/A",0,0,"N/A","N/A","N/A","N/A","N/A",0,40709.429201388892,"hanina",false,1,0,false,"MY",0,0,2,0,"DF"]
[null,null,null,null,null,null,null,null,null,null,null,null,null,null,null,null,null,null,null,null,null,null,null,null,null,null,365,0,0,0,0,0,0,3,0,0,"TA",354,0,"NOFEE","NOFEE",1,0,"","","CHAN CHEE KIN","18 JALAN WAWASAN 1/5, PUSAT BANDAR PUCHONG, PUCHONG 47100 SELANGOR","PC","47100           ","SL","MY","","","012-3008822                                                                                                                                           ","                                                                                                                                                      ","610714-04-5015","","KLCI",0,0,0,0,0,"",0,"N/A",0,0,"N/A","N/A","N/A","N/A","N/A",0,40746.739201388889,"jessica",false,1,0,false,"MY",0,0,2,0,"DF"]
[null,null,null,null,null,null,null,null,null,null,null,null,null,null,null,null,null,null,null,null,null,null,null,null,null,null,365,0,0,0,0,0,0,3,0,1,"TA",363,0,"NOFEE","NOFEE",1,0,"","","CHUA ENG HO WA'A @ CHUA ENG WAH","6 JLN. BAYU 5-1, BUKIT AITA BAYU, SERI KEMBANGAN"," SL","43300           "," ","MY","","","                                                                                                                                                      ","                                                                                                                                                      ","A0292422","","KLCI",0,0,0,0,0,"",0,"N/A",0,0,"N/A","N/A","N/A","N/A","N/A",0,40647.701458333337,"mazuin",false,1,0,false,"MY",0,0,2,0,"DF"]
[null,null,null,null,null,null,null,null,null,null,null,null,null,null,null,null,null,null,null,null,null,null,null,null,null,null,365,0,0,0,0,0,0,3,0,0,"TA",351,0,"NOFEE","NOFEE",1,0,"","","MS. CHUNG FUI CHU","1-08, BLOCK A, MAXWELL TOWER, NO. 10, JLN. 5/58C","PJ","46000           ","SL","MY","","","03-77811488                                                                                                                                           ","                                                                                                                                                      ","711217-71-5084","","KLCI",0,0,0,0,0,"",0,"N/A",0,0,"N/A","N/A","N/A","N/A","N/A",0,40647.701689814814,"mazuin",false,1,0,false,"MY",0,0,2,0,"DF"]
[null,null,null,null,null,null,null,null,null,null,null,null,null,null,null,null,null,null,null,null,null,null,null,null,null,null,365,0,0,0,0,0,0,3,0,0,"TA",271,0,"NOFEE","NOFEE",1,0,"","","CHUA HEE HOEY","43, JALAN 7/62, BANDAR MENJALARA, 51200 KUALA LUMPUR"," KL","51200           ","","MY","","","012-2892755                                                                                                                                           ","                                                                                                                                                      ","390715-08-5607","","KLCI",0,0,0,0,0,"",0,"N/A",0,0,"N/A","N/A","N/A","N/A","N/A",0,40716.414814814816,"hanina",false,1,0,false,"MY",0,0,2,0,"DF"]
[null,null,null,null,null,null,null,null,null,null,null,null,null,null,null,null,null,null,null,null,null,null,null,null,null,null,365,0,0,0,0,0,0,3,0,0,"TA",245,0,"NOFEE","NOFEE",1,0,"","","CHOU YEN LING","28 jALAN SS 22A/5, DAMANSARA JAYA, 47400 PETALING JAYA, SELANGOR","","47400           ","SEL","MY","zisyanong@yahoo.com.uk","","03-77283353, 012-2108933                                                                                                                              ","                                                                                                                                                      ","480709-71-5034","","KLCI",0,0,0,0,0,"",0,"N/A",0,0,"N/A","N/A","N/A","N/A","N/A",0,40760.408993055556,"hanina",false,1,0,false,"MY",0,0,2,0,"DF"]
[null,null,null,null,null,null,null,null,null,null,null,null,null,null,null,null,null,null,null,null,null,null,null,null,null,null,365,0,0,0,0,0,0,3,0,1,"TA",361,0,"NOFEE","NOFEE",1,0,"","","CHAN KAM LOON","NO. 75, JLN. WAWASAN 3/8, PUSAT BANDAR PURCHONG","PC","47100           ","SL","MY","mktg@veneermark.com","","03-78464588                                                                                                                                           ","03-78465260                                                                                                                                           ","800321-14-5573","","KLCI",0,0,0,0,0,"",0,"N/A",0,0,"N/A","N/A","N/A","N/A","N/A",0,40647.701863425929,"mazuin",false,1,0,false,"MY",0,0,2,0,"DF"]
[null,null,null,null,null,null,null,null,null,null,null,null,null,null,null,null,null,null,null,null,null,null,null,null,null,null,365,0,0,0,0,0,0,3,0,0,"TA",362,0,"NOFEE","NOFEE",1,0,"","","CHAN KOK LIONG","12-7-8, ROBSON CONDO, PSRN SYED PUTRA 2"," ","50460           ","KL","MY","","","016-2220111                                                                                                                                           ","                                                                                                                                                      ","600315-10-5026","","KLCI",0,0,0,0,0,"",0,"N/A",0,0,"N/A","N/A","N/A","N/A","N/A",0,40647.702037037037,"mazuin",false,1,0,false,"MY",0,0,2,0,"DF"]
[null,null,null,null,null,null,null,null,null,null,null,null,null,null,null,null,null,null,null,null,null,null,null,null,null,null,365,0,0,0,0,0,0,3,0,1,"TA",365,0,"NOFEE","NOFEE",1,0,"","","CHEONG KAH WENG","NO. 29, PERSIARAN WIRA JAYA BARAT 38, TMN. IPOH JAYA TIMUR","IPOH","31350           ","PERAK","MY","CKW88@LIVE.com","","016-5673366                                                                                                                                           ","                                                                                                                                                      ","881112-08-5807","","KLCI",0,0,0,0,0,"",0,"N/A",0,0,"N/A","N/A","N/A","N/A","N/A",0,40647.702199074076,"mazuin",false,1,0,false,"MY",0,0,2,0,"DF"]
[null,null,null,null,null,null,null,null,null,null,null,null,null,null,null,null,null,null,null,null,null,null,null,null,null,null,365,0,0,0,0,0,0,3,0,0,"TA",377,0,"NOFEE","NOFEE",1,0,"","","CHOONG LIP HEN","29, JALAN USJ 4/4C, SUBANG JAYA"," ","47610           ","SEL","MY","","","019-3121163                                                                                                                                           ","                                                                                                                                                      ","600804-06-5125","","KLCI",0,0,0,0,0,"",0,"N/A",0,0,"N/A","N/A","N/A","N/A","N/A",0,40647.70239583333,"mazuin",false,1,0,false,"MY",0,0,2,0,"DF"]
[null,null,null,null,null,null,null,null,null,null,null,null,null,null,null,null,null,null,null,null,null,null,null,null,null,null,365,0,0,0,0,0,0,3,0,-1,"TA",322,0,"NOFEE","NOFEE",1,0,"","","MS CHOI LAI KAM","11A, JLN. 16/15,","PJ","46350           ","SL","MY","","","03-79584918/012-2872298                                                                                                                               ","                                                                                                                                                      ","401024-10-5120","","KLCI",0,0,0,0,0,"",0,"N/A",0,0,"N/A","N/A","N/A","N/A","N/A",0,40928.529021064816,"mazuin",false,1,0,false,"MY",0,0,2,0,"DF"]
[null,null,null,null,null,null,null,null,null,null,null,null,null,null,null,null,null,null,null,null,null,null,null,null,null,null,365,0,0,0,0,0,0,3,0,0,"TA",291,0,"NOFEE","NOFEE",1,0,"","","CHIN LAI YOONG","NO.148,JALAN DATO LAU PAK KHUAN,TAMAN IPOH,31400 IPOH PERAK","PEIP","31400           ","PER","MY","","","                                                                                                                                                      ","                                                                                                                                                      ","680707-08-5186","","KLSER",0,0,0,0,0,"",0,"N/A",0,0,"MS. KOK HAU YEN","REMISIER","TA SECURITIES HOLDINGS BHD","FIRST FLOOR,PLAZA TEH TENG SENG","227 JLN RAJA PERM. BAINUN, 30250 IPOH, PERAK",0,41165.560016122683,"mazuin",false,1,1,false,"MY",0,0,5133,0,"DF"]
[null,null,null,null,null,null,null,null,null,null,null,null,null,null,null,null,null,null,null,null,null,null,null,null,null,null,365,0,0,0,0,0,0,3,0,0,"TA",331,0,"NOFEE","NOFEE",1,0,"","","CHEE MANG CHENG","12, JLN. JIRAN 1, TMN. GEMBIRA, OFF JLN. KUCHAI LAMA ","KL","58200           ","WP","MY","","","03-79809133/012-3290623                                                                                                                               ","                                                                                                                                                      ","640425-10-8021","","KLCI",0,0,0,0,0,"",0,"N/A",0,0,"N/A","N/A","N/A","N/A","N/A",0,40647.703020833331,"mazuin",false,1,0,false,"MY",0,0,2,0,"DF"]
[null,null,null,null,null,null,null,null,null,null,null,null,null,null,null,null,null,null,null,null,null,null,null,null,null,null,365,0,0,0,0,0,0,3,0,-1,"TA",229,0,"NOFEE","NOFEE",1,0,"","","CHAN MONG HOONG","29, JLN. USJ 20/6,","SJ","47630           ","SL","MY","","","03-80244282/012-3799403                                                                                                                               ","                                                                                                                                                      ","590103-02-5183","","KLCI",0,0,0,0,0,"",0,"N/A",0,0,"N/A","N/A","N/A","N/A","N/A",0,41053.600632835645,"jessica",false,1,0,false,"MY",0,0,2,0,"DF"]
[null,null,null,null,null,null,null,null,null,null,null,null,null,null,null,null,null,null,null,null,null,null,null,null,null,null,365,0,0,0,0,0,0,3,0,0,"TA",388,0,"NOFEE","NOFEE",1,0,"","","CHUE MEI LING","2, EWE BOON ROAD,#15-02, THE PRINCETON"," ","259313          "," ","SG",""," ","02-66383582, 02-83093305                                                                                                                              ","                                                                                                                                                      ","S1660087C","","KLCI",0,0,0,0,0,"",0,"N/A",0,0,"N/A","N/A","N/A","N/A","N/A",0,40928.529238622687,"mazuin",false,1,0,false,"MY",0,0,2,0,"DF"]
[null,null,null,null,null,null,null,null,null,null,null,null,null,null,null,null,null,null,null,null,null,null,null,null,null,null,365,0,0,0,0,0,0,3,0,0,"TA",393,0,"NOFEE","NOFEE",1,0,"","","CHIN MAN YEE","P.O.BOX 1119, 90712 SANDAKAN, SABAH"," ","90712           ","","MY","fong2328@yahoo.com","","089-218226                                                                                                                                            ","                                                                                                                                                      ","720113-12-5156","","KLCI",0,0,0,0,0,"",0,"N/A",0,0,"N/A","N/A","N/A","N/A","N/A",0,41106.396743171295,"mazuin",false,1,0,false,"MY",0,0,2,0,"DF"]
[null,null,null,null,null,null,null,null,null,null,null,null,null,null,null,null,null,null,null,null,null,null,null,null,null,null,365,0,0,0,0,0,0,3,0,0,"TA",339,0,"NOFEE","NOFEE",1,0,"","","CHAI NAM KIONG","23, JLN. 9/149J, BANDAR BARU SERI PETALING","KL","57000           ","WP","MY","","","03-90573618, 019-2259425                                                                                                                              ","                                                                                                                                                      ","560519-08-6337","","KLCI",0,0,0,0,0,"",0,"N/A",0,0,"N/A","N/A","N/A","N/A","N/A",0,40850.429212962961,"hanina",false,1,0,false,"MY",0,0,2,0,"DF"]
[null,null,null,null,null,null,null,null,null,null,null,null,null,null,null,null,null,null,null,null,null,null,null,null,null,null,365,0,0,0,0,0,0,3,0,0,"TA",360,0,"NOFEE","NOFEE",1,0,"","","CHING SONG KOA @ CHAN MAY LING","24 PERSIARAN ARA, BANGSAR BARU","KL","59100           ","WP","MY","","","03-22828118                                                                                                                                           ","                                                                                                                                                      ","350601-10-5060","","KLCI",0,0,0,0,0,"",0,"N/A",0,0,"N/A","N/A","N/A","N/A","N/A",0,40647.703935185185,"mazuin",false,1,0,false,"MY",0,0,2,0,"DF"]
[null,null,null,null,null,null,null,null,null,null,null,null,null,null,null,null,null,null,null,null,null,null,null,null,null,null,365,0,0,0,0,0,0,3,0,0,"TA",222,0,"NOFEE","NOFEE",1,0,"","","CHAI SIEW MEI","NO. 5, JLN. BU 6/5, BANDAR UTAMA DAMANSARA ","PJ","47800           ","SL","MY","","","012-3768810                                                                                                                                           ","                                                                                                                                                      ","670308-10-6294","","KLCI",0,0,0,0,0,"",0,"N/A",0,0,"N/A","N/A","N/A","N/A","N/A",0,40647.70412037037,"mazuin",false,1,0,false,"MY",0,0,2,0,"DF"]
[null,null,null,null,null,null,null,null,null,null,null,null,null,null,null,null,null,null,null,null,null,null,null,null,null,null,365,0,0,0,0,0,0,3,0,0,"TA",413,0,"NOFEE","NOFEE",1,0,"","","CHIA SEONG POW","NO.19, JALAN KELAB GOLF 13/3, GREEN HILL KGSAAS, SEKSYEN 13, 40100 SHAH ALAM, SELANGOR."," ","40100           ","SL","MY","","","019-3373586                                                                                                                                           ","                                                                                                                                                      ","550909-10-6285","","KLCI",0,0,0,0,0,"",0,"N/A",0,0,"N/A","N/A","N/A","N/A","N/A",0,40716.415254629632,"hanina",false,1,0,false,"MY",0,0,2,0,"DF"]
[null,null,null,null,null,null,null,null,null,null,null,null,null,null,null,null,null,null,null,null,null,null,null,null,null,null,365,0,0,0,0,0,0,3,0,0,"TA",248,0,"NOFEE","NOFEE",1,0,"","","CHAN WOON CHIN","NO.21, JALAN KOSAS 1/1, TAMAN KOSAS, 68000 AMPANG, SELANGOR","","68000           ","SEL","MY","","","                                                                                                                                                      ","                                                                                                                                                      ","530609-05-5027","","KLCI",0,0,0,0,0,"",0,"N/A",0,0,"N/A","N/A","N/A","N/A","N/A",0,40879.394456018519,"jessica",false,1,0,false,"MY",0,0,2,0,"DF"]
[null,null,null,null,null,null,null,null,null,null,null,null,null,null,null,null,null,null,null,null,null,null,null,null,null,null,365,0,0,0,0,0,0,3,0,0,"TA",353,0,"NOFEE","NOFEE",1,0,"","","MR CHAN WEE HEN","33, JLN. 10/146, BANDAR TASIK SELANTAN, SG BESI","KL","57000           ","WP","MY","","","012-3776783                                                                                                                                           ","                                                                                                                                                      ","691206-10-5955","","KLCI",0,0,0,0,0,"",0,"N/A",0,0,"N/A","N/A","N/A","N/A","N/A",0,40647.704421296294,"mazuin",false,1,0,false,"MY",0,0,2,0,"DF"]
[null,null,null,null,null,null,null,null,null,null,null,null,null,null,null,null,null,null,null,null,null,null,null,null,null,null,365,0,0,0,0,0,0,3,0,0,"TA",363,0,"NOFEE","NOFEE",1,0,"","","CHEUNG WAI MEE","P.O.BOX, 1119 SANDAKAN, SABAH"," ","90712           ","SB","MY","","","019-8532850                                                                                                                                           ","                                                                                                                                                      ","510625-12-5170","","KLCI",0,0,0,0,0,"",0,"N/A",0,0,"N/A","N/A","N/A","N/A","N/A",0,40996.384734872685,"mazuin",false,1,0,false,"MY",0,0,2,0,"DF"]
[null,null,null,null,null,null,null,null,null,null,null,null,null,null,null,null,null,null,null,null,null,null,null,null,null,null,365,0,0,0,0,0,0,3,0,0,"TA",327,0,"NOFEE","NOFEE",1,0,"","","CHOR WAN YOKE","NO. 3, JLN. KENYALANG 11/8","PJ","47810           ","SL","MY","","","                                                                                                                                                      ","                                                                                                                                                      ","670223-10-5224","","KLCI",0,0,0,0,0,"",0,"N/A",0,0,"N/A","N/A","N/A","N/A","N/A",0,40647.70484953704,"mazuin",false,1,0,false,"MY",0,0,2,0,"DF"]
[null,null,null,null,null,null,null,null,null,null,null,null,null,null,null,null,null,null,null,null,null,null,null,null,null,null,365,0,0,0,0,0,0,3,0,0,"TA",387,0,"NOFEE","NOFEE",1,0,"","","CHEN YEU CHONG","4, PARK VALE, WATTEN ESTATE"," ","288563          "," ","SG",""," ","02-62550689                                                                                                                                           ","                                                                                                                                                      ","S0252296I","","KLCI",0,0,0,0,0,"",0,"N/A",0,0,"N/A","N/A","N/A","N/A","N/A",0,40855.645775462966,"ken",false,1,0,false,"MY",0,0,2,0,"DF"]
[null,null,null,null,null,null,null,null,null,null,null,null,null,null,null,null,null,null,null,null,null,null,null,null,null,null,365,0,0,0,0,0,0,3,0,0,"TA",246,0,"NOFEE","NOFEE",1,0,"","","CHEN YEOW KHIAN","16 LALUAN PERAJURIT 10, TAMAN RIANG, IPOH GARDEN EAST, 31400 IPOH, PERAK.","IP","31400           ","PR","MY","","","012-5077599                                                                                                                                           ","                                                                                                                                                      ","700120-08-5561","","KLCI",0,0,0,0,0,"",0,"N/A",0,0,"N/A","N/A","N/A","N/A","N/A",0,40701.437835648147,"hanina",false,1,0,false,"MY",0,0,2,0,"DF"]
[null,null,null,null,null,null,null,null,null,null,null,null,null,null,null,null,null,null,null,null,null,null,null,null,null,null,365,0,0,0,0,0,0,3,0,0,"TA",394,0,"NOFEE","NOFEE",1,0,"","","CHUAH YEW LEE","91D, KAMPONG BOYAN, TAIPING, PERAK"," ","34000           ","","MY","","","05-8082139                                                                                                                                            ","                                                                                                                                                      ","660318-08-5037","","KLCI",0,0,0,0,0,"",0,"N/A",0,0,"N/A","N/A","N/A","N/A","N/A",0,41109.744259918982,"mazuin",false,1,0,false,"MY",0,0,2,0,"DF"]
[null,null,null,null,null,null,null,null,null,null,null,null,null,null,null,null,null,null,null,null,null,null,null,null,null,null,365,0,0,0,0,0,0,3,0,-1,"TA",300,0,"NOFEE","NOFEE",1,0,"","","CHANDRASEKAR A/L SUPPIAH","NO.10 LORONG DESA MURNI 2, TAMAN DESA, OFF JLN.. KELANG LAMA","KL","58100           ","WP","MY","","","03-21707401/02                                                                                                                                        ","03-21707488                                                                                                                                           ","401024-10-5120","","KLCI",0,0,0,0,0,"",0,"N/A",0,0,"N/A","N/A","N/A","N/A","N/A",0,40928.433047303239,"mazuin",false,1,0,false,"MY",0,0,2,0,"DF"]
[null,null,null,null,null,null,null,null,null,null,null,null,null,null,null,null,null,null,null,null,null,null,null,null,null,null,365,0,0,0,0,0,0,3,0,0,"TA",278,0,"NOFEE","NOFEE",1,0,"","","ENG SOON KOON","14, PSRN PENGKALAN TIMUR 10, TAMAN DESA PAKATAN, PERAK","IPOH","31650           ","PERAK","MY","","","016-5570777                                                                                                                                           ","                                                                                                                                                      ","700315-07-5232","","KLCI",0,0,0,0,0,"",0,"N/A",0,0,"N/A","N/A","N/A","N/A","N/A",0,41165.560149386576,"mazuin",false,1,0,false,"MY",0,0,2,0,"DF"]
[null,null,null,null,null,null,null,null,null,null,null,null,null,null,null,null,null,null,null,null,null,null,null,null,null,null,365,0,0,0,0,0,0,3,0,0,"TA",368,0,"NOFEE","NOFEE",1,0,"","","ENG SUI WAH","11, JLN. WAN MALINI SATU, SERI PETALING","KL","57000           ","WP","MY"," ","","014-9600393/03-90583633                                                                                                                               ","                                                                                                                                                      ","560305-06-5303","","KLCI",0,0,0,0,0,"",0,"N/A",0,0,"N/A","N/A","N/A","N/A","N/A",0,40647.706736111111,"mazuin",false,1,0,false,"MY",0,0,2,0,"DF"]
[null,null,null,null,null,null,null,null,null,null,null,null,null,null,null,null,null,null,null,null,null,null,null,null,null,null,365,0,0,0,0,0,0,3,0,0,"TA",396,0,"NOFEE","NOFEE",1,0,"","","FOO KIAT CHAI","PT 724, SEK 54, JLN. KK 3/1, BANDAR BARU KUBANG KERIAN","KB.","16150           ","KLT","MY","","","09-7656826/012-9895010                                                                                                                                ","                                                                                                                                                      ","830417-03-6045","","KLCI",0,0,0,0,0,"",0,"N/A",0,0,"N/A","N/A","N/A","N/A","N/A",0,40647.706944444442,"mazuin",false,1,0,false,"MY",0,0,2,0,"DF"]
[null,null,null,null,null,null,null,null,null,null,null,null,null,null,null,null,null,null,null,null,null,null,null,null,null,null,365,0,0,0,0,0,0,3,0,0,"TA",355,0,"NOFEE","NOFEE",1,0,"","","FOO SAY BIAU","4950-R, LORONG HAJI SALLEH, JLN. HOSPITAL","KB.","15200           ","KLT","MY","","","09-7447096/019-9988182                                                                                                                                ","                                                                                                                                                      ","721125-03-5267","","KLCI",0,0,0,0,0,"",0,"N/A",0,0,"N/A","N/A","N/A","N/A","N/A",0,40647.707152777781,"mazuin",false,1,0,false,"MY",0,0,2,0,"DF"]
[null,null,null,null,null,null,null,null,null,null,null,null,null,null,null,null,null,null,null,null,null,null,null,null,null,null,365,0,0,0,0,0,0,3,0,0,"TA",399,0,"NOFEE","NOFEE",1,0,"","","FOO THOR JONG","53, JALAN BU 6/12, BANDAR UTAMA, 47800, PETALING JAYA, SELANGOR.","SL","47800           "," ","MY","","","012-9640240                                                                                                                                           ","                                                                                                                                                      ","450727-03-5190","","KLCI",0,0,0,0,0,"",0,"N/A",0,0,"N/A","N/A","N/A","N/A","N/A",0,40738.451412037037,"hanina",false,1,0,false,"MY",0,0,2,0,"DF"]
[null,null,null,null,null,null,null,null,null,null,null,null,null,null,null,null,null,null,null,null,null,null,null,null,null,null,365,0,0,0,0,0,0,3,0,0,"TA",390,0,"NOFEE","NOFEE",1,0,"","","GAN HAI TOH","26 JLN. PJU 1A/50, DAMANSARA IDAMAN","PJ","47500           ","SL","MY","","","                                                                                                                                                      ","                                                                                                                                                      ","650314-04-5223","","KLCI",0,0,0,0,0,"",0,"N/A",0,0,"N/A","N/A","N/A","N/A","N/A",0,40647.707361111112,"mazuin",false,1,0,false,"MY",0,0,2,0,"DF"]
[null,null,null,null,null,null,null,null,null,null,null,null,null,null,null,null,null,null,null,null,null,null,null,null,null,null,365,0,0,0,0,0,0,3,0,0,"TA",324,0,"NOFEE","NOFEE",1,0,"","","MR GAN RICH MOND","SAE-01-08, SRI ALPINIA  APARTMENT, BANDAR PUTERI,","PCHG","47100           ","SL","MY","","","03-80682720/012-2894062                                                                                                                               ","                                                                                                                                                      ","730316-01-5001","","KLCI",0,0,0,0,0,"",0,"N/A",0,0,"N/A","N/A","N/A","N/A","N/A",0,40647.707638888889,"mazuin",false,1,0,false,"MY",0,0,2,0,"DF"]
[null,null,null,null,null,null,null,null,null,null,null,null,null,null,null,null,null,null,null,null,null,null,null,null,null,null,365,0,0,0,0,0,0,3,0,0,"TA",389,0,"NOFEE","NOFEE",1,0,"","","GEH SIEW YIN","49, HOLLAND GROUE DRIVE"," ","278881          "," ","SG",""," ","02-66383582, 02-83093305                                                                                                                              ","                                                                                                                                                      ","S0042214B","","KLCI",0,0,0,0,0,"",0,"N/A",0,0,"N/A","N/A","N/A","N/A","N/A",0,40855.646064814813,"ken",false,1,0,false,"MY",0,0,2,0,"DF"]
[null,null,null,null,null,null,null,null,null,null,null,null,null,null,null,null,null,null,null,null,null,null,null,null,null,null,365,0,0,0,0,0,0,3,0,0,"TA",379,0,"NOFEE","NOFEE",1,0,"","","SATGUNA DEVI A/P SHANMUGAM","NO.22 LORONG AIR PANAS 1, OFF JALAN AIR MADU, AIR PANAS SETAPAK 53200 KUALA LUMPUR."," ","53200           ","SEL","MY","","","016-6260709                                                                                                                                           ","                                                                                                                                                      ","660529-10-6096","","KLCI",0,0,0,0,0,"",0,"N/A",0,0,"N/A","N/A","N/A","N/A","N/A",0,40746.739675925928,"jessica",false,1,0,false,"MY",0,0,2,0,"DF"]
[null,null,null,null,null,null,null,null,null,null,null,null,null,null,null,null,null,null,null,null,null,null,null,null,null,null,365,0,0,0,0,0,0,3,0,0,"TA",373,0,"NOFEE","NOFEE",1,0,"","","HO KING MIN","43, JALAN BATU NICAM 25, BANDAR BUKIT TINGGI 2, KLANG"," ","41200           ","SEL","MY","","","012-3259188                                                                                                                                           ","                                                                                                                                                      ","550102-10-5601","","KLCI",0,0,0,0,0,"",0,"N/A",0,0,"N/A","N/A","N/A","N/A","N/A",0,40647.708067129628,"mazuin",false,1,0,false,"MY",0,0,2,0,"DF"]
[null,null,null,null,null,null,null,null,null,null,null,null,null,null,null,null,null,null,null,null,null,null,null,null,null,null,365,0,0,0,0,0,0,3,0,0,"TA",380,0,"NOFEE","NOFEE",1,0,"","","HONG KENG TONG@HONG GAN GUI","1051, JALAN DAMANSARA, TAMAN TUN DR ISMAIL","KL","60000           ","WP","MY","","","017-8871051, 03-77298348                                                                                                                              ","                                                                                                                                                      ","430713-04-5357","","KLCI",0,0,0,0,0,"",0,"N/A",0,0,"N/A","N/A","N/A","N/A","N/A",0,40704.390717592592,"hanina",false,1,0,false,"MY",0,0,2,0,"DF"]
[null,null,null,null,null,null,null,null,null,null,null,null,null,null,null,null,null,null,null,null,null,null,null,null,null,null,365,0,0,0,0,0,0,3,0,0,"TA",243,0,"NOFEE","NOFEE",1,0,"","","HO OOI KIN","11A, JALN SP 4/6, TAMAN SEGAR PERDANA, CHERAS,43200 BATU 9 CHERAS,  SELANGOR.","","43200           ","SEL","MY"," ABACUSMGT@YAHOO.COM","","03-90807515 / 013-3529544                                                                                                                             ","                                                                                                                                                      ","640802-10-7746","","KLCI",0,0,0,0,0,"",0,"N/A",0,0,"N/A","N/A","N/A","N/A","N/A",0,40697.390949074077,"hanina",false,1,0,false,"MY",0,0,2,0,"DF"]
[null,null,null,null,null,null,null,null,null,null,null,null,null,null,null,null,null,null,null,null,null,null,null,null,null,null,365,0,0,0,0,0,0,3,0,1,"TA",321,0,"NOFEE","NOFEE",1,0,"","","MS HU SOOK PENG","24, JLN JIRAN SATU, HAPPY GARDEN","KL","58200           ","WP","MY","spic0928@streamyx.com","","03-79803255/016-2282448                                                                                                                               ","                                                                                                                                                      ","650928-10-7054","","KLCI",0,0,0,0,0,"",0,"N/A",0,0,"N/A","N/A","N/A","N/A","N/A",0,40655.604363425926,"mazuin",false,1,0,false,"MY",0,0,2,0,"DF"]
[null,null,null,null,null,null,null,null,null,null,null,null,null,null,null,null,null,null,null,null,null,null,null,null,null,null,365,0,0,0,0,0,0,3,0,0,"TA",375,0,"NOFEE","NOFEE",1,0,"","","IRENE CHOE MEE KAM@IRENE CHOW MEE KAM","NO. 17, JALAN USJ 3/3G, SUBANG JAYA"," ","47600           ","SEL","MY","","","012-3056973                                                                                                                                           ","                                                                                                                                                      ","680712-10-6228","","KLCI",0,0,0,0,0,"",0,"N/A",0,0,"N/A","N/A","N/A","N/A","N/A",0,40647.708611111113,"mazuin",false,1,0,false,"MY",0,0,2,0,"DF"]
[null,null,null,null,null,null,null,null,null,null,null,null,null,null,null,null,null,null,null,null,null,null,null,null,null,null,365,0,0,0,0,0,0,3,0,1,"TA",389,0,"NOFEE","NOFEE",1,0,"","","JUDY GAN SEE KIAT","210 GREEN ROAD ONE, GREEN LANE, GEORGETOWN"," ","11600           ","PP","MY","","","017-4866873                                                                                                                                           ","                                                                                                                                                      ","651027-04-5188","","KLCI",0,0,0,0,0,"",0,"N/A",0,0,"N/A","N/A","N/A","N/A","N/A",0,40827.420891203707,"mazuin",false,1,0,false,"MY",0,0,2,0,"DF"]
[null,null,null,null,null,null,null,null,null,null,null,null,null,null,null,null,null,null,null,null,null,null,null,null,null,null,365,0,0,0,0,0,0,3,0,1,"TA",397,0,"NOFEE","NOFEE",1,0,"","","KHOR GEOK BEE","13, LALUAN PERAJURIT 14, TMN. BERSATU","","31400           ","IPOH","MY","","","05-5457262/0125060900                                                                                                                                 ","                                                                                                                                                      ","591207-08-5644","","KLCI",0,0,0,0,0,"",0,"N/A",0,0,"N/A","N/A","N/A","N/A","N/A",0,40827.42114583333,"mazuin",false,1,0,false,"MY",0,0,2,0,"DF"]
[null,null,null,null,null,null,null,null,null,null,null,null,null,null,null,null,null,null,null,null,null,null,null,null,null,null,365,0,0,0,0,0,0,3,0,0,"TA",362,0,"NOFEE","NOFEE",1,0,"","","KHONG CHOOK CHONG","C/O 3E TRADING CO. , LOT 4.25, PLAZA PRIMA, BT 4 1/2, JLN. KELANG LAMA","KL","58200           ","WP","MY","","","03-79827700                                                                                                                                           ","                                                                                                                                                      ","470814-07-5041","","KLCI",0,0,0,0,0,"",0,"N/A",0,0,"N/A","N/A","N/A","N/A","N/A",0,40647.709131944444,"mazuin",false,1,0,false,"MY",0,0,2,0,"DF"]
[null,null,null,null,null,null,null,null,null,null,null,null,null,null,null,null,null,null,null,null,null,null,null,null,null,null,365,0,0,0,0,0,0,3,0,1,"TA",326,0,"NOFEE","NOFEE",1,0,"","","MS KIEW KUAY FONG","WISMA SAFARI, LOT PT 70, JLN. TAIPING, KAMPONG BARU SG BULUH, SEC U19 SG. BULUH","SA","47000           ","SL","MY","","","012-3070468                                                                                                                                           ","                                                                                                                                                      ","631030-01-5264","","KLCI",0,0,0,0,0,"",0,"N/A",0,0,"N/A","N/A","N/A","N/A","N/A",0,40647.709340277775,"mazuin",false,1,0,false,"MY",0,0,2,0,"DF"]
[null,null,null,null,null,null,null,null,null,null,null,null,null,null,null,null,null,null,null,null,null,null,null,null,null,null,365,0,0,0,0,0,0,3,0,1,"TA",320,0,"NOFEE","NOFEE",1,0,"","","MR KOH LAP HING","1272, JLN. JIRAN 5, TMN GEMBIRA , OFF JLN. KUCHAI LAMA,","KL","58200           ","WP","MY","","","03-79874218/019-3375544                                                                                                                               ","                                                                                                                                                      ","510417-01-5049","","KLCI",0,0,0,0,0,"",0,"N/A",0,0,"N/A","N/A","N/A","N/A","N/A",0,40647.714108796295,"mazuin",false,1,0,false,"MY",0,0,2,0,"DF"]
[null,null,null,null,null,null,null,null,null,null,null,null,null,null,null,null,null,null,null,null,null,null,null,null,null,null,365,0,0,0,0,0,0,3,0,0,"TA",336,0,"NOFEE","NOFEE",1,0,"","","KHONG MEI KUAN","7, JLN. INDAH 3, TMN. TASIK INDAH ","KL","52100           ","WP","MY","","","03-62572058/012-2113977                                                                                                                               ","                                                                                                                                                      ","821119-14-5228","","KLCI",0,0,0,0,0,"",0,"N/A",0,0,"N/A","N/A","N/A","N/A","N/A",0,40647.710972222223,"mazuin",false,1,0,false,"MY",0,0,2,0,"DF"]
[null,null,null,null,null,null,null,null,null,null,null,null,null,null,null,null,null,null,null,null,null,null,null,null,null,null,365,0,0,0,0,0,0,3,0,0,"TA",416,0,"NOFEE","NOFEE",1,0,"","","KHOO SWEE EAN","55 JALAN BU 6/12, BANDAR UTAMA, 47800 PETALING JAYA, SELANGOR."," ","47800           ","SL","MY","","","012-2076448                                                                                                                                           ","                                                                                                                                                      ","620319-02-5822","","KLCI",0,0,0,0,0,"",0,"N/A",0,0,"N/A","N/A","N/A","N/A","N/A",0,40716.415891203702,"hanina",false,1,0,false,"MY",0,0,2,0,"DF"]
[null,null,null,null,null,null,null,null,null,null,null,null,null,null,null,null,null,null,null,null,null,null,null,null,null,null,365,0,0,0,0,0,0,3,0,0,"TA",333,0,"NOFEE","NOFEE",1,0,"","","KONG SEN FUK","46-1, JALAN 10/116B, KUCHAI ENTREPRENEURS PARK, KUCHAI LAMA","KL","58200           "," WP","MY","","","03-79828115/012-2101999                                                                                                                               ","                                                                                                                                                      ","660728-13-5279","","KLCI",0,0,0,0,0,"",0,"N/A",0,0,"N/A","N/A","N/A","N/A","N/A",0,40647.714375000003,"mazuin",false,1,0,false,"MY",0,0,2,0,"DF"]
[null,null,null,null,null,null,null,null,null,null,null,null,null,null,null,null,null,null,null,null,null,null,null,null,null,null,365,0,0,0,0,0,0,3,0,0,"TA",318,0,"NOFEE","NOFEE",1,0,"","","KOH SOR PING","34 JLN. ANGSANA 9, KS6, BANDAR BOTANIC","KLANG","41200           ","SL","MY","","","012-2084957                                                                                                                                           ","                                                                                                                                                      ","580716-10-5732","","KLCI",0,0,0,0,0,"",0,"N/A",0,0,"N/A","N/A","N/A","N/A","N/A",0,40647.714571759258,"mazuin",false,1,0,false,"MY",0,0,2,0,"DF"]
[null,null,null,null,null,null,null,null,null,null,null,null,null,null,null,null,null,null,null,null,null,null,null,null,null,null,365,0,0,0,0,0,0,3,0,0,"TA",382,0,"NOFEE","NOFEE",1,0,"","","KHOR THING THIAM","NO.9 LNG PJU 1/46 G, AMAN SURIN DAMANSARA","PJ","47301           ","SL","MY","","KHORTT@GMAIL.COM","012-6082928                                                                                                                                           ","                                                                                                                                                      ","620611-07-5261","","KLCI",0,0,0,0,0,"",0,"N/A",0,0,"N/A","N/A","N/A","N/A","N/A",0,40647.714756944442,"mazuin",false,1,0,false,"MY",0,0,2,0,"DF"]
[null,null,null,null,null,null,null,null,null,null,null,null,null,null,null,null,null,null,null,null,null,null,null,null,null,null,365,0,0,0,0,0,0,3,0,0,"TA",307,0,"NOFEE","NOFEE",1,0,"","","LEONG CHOOI KUEN","31,JALAN PRIMA PELANGI 2,BUKIT PRIMA PELANGI,51200 KUALA LUMPUR","WPKL","51200           ","WLP","MY","","","                                                                                                                                                      ","                                                                                                                                                      ","","","KLSER",0,0,0,0,0,"",0,"N/A",0,0,"","","","","",0,41130.389832523149,"mazuin",false,1,1,false,"MY",0,0,40922,0,"DF"]
[null,null,null,null,null,null,null,null,null,null,null,null,null,null,null,null,null,null,null,null,null,null,null,null,null,null,365,0,0,0,0,0,0,3,0,0,"TA",389,0,"NOFEE","NOFEE",1,0,"","","YAGNESHKUMAR MAHENDRABHAI PATEL","101 JALAN TERASEK 2, BANGSAR BARU","KL","59100           ","WP","MY","","","012-2863322,03-2288188                                                                                                                                ","                                                                                                                                                      ","640208-10-6855","","KLCI",0,0,0,0,0,"",0,"N/A",0,0,"N/A","N/A","N/A","N/A","N/A",0,40647.714953703704,"mazuin",false,1,0,false,"MY",0,0,2,0,"DF"]
[null,null,null,null,null,null,null,null,null,null,null,null,null,null,null,null,null,null,null,null,null,null,null,null,null,null,365,0,0,0,0,0,0,3,0,1,"TA",393,0,"NOFEE","NOFEE",1,0,"","","LEE CHEE KEONG","5, JALAN 8/91, TAMAN SHAMELIN PERKASA, CHERAS"," ","56100           ","KL","MY","","","                                                                                                                                                      ","                                                                                                                                                      ","580820-10-6315","","KLCI",0,0,0,0,0,"",0,"N/A",1,1,"N/A","N/A","N/A","N/A","N/A",0,40647.715243055558,"mazuin",false,1,1,false,"MY",0,0,2,0,"DF"]
[null,null,null,null,null,null,null,null,null,null,null,null,null,null,null,null,null,null,null,null,null,null,null,null,null,null,365,0,0,0,0,0,0,3,0,0,"TA",245,0,"NOFEE","NOFEE",1,0,"","","LOCK CHOI LENG","31-03, BLK C, KIARAMAS AYURIA CONDO, JALAN KIARA 7, MOUNT KIARA, 50480 KUALA LUMPUR","","50480           ","KL","MY"," ","","012-3073360183                                                                                                                                        ","                                                                                                                                                      ","620817-10-6262","","KLCI",0,0,0,0,0,"",0,"N/A",0,0,"N/A","N/A","N/A","N/A","N/A",0,40746.739918981482,"jessica",false,1,0,false,"MY",0,0,2,0,"DF"]
[null,null,null,null,null,null,null,null,null,null,null,null,null,null,null,null,null,null,null,null,null,null,null,null,null,null,365,0,0,0,0,0,0,3,0,0,"TA",420,0,"NOFEE","NOFEE",1,0,"","","LAU CHEW MEE","19-2 & 19-3, PLAZA DANAU 2, JALAN 5/109F, TAMAN DANAU DESA, OFF JALN KLANG LAMA, 58100 KUALA LUMPUR."," KL","58100           ","WP","MY","","","016-2716386                                                                                                                                           ","                                                                                                                                                      ","700930-08-5678","","KLCI",0,0,0,0,0,"",0,"N/A",0,0,"N/A","N/A","N/A","N/A","N/A",0,40716.416076388887,"hanina",false,1,0,false,"MY",0,0,2,0,"DF"]
[null,null,null,null,null,null,null,null,null,null,null,null,null,null,null,null,null,null,null,null,null,null,null,null,null,null,365,0,0,0,0,0,0,3,0,0,"TA",356,0,"NOFEE","NOFEE",1,0,"","","LIM CHEE SHIN","28 JLN. SULTAN (52/4), O. O. BOX 234","PJ","46720           ","SEL","MY","","","03-20957899/0162787987                                                                                                                                ","                                                                                                                                                      ","390521-10-5139","","KLCI",0,0,0,0,0,"",0,"N/A",0,0,"N/A","N/A","N/A","N/A","N/A",0,40647.715509259258,"mazuin",false,1,0,false,"MY",0,0,2,0,"DF"]
[null,null,null,null,null,null,null,null,null,null,null,null,null,null,null,null,null,null,null,null,null,null,null,null,null,null,365,0,0,0,0,0,0,3,0,0,"TA",337,0,"NOFEE","NOFEE",1,0,"","","MR LIM ENG HUAT","622 JLN. 8, AMPANG UTAMA","AMPAN","68000           ","SL","MY","","","03-92002268/0163388461                                                                                                                                ","                                                                                                                                                      ","591115-10-6073","","KLCI",0,0,0,0,0,"",0,"N/A",0,0,"N/A","N/A","N/A","N/A","N/A",0,40647.715740740743,"mazuin",false,1,0,false,"MY",0,0,2,0,"DF"]
[null,null,null,null,null,null,null,null,null,null,null,null,null,null,null,null,null,null,null,null,null,null,null,null,null,null,365,0,0,0,0,0,0,3,0,1,"TA",339,0,"NOFEE","NOFEE",1,0,"","","MR LIM HONG GUAN","NO.2 JLN USJ. 18/2C, UEP SUBANK JAYA"," SJ","47630           ","SL","MY","","","03-79845529/012-2338939                                                                                                                               ","                                                                                                                                                      ","560606-04-5189","","KLCI",0,0,0,0,0,"",0,"N/A",0,0,"N/A","N/A","N/A","N/A","N/A",0,40647.71597222222,"mazuin",false,1,0,false,"MY",0,0,2,0,"DF"]
[null,null,null,null,null,null,null,null,null,null,null,null,null,null,null,null,null,null,null,null,null,null,null,null,null,null,365,0,0,0,0,0,0,3,0,0,"TA",398,0,"NOFEE","NOFEE",1,0,"","","LEE HUI LEONG","6, LORONG PJU 3/12 D, DAMANSARA INDAH","PJ","47410           ","SE","MY","bryanhl@gmail.com","","                                                                                                                                                      ","                                                                                                                                                      ","550408-05-5213","","KLCI",0,0,0,0,0,"",0,"N/A",0,0,"N/A","N/A","N/A","N/A","N/A",0,40704.390925925924,"hanina",false,1,0,false,"MY",0,0,2,0,"DF"]
[null,null,null,null,null,null,null,null,null,null,null,null,null,null,null,null,null,null,null,null,null,null,null,null,null,null,365,0,0,0,0,0,0,3,0,0,"TA",383,0,"NOFEE","NOFEE",1,0,"","","LAI JIT MENG","APT BLK 120, JURONG EAST STREET 13, #03-87"," ","600120          "," ","SG",""," ","02-65608622, 02-91508101                                                                                                                              ","                                                                                                                                                      ","S2171537I","","KLCI",0,0,0,0,0,"",0,"N/A",0,0,"N/A","N/A","N/A","N/A","N/A",0,40855.646284722221,"ken",false,1,0,false,"MY",0,0,2,0,"DF"]
[null,null,null,null,null,null,null,null,null,null,null,null,null,null,null,null,null,null,null,null,null,null,null,null,null,null,365,0,0,0,0,0,0,3,0,0,"TA",386,0,"NOFEE","NOFEE",1,0,"","","LEE KIM CHIN","34 TOH TUCK WALK"," ","596613          "," ","SG",""," ","02-98349875                                                                                                                                           ","                                                                                                                                                      ","E1662357N","","KLCI",0,0,0,0,0,"",0,"N/A",0,0,"N/A","N/A","N/A","N/A","N/A",0,40855.646493055552,"ken",false,1,0,false,"MY",0,0,2,0,"DF"]
[null,null,null,null,null,null,null,null,null,null,null,null,null,null,null,null,null,null,null,null,null,null,null,null,null,null,365,0,0,0,0,0,0,3,0,0,"TA",387,0,"NOFEE","NOFEE",1,0,"","","LEONG KA HON","NO.23 JALAN 47/26, TAMAN SRI RAMPAI","KL","53300           ","WP","MY","","","012-4897646                                                                                                                                           ","                                                                                                                                                      ","570106-07-5604","","KLCI",0,0,0,0,0,"",0,"N/A",0,0,"N/A","N/A","N/A","N/A","N/A",0,40647.717013888891,"mazuin",false,1,0,false,"MY",0,0,2,0,"DF"]
[null,null,null,null,null,null,null,null,null,null,null,null,null,null,null,null,null,null,null,null,null,null,null,null,null,null,365,0,0,0,0,0,0,3,0,0,"TA",389,0,"NOFEE","NOFEE",1,0,"","","LOW KHING KOOI","9 JALAN BU 4/9, BANDAR UTAMA","PJ","47800           ","SL","MY","","LOWKK88@HOTMAIL.COM","012-3128153                                                                                                                                           ","                                                                                                                                                      ","540708-08-5853","","KLCI",0,0,0,0,0,"",0,"N/A",0,0,"N/A","N/A","N/A","N/A","N/A",0,40647.717233796298,"mazuin",false,1,0,false,"MY",0,0,2,0,"DF"]
[null,null,null,null,null,null,null,null,null,null,null,null,null,null,null,null,null,null,null,null,null,null,null,null,null,null,365,0,0,0,0,0,0,3,0,0,"TA",293,0,"NOFEE","NOFEE",1,0,"","","LIM KIAT SIANG","176,JALAN SRI CEMPAKA,DESA CEMPAKA,31400,IPOH PERAK","PEIP","31400           ","PER","MY","","","012-5013117                                                                                                                                           ","                                                                                                                                                      ","670215-07-5097","","KLSER",0,0,0,0,0,"",0,"N/A",0,0,"","","","","",0,41109.744629131943,"mazuin",false,1,1,false,"MY",0,0,40922,0,"DF"]
[null,null,null,null,null,null,null,null,null,null,null,null,null,null,null,null,null,null,null,null,null,null,null,null,null,null,365,0,0,0,0,0,0,3,0,0,"TA",393,0,"NOFEE","NOFEE",1,0,"","","LEW KIM TECK","NO.43, JALAN SHT 1, TAMAN SUBANG HEIGHTS, SUBANG JAYA","  ","47500           ","SEL","MY","","","03-56213098, 016-9102168                                                                                                                              ","                                                                                                                                                      ","540623-05-5225","","KLCI",0,0,0,0,0,"",0,"N/A",0,0,"N/A","N/A","N/A","N/A","N/A",0,41057.622868368053,"jessica",false,1,0,false,"MY",0,0,2,0,"DF"]
[null,null,null,null,null,null,null,null,null,null,null,null,null,null,null,null,null,null,null,null,null,null,null,null,null,null,365,0,0,0,0,0,0,3,0,0,"TA",337,0,"NOFEE","NOFEE",1,0,"","","LIEW KIM YEN","NO. 39, JLN. USJ 11/3E","SJ","47620           ","SEL","MY","","","                                                                                                                                                      ","                                                                                                                                                      ","620522-10-6118","","KLCI",0,0,0,0,0,"",0,"N/A",0,0,"N/A","N/A","N/A","N/A","N/A",0,40647.717673611114,"mazuin",false,1,0,false,"MY",0,0,2,0,"DF"]
[null,null,null,null,null,null,null,null,null,null,null,null,null,null,null,null,null,null,null,null,null,null,null,null,null,null,365,0,0,0,0,0,0,3,0,0,"TA",340,0,"NOFEE","NOFEE",1,0,"","","LIM LENG PO","12 Jalan Tasik Prima6, Lake Belva, Taman Tasik Prima, 47150 Puchong","PC","47150           ","SEL","MY","","","03-80762050, 016-2275300                                                                                                                              ","                                                                                                                                                      ","700601-07-5030","","KLCI",0,0,0,0,0,"",0,"N/A",0,0,"N/A","N/A","N/A","N/A","N/A",0,40913.754457905095,"ken",false,1,0,false,"MY",0,0,2,0,"DF"]
[null,null,null,null,null,null,null,null,null,null,null,null,null,null,null,null,null,null,null,null,null,null,null,null,null,null,365,0,0,0,0,0,0,3,0,0,"TA",305,0,"NOFEE","NOFEE",1,0,"","","LEE LAY YONG","88 JLN. DATUK HAJI 1, TMN. TAN YEW LAI"," KL","58200           ","WP","MY","","","016-6338736                                                                                                                                           ","                                                                                                                                                      ","640504-08-5446","","KLCI",0,0,0,0,0,"",0,"N/A",0,0,"N/A","N/A","N/A","N/A","N/A",0,40647.718287037038,"mazuin",false,1,0,false,"MY",0,0,2,0,"DF"]
[null,null,null,null,null,null,null,null,null,null,null,null,null,null,null,null,null,null,null,null,null,null,null,null,null,null,365,0,0,0,0,0,0,3,0,0,"TA",290,0,"NOFEE","NOFEE",1,0,"","","MR LEE MIANG KOI","UNIT B-3-4,ASEANA PUTERI CONDOMINIUM,JALAN PUTERI 9/1,BANDAR PUTERI,47100 PUCHONG SELANGOR","SEPC","47100           ","SEL","MY","mklee@SYABAS.com.my","","012-3293492                                                                                                                                           ","                                                                                                                                                      ","541014-01-5679","","KLSER",0,0,0,0,0,"",0,"N/A",0,0,"","","","","",0,41109.744788923614,"mazuin",false,1,1,false,"MY",0,0,40922,0,"DF"]
[null,null,null,null,null,null,null,null,null,null,null,null,null,null,null,null,null,null,null,null,null,null,null,null,null,null,365,0,0,0,0,0,0,3,0,0,"TA",338,0,"NOFEE","NOFEE",1,0,"","","LAI MOOI PENG","NO.3 JALAN PUTRA MURNI 3/1B, PUTRA HEIGHTS","SJ","47650           ","SEL","MY","","","51910236,012-7997768                                                                                                                                  ","                                                                                                                                                      ","720708-14-5324","","KLCI",0,0,0,0,0,"",0,"N/A",0,0,"N/A","N/A","N/A","N/A","N/A",0,41106.729331793984,"ken",false,1,0,false,"MY",0,0,2,0,"DF"]
[null,null,null,null,null,null,null,null,null,null,null,null,null,null,null,null,null,null,null,null,null,null,null,null,null,null,365,0,0,0,0,0,0,3,0,0,"TA",339,0,"NOFEE","NOFEE",1,0,"","","MS LEE PHAIK CHIN","3834, TMN. LIMAU MANIS, JLN. HAMZAH","KB","15050           ","KLT","MY","","","012-9881631/012-9810233                                                                                                                               ","                                                                                                                                                      ","710813-03-5136","","KLCI",0,0,0,0,0,"",0,"N/A",0,0,"N/A","N/A","N/A","N/A","N/A",0,40647.718784722223,"mazuin",false,1,0,false,"MY",0,0,2,0,"DF"]
[null,null,null,null,null,null,null,null,null,null,null,null,null,null,null,null,null,null,null,null,null,null,null,null,null,null,365,0,0,0,0,0,0,3,0,0,"TA",356,0,"NOFEE","NOFEE",1,0,"","","LEE PICK TIN","63 JLN. USJ 18/2B, UEP SUBANG JAYA","SJ","47630           ","SEL","MY","","","03-56360200/012-2231618                                                                                                                               ","                                                                                                                                                      ","680712-06-5032","","KLCI",0,0,0,0,0,"",0,"N/A",0,0,"N/A","N/A","N/A","N/A","N/A",0,40647.719085648147,"mazuin",false,1,0,false,"MY",0,0,2,0,"DF"]
[null,null,null,null,null,null,null,null,null,null,null,null,null,null,null,null,null,null,null,null,null,null,null,null,null,null,365,0,0,0,0,0,0,3,0,0,"TA",304,0,"NOFEE","NOFEE",1,0,"","","LEE SENG BEE @ LEE MENG TEEK","33,PJU 1A/36 ARA DAMANSARA 47301 PETALING JAYA","SEPJ","47301           ","SEL","MY","","","012-2687592                                                                                                                                           ","                                                                                                                                                      ","541227-01-5509","","KLSER",0,0,0,0,0,"",0,"N/A",0,0,"","","","","",0,41171.397277002317,"mazuin",false,1,1,false,"MY",0,0,40922,0,"DF"]
[null,null,null,null,null,null,null,null,null,null,null,null,null,null,null,null,null,null,null,null,null,null,null,null,null,null,365,0,0,0,0,0,0,3,0,0,"TA",301,0,"NOFEE","NOFEE",1,0,"","","LIM SEE CHAN","7 JALAN DESA AMAN 10,TAMAN DESA AMAN,56100 KUALA LUMPUR","WPKL","56100           ","WLP","MY","","","016-2818730                                                                                                                                           ","                                                                                                                                                      ","641020-10-7041","","KLSER",0,0,0,0,0,"",0,"N/A",0,0,"","","","","",0,41109.745093518519,"mazuin",false,1,1,false,"MY",0,0,41247,0,"DF"]
[null,null,null,null,null,null,null,null,null,null,null,null,null,null,null,null,null,null,null,null,null,null,null,null,null,null,365,0,0,0,0,0,0,3,0,0,"TA",339,0,"NOFEE","NOFEE",1,0,"","","LIM SUAK GUAK","23 JALAN BK 5D/2B, BANDAR KINRARA, PUCHONG"," ","47180           ","SEL","MY","","","012-3890609                                                                                                                                           ","                                                                                                                                                      ","740803-01-5024","","KLCI",0,0,0,0,0,"",0,"N/A",0,0,"N/A","N/A","N/A","N/A","N/A",0,40647.719652777778,"mazuin",false,1,0,false,"MY",0,0,2,0,"DF"]
[null,null,null,null,null,null,null,null,null,null,null,null,null,null,null,null,null,null,null,null,null,null,null,null,null,null,365,0,0,0,0,0,0,3,0,0,"TA",310,0,"NOFEE","NOFEE",0,0,"","","LEE SIEW HENG","148,JALAN DATO LAU PAK KHUAN,TAMAN IPOH,31400 IPOH","PEIP","31400           ","PER","MY","","","5465128                                                                                                                                               ","                                                                                                                                                      ","661105-08-5281","","KLSER",0,0,0,0,0,"",0,"N/A",0,0,"","","","","",0,41165.560338807867,"mazuin",false,1,1,false,"MY",0,0,40922,0,"DF"]
[null,null,null,null,null,null,null,null,null,null,null,null,null,null,null,null,null,null,null,null,null,null,null,null,null,null,365,0,0,0,0,0,0,3,0,0,"TA",390,0,"NOFEE","NOFEE",1,0,"","","LEE SEOK KEE","NO.18, JALAN CAMAY, PASIR PUTEH","IP","31650           ","PR","MY","","","012-55555310                                                                                                                                          ","                                                                                                                                                      ","630127-08-5766","","KLCI",0,0,0,0,0,"",0,"N/A",0,0,"N/A","N/A","N/A","N/A","N/A",0,40647.719849537039,"mazuin",false,1,0,false,"MY",0,0,2,0,"DF"]
[null,null,null,null,null,null,null,null,null,null,null,null,null,null,null,null,null,null,null,null,null,null,null,null,null,null,365,0,0,0,0,0,0,3,0,0,"TA",398,0,"NOFEE","NOFEE",1,0,"","","LIM SEN OON","38, SELASAR ROKAM 20, TAMAN MUTIARA"," IP","31350           ","PR","MY","","","05-3125386, 012-5001030                                                                                                                               ","                                                                                                                                                      ","591029-06-5447","","KLCI",0,0,0,0,0,"",0,"N/A",0,0,"N/A","N/A","N/A","N/A","N/A",0,40647.720069444447,"mazuin",false,1,0,false,"MY",0,0,2,0,"DF"]
[null,null,null,null,null,null,null,null,null,null,null,null,null,null,null,null,null,null,null,null,null,null,null,null,null,null,365,0,0,0,0,0,0,3,0,0,"TA",300,0,"NOFEE","NOFEE",1,0,"","","MR LIM TSE AN","CC JLN TKC 3/1,TAMAN KOTA CHERAS,BT.9 CHERAS","SEAP","43200           ","SEL","MY","","","0123839050                                                                                                                                            ","                                                                                                                                                      ","671002-10-5373","","KLSER",0,0,0,0,0,"",0,"N/A",0,0,"","","","","",0,41109.745203668979,"mazuin",false,1,1,false,"MY",0,0,40922,0,"DF"]
[null,null,null,null,null,null,null,null,null,null,null,null,null,null,null,null,null,null,null,null,null,null,null,null,null,null,365,0,0,0,0,0,0,3,0,0,"TA",385,0,"NOFEE","NOFEE",1,0,"","","LOW TAH CHONG","4APT BLK 128 D, PUNGGOL  FIBLD WALK # 14-327"," ","824128          "," ","SG",""," ","02-64009129, 02-91392325                                                                                                                              ","                                                                                                                                                      ","S7004633D","","KLCI",0,0,0,0,0,"",0,"N/A",0,0,"N/A","N/A","N/A","N/A","N/A",0,41071.669180520832,"mazuin",false,1,1,false,"MY",0,0,2,0,"DF"]
[null,null,null,null,null,null,null,null,null,null,null,null,null,null,null,null,null,null,null,null,null,null,null,null,null,null,365,0,0,0,0,0,0,3,0,1,"TA",327,0,"NOFEE","NOFEE",1,0,"","","MR LOW WAN CHOON","NO.11-4, PANGSAPURI KAMPUNG TIONG."," ","20100           ","KT","MY","","","019-9856956                                                                                                                                           ","                                                                                                                                                      ","500203-14-5025","","KLCI",0,0,0,0,0,"",0,"N/A",0,0,"N/A","N/A","N/A","N/A","N/A",0,40655.469699074078,"mazuin",false,1,0,false,"MY",0,0,2,0,"DF"]
[null,null,null,null,null,null,null,null,null,null,null,null,null,null,null,null,null,null,null,null,null,null,null,null,null,null,365,0,0,0,0,0,0,3,0,0,"TA",278,0,"NOFEE","NOFEE",1,0,"","","LEONG MUN @ LEONG WONG FOOK","LOT 43164, JALAN DEGONG, 31900 KAMPAR, PERAK","","31900           ","PERAK","MY","","","019-5693520                                                                                                                                           ","                                                                                                                                                      ","410420-08-5701","","KLCI",0,0,0,0,0,"",0,"N/A",0,0,"N/A","N/A","N/A","N/A","N/A",0,40996.384983483797,"mazuin",false,1,0,false,"MY",0,0,2,0,"DF"]
[null,null,null,null,null,null,null,null,null,null,null,null,null,null,null,null,null,null,null,null,null,null,null,null,null,null,365,0,0,0,0,0,0,3,0,0,"TA",220,0,"NOFEE","NOFEE",1,0,"","","LAM YEW CHEONG DARREN LAM","86, SS15/6A, SUBANG JAYA","PJ","47500           ","SL","MY","","","03-56382633/017-3277115                                                                                                                               ","                                                                                                                                                      ","840224-14-5033","","KLCI",0,0,0,0,0,"",0,"N/A",0,0,"N/A","N/A","N/A","N/A","N/A",0,40647.720601851855,"mazuin",false,1,0,false,"MY",0,0,2,0,"DF"]
[null,null,null,null,null,null,null,null,null,null,null,null,null,null,null,null,null,null,null,null,null,null,null,null,null,null,365,0,0,0,0,0,0,3,0,0,"TA",228,0,"NOFEE","NOFEE",1,0,"","","LIM YEE GIAP","NO. 49, JLN. USJ 9/3L","SJ","47630           ","SL","MY","","","03-56325792/012-6933855                                                                                                                               ","                                                                                                                                                      ","740504-10-5361","","KLCI",0,0,0,0,0,"",0,"N/A",0,0,"N/A","N/A","N/A","N/A","N/A",0,40647.720312500001,"mazuin",false,1,0,false,"MY",0,0,2,0,"DF"]
[null,null,null,null,null,null,null,null,null,null,null,null,null,null,null,null,null,null,null,null,null,null,null,null,null,null,365,0,0,0,0,0,0,3,0,0,"TA",395,0,"NOFEE","NOFEE",1,0,"","","LIAU YUAN HIN","41, JALAN 9/21D, MEDAN IDAMAN"," KL","53100           ","WP","MY","","","03-40218427, 012-3188638                                                                                                                              ","                                                                                                                                                      ","561201-05-5009","","KLCI",0,0,0,0,0,"",0,"N/A",0,0,"N/A","N/A","N/A","N/A","N/A",0,40647.741990740738,"mazuin",false,1,0,false,"MY",0,0,2,0,"DF"]
[null,null,null,null,null,null,null,null,null,null,null,null,null,null,null,null,null,null,null,null,null,null,null,null,null,null,365,0,0,0,0,0,0,3,0,0,"TA",338,0,"NOFEE","NOFEE",1,0,"","","LEE YOK LAN","12-4-3 RAJA CHULAN HEIGHTS, CITY GARDEN, PERSIARAN RAJA CHULAN","KL","50200           ","WP","MY","lucy.tong@live.com.my","","03-20708248, 012-2383518                                                                                                                              ","                                                                                                                                                      ","601129-04-5378","","KLCI",0,0,0,0,0,"",0,"N/A",0,0,"N/A","N/A","N/A","N/A","N/A",0,40983.357899189818,"jessica",false,1,0,false,"MY",0,0,2,0,"DF"]
[null,null,null,null,null,null,null,null,null,null,null,null,null,null,null,null,null,null,null,null,null,null,null,null,null,null,365,0,0,0,0,0,0,3,0,0,"TA",286,0,"NOFEE","NOFEE",1,0,"","","LOH YEM PHOI","60 JALAN BALI VILLA 3,BALI VILLA RASAH KEMAYAN,70300 SEREMBAN","NGSB","70300           ","NEG","MY","","","                                                                                                                                                      ","                                                                                                                                                      ","","","KLSER",0,0,0,0,0,"",0,"N/A",0,0,"","","","","",0,41165.63760011574,"mazuin",false,1,1,false,"MY",0,0,380,0,"DF"]
[null,null,null,null,null,null,null,null,null,null,null,null,null,null,null,null,null,null,null,null,null,null,null,null,null,null,365,0,0,0,0,0,0,3,0,0,"TA",328,0,"NOFEE","NOFEE",1,0,"","","LIM GEOK ENG MARY","A6854 JLN. TOK SIRA","KT","25050           ","PH","MY","","","012-2185889                                                                                                                                           ","                                                                                                                                                      ","491225-71-5250","","KLCI",0,0,0,0,0,"",0,"N/A",0,0,"N/A","N/A","N/A","N/A","N/A",0,40746.740173611113,"jessica",false,1,0,false,"MY",0,0,2,0,"DF"]
[null,null,null,null,null,null,null,null,null,null,null,null,null,null,null,null,null,null,null,null,null,null,null,null,null,null,365,0,0,0,0,0,0,3,0,0,"TA",384,0,"NOFEE","NOFEE",1,0,"","","MRS MOK CHOON HOE NEE GEH SIEW MING","40 JALAN LAYANG LAYANG"," ","598506          "," ","SG",""," ","02-91265653                                                                                                                                           ","                                                                                                                                                      ","S1096874G","","KLCI",0,0,0,0,0,"",0,"N/A",0,0,"N/A","N/A","N/A","N/A","N/A",0,40855.646990740737,"ken",false,1,0,false,"MY",0,0,2,0,"DF"]
[null,null,null,null,null,null,null,null,null,null,null,null,null,null,null,null,null,null,null,null,null,null,null,null,null,null,365,0,0,0,0,0,0,3,0,0,"TA",295,0,"NOFEE","NOFEE",0,0,"","","NG CHEW KEE","5,JALAN SS13/3A,SUBANG JAYA INDUSTRIAL PARK,47500 PETALING JAYA,SELANGOR","SEPJ","47500           ","SEL","MY","","","012-2873935                                                                                                                                           ","                                                                                                                                                      ","530905-02-5017","","KLSER",0,0,0,0,0,"",0,"N/A",0,0,"","","","","",0,41109.745398842591,"mazuin",false,1,1,false,"MY",0,0,40922,0,"DF"]
[null,null,null,null,null,null,null,null,null,null,null,null,null,null,null,null,null,null,null,null,null,null,null,null,null,null,365,0,0,0,0,0,0,3,0,0,"TA",380,0,"NOFEE","NOFEE",1,0,"","","NG KIN YEONG","LOT 37997, BATU 7, JALAN KEPAYANG GOPENG, SIMPANG PULAI, KG KEPAYANG"," IP","31300           ","PR","MY","","","019-9843822                                                                                                                                           ","                                                                                                                                                      ","561119-11-5295","","KLCI",0,0,0,0,0,"",0,"N/A",0,0,"N/A","N/A","N/A","N/A","N/A",0,40647.72142361111,"mazuin",false,1,0,false,"MY",0,0,2,0,"DF"]
[null,null,null,null,null,null,null,null,null,null,null,null,null,null,null,null,null,null,null,null,null,null,null,null,null,null,365,0,0,0,0,0,0,3,0,-1,"TA",418,0,"NOFEE","NOFEE",1,0,"","","NG LIAN HOCK","6, JALAN SS4C/8, 47301 Petaling Jaya"," ","47301           ","SL","MY","","","019-6663353                                                                                                                                           ","                                                                                                                                                      ","500503-02-5367","","KLCI",0,0,0,0,0,"",0,"N/A",0,0,"N/A","N/A","N/A","N/A","N/A",0,40928.531738229169,"mazuin",false,1,0,false,"MY",0,0,2,0,"DF"]
[null,null,null,null,null,null,null,null,null,null,null,null,null,null,null,null,null,null,null,null,null,null,null,null,null,null,365,0,0,0,0,0,0,3,0,1,"TA",323,0,"NOFEE","NOFEE",1,0,"","","MS NG LEE PHIN","NO.17, SS22A/1, DAMANSARA JAYA","PJ","47400           ","SL","MY","","","03-77284650/012-3707613                                                                                                                               ","                                                                                                                                                      ","540720-05-5358","","KLCI",0,0,0,0,0,"",0,"N/A",0,0,"N/A","N/A","N/A","N/A","N/A",0,40647.722037037034,"mazuin",false,1,0,false,"MY",0,0,2,0,"DF"]
[null,null,null,null,null,null,null,null,null,null,null,null,null,null,null,null,null,null,null,null,null,null,null,null,null,null,365,0,0,0,0,0,0,3,0,0,"TA",338,0,"NOFEE","NOFEE",1,0,"","","NG LI TENG","NO.23, JLN. 21/23, SEA PARK","PJ","46300           ","SEL","MY","","","03-78765744, 012-3668524                                                                                                                              ","                                                                                                                                                      ","810730-14-5004","","KLCI",0,0,0,0,0,"",0,"N/A",0,0,"N/A","N/A","N/A","N/A","N/A",0,40746.740740740737,"jessica",false,1,0,false,"MY",0,0,2,0,"DF"]
[null,null,null,null,null,null,null,null,null,null,null,null,null,null,null,null,null,null,null,null,null,null,null,null,null,null,365,0,0,0,0,0,0,3,0,0,"TA",226,0,"NOFEE","NOFEE",1,0,"","","NG POH CHOO","11 JLN. KELAB GOLF 13/3, KELAB GOLF SULTAN ABDUL AZIZ SHAH","SA","40000           ","SL","MY","shinano@tm.net.my","","012-2168001                                                                                                                                           ","                                                                                                                                                      ","600223-10-5598","","KLCI",0,0,0,0,0,"",0,"N/A",0,0,"N/A","N/A","N/A","N/A","N/A",0,40647.72252314815,"mazuin",false,1,0,false,"MY",0,0,2,0,"DF"]
[null,null,null,null,null,null,null,null,null,null,null,null,null,null,null,null,null,null,null,null,null,null,null,null,null,null,365,0,0,0,0,0,0,3,0,0,"TA",325,0,"NOFEE","NOFEE",1,0,"","","NG SIEW LING","NO.39, REGAT ROKAM 1, PEKAN RAZAKI 31350 IPOH, PERAK"," ","31350           "," ","MY","","","012-5126286                                                                                                                                           ","                                                                                                                                                      ","720102-08-6286","","KLCI",0,0,0,0,0,"",0,"N/A",0,0,"N/A","N/A","N/A","N/A","N/A",0,40746.740960648145,"jessica",false,1,0,false,"MY",0,0,2,0,"DF"]
[null,null,null,null,null,null,null,null,null,null,null,null,null,null,null,null,null,null,null,null,null,null,null,null,null,null,365,0,0,0,0,0,0,3,0,0,"TA",329,0,"NOFEE","NOFEE",1,0,"","","NIZAM SHAH BIN MOHD NOOR","NO.43, JALAN 2A/6, FAMAN SETAPAK INDAH, SETAPAK, 53100 KUALA LUMPUR"," ","53100           "," ","MY","","","012-2244995                                                                                                                                           ","                                                                                                                                                      ","681023-10-6171","","KLCI",0,0,0,0,0,"",0,"N/A",0,0,"N/A","N/A","N/A","N/A","N/A",0,40830.670671296299,"arasu",false,1,0,false,"MY",0,0,2,0,"DF"]
[null,null,null,null,null,null,null,null,null,null,null,null,null,null,null,null,null,null,null,null,null,null,null,null,null,null,365,0,0,0,0,0,0,3,0,0,"TA",292,0,"NOFEE","NOFEE",1,0,"","","OON CHAU HOON","NO.5 LORONG 21,TAMAN LAKE VIEW 34000 TAIPING PERAK","PETP","34000           ","PER","MY","","","012-5778229                                                                                                                                           ","                                                                                                                                                      ","550522-08-5491","","KLSER",0,0,0,0,0,"",0,"N/A",0,0,"SUZANA BT ARIS","REMISIER","TA SECURITIES HOLDINGS BERHAD","GROUND FLOOR, PLAZA TEH SENG SENG","227 JLN RAJA PERM BAINUN, 30250 IPOH",0,41108.435881446756,"hanina",false,1,1,false,"MY",0,0,380,0,"DF"]
[null,null,null,null,null,null,null,null,null,null,null,null,null,null,null,null,null,null,null,null,null,null,null,null,null,null,365,0,0,0,0,0,0,3,0,0,"TA",220,0,"NOFEE","NOFEE",1,0,"","","ONG CHEN TEONG","101, JLN. BK 4/6, BANDAR KINRARA,","PJ","47180           ","SL","MY","","","012-2068033/03-80768033                                                                                                                               ","                                                                                                                                                      ","580914-10-6527","","KLCI",0,0,0,0,0,"",0,"N/A",0,0,"N/A","N/A","N/A","N/A","N/A",0,40647.722766203704,"mazuin",false,1,0,false,"MY",0,0,2,0,"DF"]
[null,null,null,null,null,null,null,null,null,null,null,null,null,null,null,null,null,null,null,null,null,null,null,null,null,null,365,0,0,0,0,0,0,3,0,1,"TA",319,0,"NOFEE","NOFEE",1,0,"","","MR ONG HAY THONG","29, JLN DESA RESIDEN 2, LEVENUE, DESA PARKCITY","KL","52200           ","WP","MY","wes_ong@yahoo.com","","019-3331490                                                                                                                                           ","                                                                                                                                                      ","390914-08-5829","","KLCI",0,0,0,0,0,"",0,"N/A",0,0,"N/A","N/A","N/A","N/A","N/A",0,40647.723067129627,"mazuin",false,1,0,false,"MY",0,0,2,0,"DF"]
[null,null,null,null,null,null,null,null,null,null,null,null,null,null,null,null,null,null,null,null,null,null,null,null,null,null,365,0,0,0,0,0,0,3,0,0,"TA",240,0,"NOFEE","NOFEE",1,0,"","","ONG KHENG KOK","230, LORONG BELAKANG, 34900, PANTAI  REMIS, PERAK","","34900           ","PR","MY","","","05-6771428 / 016-5169904                                                                                                                              ","                                                                                                                                                      ","740927-08-5219","","KLCI",0,0,0,0,0,"",0,"N/A",0,0,"N/A","N/A","N/A","N/A","N/A",0,40746.741493055553,"jessica",false,1,0,false,"MY",0,0,2,0,"DF"]
[null,null,null,null,null,null,null,null,null,null,null,null,null,null,null,null,null,null,null,null,null,null,null,null,null,null,365,0,0,0,0,0,0,3,0,0,"TA",247,0,"NOFEE","NOFEE",1,0,"","","ONG LAY HOON","4, LORONG PINJI, 31650, IPOH, PERAK","IP","31650           ","PR","MY","","","012-5183038                                                                                                                                           ","                                                                                                                                                      ","620116-08-5358","","KLCI",0,0,0,0,0,"",0,"N/A",0,0,"N/A","N/A","N/A","N/A","N/A",0,40716.416585648149,"hanina",false,1,0,false,"MY",0,0,2,0,"DF"]
[null,null,null,null,null,null,null,null,null,null,null,null,null,null,null,null,null,null,null,null,null,null,null,null,null,null,365,0,0,0,0,0,0,3,0,0,"TA",328,0,"NOFEE","NOFEE",1,0,"","","PEXAFOAM SDN BHD","LOT 9599, DESA AMAN","SB","47000           ","SL","MY","","","03-61569332                                                                                                                                           ","03-61568730                                                                                                                                           ","28823X","","KLCI",0,0,0,0,0,"",0,"N/A",0,0,"N/A","N/A","N/A","N/A","N/A",0,40647.723356481481,"mazuin",false,1,0,false,"MY",0,0,2,0,"DF"]
[null,null,null,null,null,null,null,null,null,null,null,null,null,null,null,null,null,null,null,null,null,null,null,null,null,null,365,0,0,0,0,0,0,3,0,-1,"TA",390,0,"NOFEE","NOFEE",1,0,"","","PANG FOOK FOR","29, LARONG PJU 3/23A, SUNWAY DAMANSARA"," PJ","47810           ","SEL","MY","","","03-78033623, 012-3836623                                                                                                                              ","                                                                                                                                                      ","661027-10-6787","","KLCI",0,0,0,0,0,"",0,"N/A",0,0,"N/A","N/A","N/A","N/A","N/A",0,40977.494008877315,"jessica",false,0,0,false,"MY",0,0,2,0,"DF"]
[null,null,null,null,null,null,null,null,null,null,null,null,null,null,null,null,null,null,null,null,null,null,null,null,null,null,365,0,0,0,0,0,0,3,0,0,"TA",299,0,"NOFEE","NOFEE",1,0,"","","PNG GEK LUANG","1,JALAN DAMAI INDAH,TAMAN DAMAI INDAH,","WPKL","56000           ","WLP","MY","chongjc62@gmail.com","","0123299068                                                                                                                                            ","                                                                                                                                                      ","620304-05-5244","","KLSER",0,0,0,0,0,"",0,"N/A",0,0,"","","","","",0,41109.745588078702,"mazuin",false,1,1,false,"MY",0,0,40922,0,"DF"]
[null,null,null,null,null,null,null,null,null,null,null,null,null,null,null,null,null,null,null,null,null,null,null,null,null,null,365,0,0,0,0,0,0,3,0,0,"TA",321,0,"NOFEE","NOFEE",1,0,"","","PHAN KHENG CHIANG","LOT PT 4260, JALAN 9/44, KWS PERINDUSTRIAN PENGKALAN CHEPA II, 16100 KOTA BHARU, KELANTAN."," ","                "," ","MY","","","012-9376699                                                                                                                                           ","                                                                                                                                                      ","670424-11-5171","","KLCI",0,0,0,0,0,"",0,"N/A",0,0,"N/A","N/A","N/A","N/A","N/A",0,40746.741712962961,"jessica",false,1,0,false,"MY",0,0,2,0,"DF"]
[null,null,null,null,null,null,null,null,null,null,null,null,null,null,null,null,null,null,null,null,null,null,null,null,null,null,365,0,0,0,0,0,0,3,0,0,"TA",339,0,"NOFEE","NOFEE",1,0,"","","PAR KOW KEAW","6, JLN. BP 4/1, BANDAR BUKIT PUCHONG,","PC","47100           ","SEL","MY","","","019-3344687                                                                                                                                           ","                                                                                                                                                      ","551002-08-5177","","KLCI",0,0,0,0,0,"",0,"N/A",0,0,"N/A","N/A","N/A","N/A","N/A",0,40647.723807870374,"mazuin",false,1,0,false,"MY",0,0,2,0,"DF"]
[null,null,null,null,null,null,null,null,null,null,null,null,null,null,null,null,null,null,null,null,null,null,null,null,null,null,365,0,0,0,0,0,0,3,0,0,"TA",386,0,"NOFEE","NOFEE",1,0,"","","PUNG MEE MEE","NO.B-3A-3, NADIA CONDO, NO.10 PERSIARAN RESIDEN DESA PARKCITY"," KP","52200           ","KL","MY","","","012-2113021                                                                                                                                           ","                                                                                                                                                      ","570106-07-5604","","KLCI",0,0,0,0,0,"",0,"N/A",0,0,"N/A","N/A","N/A","N/A","N/A",0,40647.724050925928,"mazuin",false,1,0,false,"MY",0,0,2,0,"DF"]
[null,null,null,null,null,null,null,null,null,null,null,null,null,null,null,null,null,null,null,null,null,null,null,null,null,null,365,0,0,0,0,0,0,3,0,0,"TA",242,0,"NOFEE","NOFEE",1,0,"","","PANG NYOK BOEY","NO.57B, JALAN DATO HAJI EUSOFF, OFF JALAN IPOH, DAMAI KOMPLEKS, 50400 KUALA LUMPUR.","","50400           ","KL","MY"," ","","019-3252899                                                                                                                                           ","                                                                                                                                                      ","551014-10-6342","","KLCI",0,0,0,0,0,"",0,"N/A",0,0,"N/A","N/A","N/A","N/A","N/A",0,40716.41678240741,"hanina",false,1,0,false,"MY",0,0,2,0,"DF"]
[null,null,null,null,null,null,null,null,null,null,null,null,null,null,null,null,null,null,null,null,null,null,null,null,null,null,365,0,0,0,0,0,0,3,0,0,"TA",324,0,"NOFEE","NOFEE",1,0,"","","PAW POE CHOO","183, PERSIARAN PERUPUK, SIERRAMAS, SUNGAI BULUH, 47000 SELANGOR"," ","47000           "," ","MY","","","019-3101220                                                                                                                                           ","                                                                                                                                                      ","530607-01-5478","","KLCI",0,0,0,0,0,"",0,"N/A",0,0,"N/A","N/A","N/A","N/A","N/A",0,40746.7422337963,"jessica",false,1,0,false,"MY",0,0,2,0,"DF"]
[null,null,null,null,null,null,null,null,null,null,null,null,null,null,null,null,null,null,null,null,null,null,null,null,null,null,365,0,0,0,0,0,0,3,0,0,"TA",411,0,"NOFEE","NOFEE",1,0,"","","PANG WEE LOON","NO. 25-27, JALAN MEDAN SAUJANA 2, MEDAN SAUJANA, KAMUNTING 34600, PERAK"," ","34600           ","PK","MY","","","012-5213088                                                                                                                                           ","                                                                                                                                                      ","610917-02-5495","","KLCI",0,0,0,0,0,"",0,"N/A",0,0,"N/A","N/A","N/A","N/A","N/A",0,40716.416979166665,"hanina",false,1,0,false,"MY",0,0,2,0,"DF"]
[null,null,null,null,null,null,null,null,null,null,null,null,null,null,null,null,null,null,null,null,null,null,null,null,null,null,365,0,0,0,0,0,0,3,0,0,"TA",396,0,"NOFEE","NOFEE",1,0,"","","THURAI RAJAH AL A.NAGALINGAM","NO.3 LALUAN HARIMAU"," IP","31460           ","PR","MY","","","05-5462466, 012-5628787                                                                                                                               ","                                                                                                                                                      ","280429-08-5211","","KLCI",0,0,0,0,0,"",0,"N/A",0,0,"N/A","N/A","N/A","N/A","N/A",0,40647.724236111113,"mazuin",false,1,0,false,"MY",0,0,2,0,"DF"]
[null,null,null,null,null,null,null,null,null,null,null,null,null,null,null,null,null,null,null,null,null,null,null,null,null,null,365,0,0,0,0,0,0,3,0,0,"TA",334,0,"NOFEE","NOFEE",1,0,"","","ROSLAN BIN GEMBOR","30, LORONG SS23/6F, TAMAN SEA","PJ","47400           ","SEL","MY","","","012-3711262                                                                                                                                           ","                                                                                                                                                      ","640531-10-6089","","KLCI",0,0,0,0,0,"",0,"N/A",0,0,"N/A","N/A","N/A","N/A","N/A",0,40647.724479166667,"mazuin",false,1,0,false,"MY",0,0,2,0,"DF"]
[null,null,null,null,null,null,null,null,null,null,null,null,null,null,null,null,null,null,null,null,null,null,null,null,null,null,365,0,0,0,0,0,0,3,0,0,"TA",388,0,"NOFEE","NOFEE",1,0,"","","WONG SOH HUA ROSEMARY","32, THE INGLEWOOD, SINGAPORE  575061"," ","520858          "," ","SG",""," ","02-96556132/02-64592066                                                                                                                               ","                                                                                                                                                      ","S 1120977 G","","KLCI",0,0,0,0,0,"",0,"N/A",0,0,"N/A","N/A","N/A","N/A","N/A",0,40855.647222222222,"ken",false,1,0,false,"MY",0,0,2,0,"DF"]
[null,null,null,null,null,null,null,null,null,null,null,null,null,null,null,null,null,null,null,null,null,null,null,null,null,null,365,0,0,0,0,0,0,3,0,0,"TA",398,0,"NOFEE","NOFEE",1,0,"","","ROSLY BIN HUSSIN","NO.58, LORONG BDK 2/32, BANDAR DAMANSARA , KUANTAN,26100 KUANTAN, PAHANG."," KT","26100           "," ","PH",""," ","019-9534910, 09-5604015                                                                                                                               ","                                                                                                                                                      ","621222-04-5469","","KLCI",0,0,0,0,0,"",0,"N/A",0,0,"N/A","N/A","N/A","N/A","N/A",0,40879.394247685188,"jessica",false,1,0,false,"MY",0,0,2,0,"DF"]
[null,null,null,null,null,null,null,null,null,null,null,null,null,null,null,null,null,null,null,null,null,null,null,null,null,null,365,0,0,0,0,0,0,3,0,1,"TA",350,0,"NOFEE","NOFEE",1,0,"","","MR. RSHASHI A/L K RAMAKRISNA MENON","52, JLN. KERUING, BUKIT BANDARAYA BANGSAR","KL","59100           ","WP","MY","","","03-77811388                                                                                                                                           ","                                                                                                                                                      ","660713-10-6133","","KLCI",0,0,0,0,0,"",0,"N/A",0,0,"N/A","N/A","N/A","N/A","N/A",0,40647.724699074075,"mazuin",false,1,0,false,"MY",0,0,2,0,"DF"]
[null,null,null,null,null,null,null,null,null,null,null,null,null,null,null,null,null,null,null,null,null,null,null,null,null,null,365,0,0,0,0,0,0,3,0,0,"TA",387,0,"NOFEE","NOFEE",1,0,"","","SOH BOON CHEN","63, JALAN usj 18/2b, Subang Jaya"," ","47630           "," ","SL",""," ","012-3032110,03-80247968                                                                                                                               ","                                                                                                                                                      ","680109-06-5345","","KLCI",0,0,0,0,0,"",0,"N/A",0,0,"N/A","N/A","N/A","N/A","N/A",0,40647.724976851852,"mazuin",false,1,0,false,"MY",0,0,2,0,"DF"]
[null,null,null,null,null,null,null,null,null,null,null,null,null,null,null,null,null,null,null,null,null,null,null,null,null,null,365,0,0,0,0,0,0,3,0,0,"TA",371,0,"NOFEE","NOFEE",1,0,"","","SEE CHA BOH@MARYANN SEE","7, JALAN ANGGERIK ERIA 31/105A, KOTA KEMUNING, SHAH ALAM"," ","40460           ","SEL","MY","","","03-80251382,13-3515465                                                                                                                                ","                                                                                                                                                      ","570801-10-5692","","KLCI",0,0,0,0,0,"",0,"N/A",0,0,"N/A","N/A","N/A","N/A","N/A",0,40746.74255787037,"jessica",false,1,0,false,"MY",0,0,2,0,"DF"]
[null,null,null,null,null,null,null,null,null,null,null,null,null,null,null,null,null,null,null,null,null,null,null,null,null,null,365,0,0,0,0,0,0,3,0,0,"TA",380,0,"NOFEE","NOFEE",1,0,"","","SIAU CHAU CHAI @ SEOW NAM CHONG","22A, LORONG BATU NILAM 13C, BANDAR BUKIT TINGGI, KLANG"," ","41200           ","SEL","MY","","","019-2393047                                                                                                                                           ","                                                                                                                                                      ","470130-10-5123","","KLCI",0,0,0,0,0,"",0,"N/A",0,0,"N/A","N/A","N/A","N/A","N/A",0,40647.72552083333,"mazuin",false,1,0,false,"MY",0,0,2,0,"DF"]
[null,null,null,null,null,null,null,null,null,null,null,null,null,null,null,null,null,null,null,null,null,null,null,null,null,null,365,0,0,0,0,0,0,3,0,0,"TA",230,0,"NOFEE","NOFEE",1,0,"","","LEE SEONG KEE","36, JALAN BANDAR BARU 8, BANDAR BARU  TAMUN, 31400 IPOH, PERAK","IP","47500           ","PR","MY","","","03-6271798 / 012-3306790                                                                                                                              ","                                                                                                                                                      ","530731-08-5107","","KLCI",0,0,0,0,0,"",0,"N/A",0,0,"N/A","N/A","N/A","N/A","N/A",0,40707.417280092595,"hanina",false,1,0,false,"MY",0,0,2,0,"DF"]
[null,null,null,null,null,null,null,null,null,null,null,null,null,null,null,null,null,null,null,null,null,null,null,null,null,null,365,0,0,0,0,0,0,3,0,-1,"TA",378,0,"NOFEE","NOFEE",1,0,"","","TAN SOCK KEAN","339, LORONG MAAROF, BUKIT BANDARAYA","KL","59100           ","WP","MY","","","012-2991399/03-79556435                                                                                                                               ","                                                                                                                                                      ","480805-10-5156","","KLCI",0,0,0,0,0,"",0,"N/A",0,0,"N/A","N/A","N/A","N/A","N/A",0,41075.482673379629,"hanina",false,1,0,false,"MY",0,0,2,0,"DF"]
[null,null,null,null,null,null,null,null,null,null,null,null,null,null,null,null,null,null,null,null,null,null,null,null,null,null,365,0,0,0,0,0,0,3,0,0,"TA",335,0,"NOFEE","NOFEE",1,0,"","","MR SU MING KEAT","NO.12 JLN. 20/10","PJ","46300           ","SL","MY","","","03-79560549/012-2340778                                                                                                                               ","                                                                                                                                                      ","760218-10-5801","","KLCI",0,0,0,0,0,"",0,"N/A",0,0,"N/A","N/A","N/A","N/A","N/A",0,41058.382990706021,"mazuin",false,1,0,false,"MY",0,0,2,0,"DF"]
[null,null,null,null,null,null,null,null,null,null,null,null,null,null,null,null,null,null,null,null,null,null,null,null,null,null,365,0,0,0,0,0,0,3,0,0,"TA",230,0,"NOFEE","NOFEE",1,0,"","","SIEW NGEI LAM","NO.50 JALAN BRP 7/1D, BUKIT RAHMAN PUTRA, 47000 SUNGAI BULOH, SELANGOR."," ","47000           "," ","MY","","","012-3829513                                                                                                                                           ","                                                                                                                                                      ","680305-10-6554","","KLCI",0,0,0,0,0,"",0,"N/A",0,0,"N/A","N/A","N/A","N/A","N/A",0,40746.742824074077,"jessica",false,1,0,false,"MY",0,0,2,0,"DF"]
[null,null,null,null,null,null,null,null,null,null,null,null,null,null,null,null,null,null,null,null,null,null,null,null,null,null,365,0,0,0,0,0,0,3,0,0,"TA",364,0,"NOFEE","NOFEE",1,0,"","","SOON LEH HONG","15 JLN. SS2/82","PJ","47300           "," SEL","MY","","","012-2068839                                                                                                                                           ","                                                                                                                                                      ","600229-04-5178","","KLCI",0,0,0,0,0,"",0,"N/A",0,0,"N/A","N/A","N/A","N/A","N/A",0,40647.726203703707,"mazuin",false,1,0,false,"MY",0,0,2,0,"DF"]
[null,null,null,null,null,null,null,null,null,null,null,null,null,null,null,null,null,null,null,null,null,null,null,null,null,null,365,0,0,0,0,0,0,3,0,0,"TA",417,0,"NOFEE","NOFEE",1,0,"","","TEE AH ENG","A-19-8, MUTIARA UPPER EAST AMPANG, 39 JALAN 1/76, DESA PANDAN, 55100 KUALA LUMPUR."," KL","55100           ","WP","MY","","","012-2011320                                                                                                                                           ","                                                                                                                                                      ","590516-10-5958","","KLCI",0,0,0,0,0,"",0,"N/A",0,0,"N/A","N/A","N/A","N/A","N/A",0,40716.417395833334,"hanina",false,1,0,false,"MY",0,0,2,0,"DF"]
[null,null,null,null,null,null,null,null,null,null,null,null,null,null,null,null,null,null,null,null,null,null,null,null,null,null,365,0,0,0,0,0,0,3,0,0,"TA",336,0,"NOFEE","NOFEE",1,0,"","","MS TEH AH MOY","NO.622 JLN. 8, AMPANG UTAMA","AMPAN","68000           ","SL","MY","","","03-42603233/0163388471                                                                                                                                ","                                                                                                                                                      ","640310-10-6958","","KLCI",0,0,0,0,0,"",0,"N/A",0,0,"N/A","N/A","N/A","N/A","N/A",0,40647.726435185185,"mazuin",false,1,0,false,"MY",0,0,2,0,"DF"]
[null,null,null,null,null,null,null,null,null,null,null,null,null,null,null,null,null,null,null,null,null,null,null,null,null,null,365,0,0,0,0,0,0,3,0,0,"TA",325,0,"NOFEE","NOFEE",1,0,"","","TANI LIAU KAU @ TEH ENG MONG","142, JALAN TAMING SARI, 34000 TAIPING, PERAK"," ","34000           "," ","MY","","","012-5035799                                                                                                                                           ","                                                                                                                                                      ","450122-08-5419","","KLCI",0,0,0,0,0,"",0,"N/A",0,0,"N/A","N/A","N/A","N/A","N/A",0,40746.743125000001,"jessica",false,1,0,false,"MY",0,0,2,0,"DF"]
[null,null,null,null,null,null,null,null,null,null,null,null,null,null,null,null,null,null,null,null,null,null,null,null,null,null,365,0,0,0,0,0,0,3,0,0,"TA",391,0,"NOFEE","NOFEE",1,0,"","","TAN BEE GAIK","28, JLN. TENGKU AMPUAN, TMN. JUTA"," ","50480           ","KL","MY","","","                                                                                                                                                      ","                                                                                                                                                      ","490804-10-5188","","KLCI",0,0,0,0,0,"",0,"N/A",0,0,"N/A","N/A","N/A","N/A","N/A",0,40647.726643518516,"mazuin",false,1,0,false,"MY",0,0,2,0,"DF"]
[null,null,null,null,null,null,null,null,null,null,null,null,null,null,null,null,null,null,null,null,null,null,null,null,null,null,365,0,0,0,0,0,0,3,0,0,"TA",391,0,"NOFEE","NOFEE",1,0,"","","THAM CHEE NAM @ ANDREW THAM","TAMAN PAK TAK BATU 7, MDLB 222 JALAN LAPANGAN TERBANG, PETI SURAT 1119, SANDAKAN, SABAH"," ","90008           ","SB","MY","","","019-8337215                                                                                                                                           ","                                                                                                                                                      ","440413-71-5231","","KLCI",0,0,0,0,0,"",0,"N/A",0,0,"N/A","N/A","N/A","N/A","N/A",0,41068.388481400463,"mazuin",false,1,0,false,"MY",0,0,2,0,"DF"]
[null,null,null,null,null,null,null,null,null,null,null,null,null,null,null,null,null,null,null,null,null,null,null,null,null,null,365,0,0,0,0,0,0,3,0,0,"TA",392,0,"NOFEE","NOFEE",1,0,"","","THAM KAI FUNG","P.O.BOX 1119, SANDAKAN, SABAH"," ","90712           ","","MY","","","                                                                                                                                                      ","                                                                                                                                                      ","710830-12-5045","","KLCI",0,0,0,0,0,"",0,"N/A",0,0,"N/A","N/A","N/A","N/A","N/A",0,40716.417766203704,"hanina",false,1,0,false,"MY",0,0,2,0,"DF"]
[null,null,null,null,null,null,null,null,null,null,null,null,null,null,null,null,null,null,null,null,null,null,null,null,null,null,365,0,0,0,0,0,0,3,0,1,"TA",361,0,"NOFEE","NOFEE",1,0,"","","TAN KUAY GEOK","C/O TAE. 35TH FLR, MENARA TA ONE, 22 JLN. P. RAMLEE","KL","50250           ","WP","MY","","","012-6482827                                                                                                                                           ","                                                                                                                                                      ","540331-07-5216","","KLCI",0,0,0,0,0,"",0,"N/A",0,0,"N/A","N/A","N/A","N/A","N/A",0,40647.727337962962,"mazuin",false,1,0,false,"MY",0,0,2,0,"DF"]
[null,null,null,null,null,null,null,null,null,null,null,null,null,null,null,null,null,null,null,null,null,null,null,null,null,null,365,0,0,0,0,0,0,3,0,0,"TA",368,0,"NOFEE","NOFEE",1,0,"","","TIEW KING HOCK","20-5, IDAMAN PUTERI CONDO. NO. 4, JLN. 13/21D, MEDAN IDAMAN","KL","53000           "," WP","MY","","","03-40248616/012-6372637                                                                                                                               ","                                                                                                                                                      ","700527-10-5253","","KLCI",0,0,0,0,0,"",0,"N/A",0,0,"N/A","N/A","N/A","N/A","N/A",0,40647.72755787037,"mazuin",false,1,0,false,"MY",0,0,2,0,"DF"]
[null,null,null,null,null,null,null,null,null,null,null,null,null,null,null,null,null,null,null,null,null,null,null,null,null,null,365,0,0,0,0,0,0,3,0,0,"TA",352,0,"NOFEE","NOFEE",1,0,"","","MR TEH KIM SAI","NO.23 JLN. AMAN KECIL 7, OVERSEAS UNION GARDEN, BATU 5, JLN KELANG LAMA","KL","58200           ","WP","MY","","","03-79832155                                                                                                                                           ","                                                                                                                                                      ","490429-04-5143","","KLCI",0,0,0,0,0,"",0,"N/A",0,0,"N/A","N/A","N/A","N/A","N/A",0,40721.413171296299,"hanina",false,1,0,false,"MY",0,0,2,0,"DF"]
[null,null,null,null,null,null,null,null,null,null,null,null,null,null,null,null,null,null,null,null,null,null,null,null,null,null,365,0,0,0,0,0,0,3,0,0,"TA",3388,0,"NOFEE","NOFEE",1,0,"","","TAN LAI FONG","30 JLN. TEMPINIS KANAN","KL","59100           ","WP","MY","","","016-6126232                                                                                                                                           ","                                                                                                                                                      ","611107-10-6386","","KLCI",0,0,0,0,0,"",0,"N/A",0,0,"N/A","N/A","N/A","N/A","N/A",0,40647.728043981479,"mazuin",false,1,0,false,"MY",0,0,2,0,"DF"]
[null,null,null,null,null,null,null,null,null,null,null,null,null,null,null,null,null,null,null,null,null,null,null,null,null,null,365,0,0,0,0,0,0,3,0,0,"TA",335,0,"NOFEE","NOFEE",1,0,"","","TOI MEY MEY","16, JLN. POLO 10/3, KOTA DAMANSARA","PJ","47810           ","SL","MY","","","019-3329197                                                                                                                                           ","                                                                                                                                                      ","540407-03-5078","","KLCI",0,0,0,0,0,"",0,"N/A",0,0,"N/A","N/A","N/A","N/A","N/A",0,40647.728275462963,"mazuin",false,1,0,false,"MY",0,0,2,0,"DF"]
[null,null,null,null,null,null,null,null,null,null,null,null,null,null,null,null,null,null,null,null,null,null,null,null,null,null,365,0,0,0,0,0,0,3,0,0,"TA",334,0,"NOFEE","NOFEE",1,0,"","","TAM MEE YING","25, JLN. JERMERLAG KUNING SIERRAMAS","SB","47000           ","SL","MY","","","03-67300683/012-3651665                                                                                                                               ","                                                                                                                                                      ","541102-04-5042","","KLCI",0,0,0,0,0,"",0,"N/A",0,0,"N/A","N/A","N/A","N/A","N/A",0,41122.380694328705,"jessica",false,1,0,false,"MY",0,0,2,0,"DF"]
[null,null,null,null,null,null,null,null,null,null,null,null,null,null,null,null,null,null,null,null,null,null,null,null,null,null,365,0,0,0,0,0,0,3,0,0,"TA",370,0,"NOFEE","NOFEE",1,0,"","","TUEN POH MANG","NO. 61 JALAN USJ 2/5J SUBANG JAYA"," ","47600           ","SEL","MY","","","016-3289908                                                                                                                                           ","                                                                                                                                                      ","611031-08-5581","","KLCI",0,0,0,0,0,"",0,"N/A",0,0,"N/A","N/A","N/A","N/A","N/A",0,40651.384282407409,"hanina",false,1,0,false,"MY",0,0,2,0,"DF"]
[null,null,null,null,null,null,null,null,null,null,null,null,null,null,null,null,null,null,null,null,null,null,null,null,null,null,365,0,0,0,0,0,0,3,0,0,"TA",284,0,"NOFEE","NOFEE",1,0,"","","THEN PEI YEOW","13,SS 1/1C,47300 PETALING JAYA,SELANGOR","SEPJ","47300           ","SEL","MY","mag_then@email.com","","012-2013060                                                                                                                                           ","                                                                                                                                                      ","","","KLSER",0,0,0,0,0,"",0,"N/A",0,0,"","","","","",0,41066.603376770836,"hanina",false,1,1,false,"MY",0,0,380,0,"DF"]
[null,null,null,null,null,null,null,null,null,null,null,null,null,null,null,null,null,null,null,null,null,null,null,null,null,null,365,0,0,0,0,0,0,3,0,0,"TA",390,0,"NOFEE","NOFEE",1,0,"","","TAN SIEW BEE","22 JLN. KASAWARI 3, BANDAR PUCHONG JAYA","PUJON","47100           ","SL","MY","","","                                                                                                                                                      ","                                                                                                                                                      ","710603-07-5658","","KLCI",0,0,0,0,0,"",0,"N/A",0,0,"N/A","N/A","N/A","N/A","N/A",0,40647.728726851848,"mazuin",false,1,0,false,"MY",0,0,2,0,"DF"]
[null,null,null,null,null,null,null,null,null,null,null,null,null,null,null,null,null,null,null,null,null,null,null,null,null,null,365,0,0,0,0,0,0,3,0,0,"TA",223,0,"NOFEE","NOFEE",1,0,"","","TAN SWEE KUN","NO.11, JLN. ANGGERIK ONCIDIUM 31/71D, KOTA KEMUNING","SA","40460           ","SL","MY","tsk.htmc@gmail.com","","03-51247087/012-2247289                                                                                                                               ","                                                                                                                                                      ","570415-08-5275","","KLCI",0,0,0,0,0,"",0,"N/A",0,0,"N/A","N/A","N/A","N/A","N/A",0,41075.484431631943,"hanina",false,1,0,false,"MY",0,0,2,0,"DF"]
[null,null,null,null,null,null,null,null,null,null,null,null,null,null,null,null,null,null,null,null,null,null,null,null,null,null,365,0,0,0,0,0,0,3,0,-1,"TA",410,0,"NOFEE","NOFEE",1,0,"","","TAN SOOK PENG","339 LORONG MAAROF,","KL","59000           ","WP","MY","","","019-3356303                                                                                                                                           ","                                                                                                                                                      ","470417-10-5710","","KLCI",0,0,0,0,0,"",0,"N/A",0,0,"N/A","N/A","N/A","N/A","N/A",0,41075.492741747687,"hanina",false,1,0,false,"MY",0,0,2,0,"DF"]
[null,null,null,null,null,null,null,null,null,null,null,null,null,null,null,null,null,null,null,null,null,null,null,null,null,null,365,0,0,0,0,0,0,3,0,0,"TA",330,0,"NOFEE","NOFEE",1,0,"","","TEE SUA WA","29, JLN. KELAB GOLF 13/6, K.G. S.A.A.S","SA","40000           ","SL","MY","","","03-55116621/012-2688128                                                                                                                               ","                                                                                                                                                      ","530820-10-5368","","KLCI",0,0,0,0,0,"",0,"N/A",0,0,"N/A","N/A","N/A","N/A","N/A",0,40647.729456018518,"mazuin",false,1,0,false,"MY",0,0,2,0,"DF"]
[null,null,null,null,null,null,null,null,null,null,null,null,null,null,null,null,null,null,null,null,null,null,null,null,null,null,365,0,0,0,0,0,0,3,0,0,"TA",279,0,"NOFEE","NOFEE",1,0,"","","TAN SWEE KWONG","NO 170, JALAN BESAR BAGAN, SEKINCAN","","45400           ","SEL","MY","","","03-32416268                                                                                                                                           ","                                                                                                                                                      ","541021-10-6093","","KLCI",0,0,0,0,0,"",0,"N/A",0,0,"","","NO 170","JLN BESAR BAGAN","45400 SEKINCAN, SEL",0,41008.527532604166,"ken",false,1,0,false,"MY",0,0,2,0,"DF"]
[null,null,null,null,null,null,null,null,null,null,null,null,null,null,null,null,null,null,null,null,null,null,null,null,null,null,365,0,0,0,0,0,0,3,0,0,"TA",225,0,"NOFEE","NOFEE",1,0,"","","TAI TSU LIM","NO.16, JALAN POLO 10/2, OFF PERSIARAN MAHOGANI, SEKSYEN 10, KOTA DAMANSARA","PJ","47840           ","SL","MY","","","03-78051896/012-2835418                                                                                                                               ","                                                                                                                                                      ","560818-01-6101","","KLCI",0,0,0,0,0,"",0,"N/A",0,0,"N/A","N/A","N/A","N/A","N/A",0,41116.701937349535,"ken",false,1,0,false,"MY",0,0,2,0,"DF"]
[null,null,null,null,null,null,null,null,null,null,null,null,null,null,null,null,null,null,null,null,null,null,null,null,null,null,365,0,0,0,0,0,0,3,0,0,"TA",340,0,"NOFEE","NOFEE",1,0,"","","THEN YOON YIN","11 PERSIARAN BUKIT MERU 6, MERU HEIGHTS","PERAK","30020           ","IPOH","MY","","","05-2414922, 016-5660121                                                                                                                               ","                                                                                                                                                      ","440816-08-5318","","KLCI",0,0,0,0,0,"",0,"N/A",0,0,"N/A","N/A","N/A","N/A","N/A",0,40746.743680555555,"jessica",false,1,0,false,"MY",0,0,2,0,"DF"]
[null,null,null,null,null,null,null,null,null,null,null,null,null,null,null,null,null,null,null,null,null,null,null,null,null,null,365,0,0,0,0,0,0,3,0,1,"TA",321,0,"NOFEE","NOFEE",1,0,"","","MR VOO CHEE CHEUNG","NO.8 JLN. WAN SENDARI 3, TMN SRI ENDAH, SRI PETALING","KL","57000           ","WP","MY","","","012-2836662                                                                                                                                           ","                                                                                                                                                      ","680814-10-5779","","KLCI",0,0,0,0,0,"",0,"N/A",0,0,"N/A","N/A","N/A","N/A","N/A",0,40647.730092592596,"mazuin",false,1,0,false,"MY",0,0,2,0,"DF"]
[null,null,null,null,null,null,null,null,null,null,null,null,null,null,null,null,null,null,null,null,null,null,null,null,null,null,365,0,0,0,0,0,0,3,0,0,"TA",387,0,"NOFEE","NOFEE",1,0,"","","VICTOR TAN ENG CHEOW","858, TAMINES AVANUE 5, #08-539"," ","520858          "," ","SG",""," ","02-96780847                                                                                                                                           ","                                                                                                                                                      ","E0339986K","","KLCI",0,0,0,0,0,"",0,"N/A",0,0,"N/A","N/A","N/A","N/A","N/A",0,40855.647569444445,"ken",false,1,0,false,"MY",0,0,2,0,"DF"]
[null,null,null,null,null,null,null,null,null,null,null,null,null,null,null,null,null,null,null,null,null,null,null,null,null,null,365,0,0,0,0,0,0,3,0,0,"TA",297,0,"NOFEE","NOFEE",1,0,"","","MR.WOO CHARK KUM @ WOO YON CHUAN","51 JALAN SELASIH,TAMAN CHERAS,56100","WPKL","56100           ","WLP","MY","","","012-2003418                                                                                                                                           ","                                                                                                                                                      ","330722-10-5093","","KLSER",0,0,0,0,0,"",0,"N/A",0,0,"","","","","",0,41109.745797337964,"mazuin",false,1,1,false,"MY",0,0,40922,0,"DF"]
[null,null,null,null,null,null,null,null,null,null,null,null,null,null,null,null,null,null,null,null,null,null,null,null,null,null,365,0,0,0,0,0,0,3,0,0,"TA",390,0,"NOFEE","NOFEE",1,0,"","","WONG CHEE YUAN","49 JLN. SP 5/1, TMN. SEGAR PERDANA, BT.9 CHERAS","","43200           ","KL","MY","","","                                                                                                                                                      ","                                                                                                                                                      ","730212-08-5427","","KLCI",0,0,0,0,0,"",0,"N/A",0,0,"N/A","N/A","N/A","N/A","N/A",0,40647.730590277781,"mazuin",false,1,0,false,"MY",0,0,2,0,"DF"]
[null,null,null,null,null,null,null,null,null,null,null,null,null,null,null,null,null,null,null,null,null,null,null,null,null,null,365,0,0,0,0,0,0,3,0,0,"TA",259,0,"NOFEE","NOFEE",1,0,"","","WONG FOOK FOH","NO.30, JALAN PERISA 17, BANDAR BARU SERI PETALING, 57000 KUALA LUMPUR"," KL","57000           ","","MY","","","                                                                                                                                                      ","                                                                                                                                                      ","690822-06-5331","","KLCI",0,0,0,0,0,"",0,"N/A",0,0,"N/A","N/A","N/A","N/A","N/A",0,40701.436631944445,"hanina",false,1,0,false,"MY",0,0,2,0,"DF"]
[null,null,null,null,null,null,null,null,null,null,null,null,null,null,null,null,null,null,null,null,null,null,null,null,null,null,365,0,0,0,0,0,0,3,0,-1,"TA",325,0,"NOFEE","NOFEE",1,0,"","","MS WOO JEE MIN","25, JLN. 5/155B, BUKIT JALIL GOLF RESORT","","57000           ","KL","MY","","","012-6022826                                                                                                                                           ","                                                                                                                                                      ","560312-01-6016","","KLCI",0,0,0,0,0,"",0,"N/A",0,0,"N/A","N/A","N/A","N/A","N/A",0,40928.533474456017,"mazuin",false,1,0,false,"MY",0,0,2,0,"DF"]
[null,null,null,null,null,null,null,null,null,null,null,null,null,null,null,null,null,null,null,null,null,null,null,null,null,null,365,0,0,0,0,0,0,3,0,0,"TA",340,0,"NOFEE","NOFEE",1,0,"","","MR WONG KIEN CHOONG","PT 1479T, TMN SBJ PUTRA, PASIR PEKAN","KB","16250           ","KLT","MY","scmskb@gmail.com","","012-9811825                                                                                                                                           ","                                                                                                                                                      ","721012-03-5105","","KLCI",0,0,0,0,0,"",0,"N/A",0,0,"N/A","N/A","N/A","N/A","N/A",0,40647.735995370371,"mazuin",false,1,0,false,"MY",0,0,2,0,"DF"]
[null,null,null,null,null,null,null,null,null,null,null,null,null,null,null,null,null,null,null,null,null,null,null,null,null,null,365,0,0,0,0,0,0,3,0,0,"TA",248,0,"NOFEE","NOFEE",1,0,"","","WONG LAY HEONG","8, HALA PINJI JAYA 1, TAMAN PINJI JAYA, 31650, IPOH, PERAK","IP","31650           ","PR","MY","","","012-5225089                                                                                                                                           ","                                                                                                                                                      ","690516-08-5414","","KLCI",0,0,0,0,0,"",0,"N/A",0,0,"N/A","N/A","N/A","N/A","N/A",0,40716.418344907404,"hanina",false,1,0,false,"MY",0,0,2,0,"DF"]
[null,null,null,null,null,null,null,null,null,null,null,null,null,null,null,null,null,null,null,null,null,null,null,null,null,null,365,0,0,0,0,0,0,3,0,0,"TA",340,0,"NOFEE","NOFEE",1,0,"","","WU NEE PENG","20 JLN. PENGATURCARA, U1/51D SHAH ALAM"," ","40150           ","SEL","MY","","","016-3320958                                                                                                                                           ","                                                                                                                                                      ","581028-01-5633","","KLCI",0,0,0,0,0,"",0,"N/A",0,0,"N/A","N/A","N/A","N/A","N/A",0,40647.736250000002,"mazuin",false,1,0,false,"MY",0,0,2,0,"DF"]
[null,null,null,null,null,null,null,null,null,null,null,null,null,null,null,null,null,null,null,null,null,null,null,null,null,null,365,0,0,0,0,0,0,3,0,0,"TA",296,0,"NOFEE","NOFEE",1,0,"","","MR WONG PET LIM","317E,JLN 17.AMPANG NEW VILLAGE,68000 AMPANG","SEAP","68000           ","SEL","MY","","","012-6988964                                                                                                                                           ","                                                                                                                                                      ","461024-10-5547","","KLSER",0,0,0,0,0,"",0,"N/A",0,0,"","","","","",0,41109.746017974539,"mazuin",false,1,1,false,"MY",0,0,40922,0,"DF"]
[null,null,null,null,null,null,null,null,null,null,null,null,null,null,null,null,null,null,null,null,null,null,null,null,null,null,365,0,0,0,0,0,0,3,0,0,"TA",338,0,"NOFEE","NOFEE",1,0,"","","MS WOO SOOK YANN","UNIT 10-10-2, PRISMA CHERAS CONDO, JLN. MIDAH SA"," KL","56000           ","WP","MY","","","03-91309818/012-3733931                                                                                                                               ","                                                                                                                                                      ","700919-05-5224","","KLCI",0,0,0,0,0,"",0,"N/A",0,0,"N/A","N/A","N/A","N/A","N/A",0,40647.736481481479,"mazuin",false,1,0,false,"MY",0,0,2,0,"DF"]
[null,null,null,null,null,null,null,null,null,null,null,null,null,null,null,null,null,null,null,null,null,null,null,null,null,null,365,0,0,0,0,0,0,3,0,-1,"TA",381,0,"NOFEE","NOFEE",1,0,"","","WONG TEK CHIN","397, JLN. PAHANG SETAPAK,","KL","53000           ","WP","MY","","","03-40233625/012-6301086                                                                                                                               ","                                                                                                                                                      ","370725-71-5176","","KLCI",0,0,0,0,0,"",0,"N/A",0,0,"N/A","N/A","N/A","N/A","N/A",0,41162.601061261572,"hanina",false,1,0,false,"MY",0,0,2,0,"DF"]
[null,null,null,null,null,null,null,null,null,null,null,null,null,null,null,null,null,null,null,null,null,null,null,null,null,null,365,0,0,0,0,0,0,3,0,0,"TA",275,0,"NOFEE","NOFEE",1,0,"","","YEE AH YIN @ YEE LAI YIN","173 JLN DATO LAU PAK KHUAN, IPOH GARDEN","IPOH","31400           ","","MY","","","012-5300599 / 05-2416048                                                                                                                              ","                                                                                                                                                      ","370706-08-5148","","KLCI",0,0,0,0,0,"",0,"N/A",0,0,"N/A","N/A","N/A","N/A","N/A",0,40701.436898148146,"hanina",false,1,0,false,"MY",0,0,2,0,"DF"]
[null,null,null,null,null,null,null,null,null,null,null,null,null,null,null,null,null,null,null,null,null,null,null,null,null,null,365,0,0,0,0,0,0,3,0,0,"TA",335,0,"NOFEE","NOFEE",1,0,"","","YEOH BOON GUAN @ YEOH KOK SENG ","238, PHASE 1A, PERSIARAN BUNGUR ROSA SIERRAMAS","SB","47000           ","SEL","MY","","","012-2889292                                                                                                                                           ","                                                                                                                                                      ","450526-07-5401","","KLCI",0,0,0,0,0,"",0,"N/A",0,0,"N/A","N/A","N/A","N/A","N/A",0,40647.736921296295,"mazuin",false,1,0,false,"MY",0,0,2,0,"DF"]
[null,null,null,null,null,null,null,null,null,null,null,null,null,null,null,null,null,null,null,null,null,null,null,null,null,null,365,0,0,0,0,0,0,3,0,0,"TA",385,0,"NOFEE","NOFEE",1,0,"","","YONG CHAU CHIN","21, LEBUH TURI, TMN. CHI LIUNG, ","KLANG","41200           ","SL","MY","","ccyong@tcim.com.my","012-3657238                                                                                                                                           ","03-56331040                                                                                                                                           ","510828-10-6121","","KLCI",0,0,0,0,0,"",0,"N/A",0,0,"N/A","N/A","N/A","N/A","N/A",0,40716.41847222222,"hanina",false,1,0,false,"MY",0,0,2,0,"DF"]
[null,null,null,null,null,null,null,null,null,null,null,null,null,null,null,null,null,null,null,null,null,null,null,null,null,null,365,0,0,0,0,0,0,3,0,0,"TA",390,0,"NOFEE","NOFEE",1,0,"","","MS LAW YEAN CHYE","150, JALAN DESA MESRA, TAMAN DESA, ","","58100           ","KL","MY","","","012-3223833/03-27329136                                                                                                                               ","                                                                                                                                                      ","710930-01-6460","","KLCI",0,0,0,0,0,"",0,"N/A",0,0,"N/A","N/A","N/A","N/A","N/A",0,40996.490814895835,"mazuin",false,1,0,false,"MY",0,0,2,0,"DF"]
[null,null,null,null,null,null,null,null,null,null,null,null,null,null,null,null,null,null,null,null,null,null,null,null,null,null,365,0,0,0,0,0,0,3,0,0,"TA",385,0,"NOFEE","NOFEE",1,0,"","","YAP EE LING","22 JALAN USJ HEIGHTS, 2/1C, USJ HEIGHTS","SJ","47610           ","SEL","MY","","","019-3816292                                                                                                                                           ","                                                                                                                                                      ","771021-07-5980","","KLCI",0,0,0,0,0,"",0,"N/A",0,0,"N/A","N/A","N/A","N/A","N/A",0,40647.737835648149,"mazuin",false,1,0,false,"MY",0,0,2,0,"DF"]
[null,null,null,null,null,null,null,null,null,null,null,null,null,null,null,null,null,null,null,null,null,null,null,null,null,null,365,0,0,0,0,0,0,3,0,0,"TA",337,0,"NOFEE","NOFEE",1,0,"","","YAP KEAK TONG","NO. 36 LORONG CAVENDISH, TAMAN BEAUTY","IP","30250           ","PR","MY","","","2429670, 019-5047507                                                                                                                                  ","                                                                                                                                                      ","480612-08-5865","","KLCI",0,0,0,0,0,"",0,"N/A",0,0,"N/A","N/A","N/A","N/A","N/A",0,41171.397447106479,"mazuin",false,1,0,false,"MY",0,0,2,0,"DF"]
[null,null,null,null,null,null,null,null,null,null,null,null,null,null,null,null,null,null,null,null,null,null,null,null,null,null,365,0,0,0,0,0,0,3,0,0,"TA",390,0,"NOFEE","NOFEE",1,0,"","","YIP LAI FONG","4376-B, JLN. KEBUN SULTAN","KB.","15300           ","KLT","MY","","","09-7446024                                                                                                                                            ","                                                                                                                                                      ","650202-08-5968","","KLCI",0,0,0,0,0,"",0,"N/A",0,0,"N/A","N/A","N/A","N/A","N/A",0,40647.738611111112,"mazuin",false,1,0,false,"MY",0,0,2,0,"DF"]
[null,null,null,null,null,null,null,null,null,null,null,null,null,null,null,null,null,null,null,null,null,null,null,null,null,null,365,0,0,0,0,0,0,3,0,0,"TA",382,0,"NOFEE","NOFEE",1,0,"","","YEONG MOY KOOI@YEONG MOI KOOI YIN","NO. 7, JLN. PERDANA 2/16, PANDAN PERDANA","KL","55300           ","WP","MY","","","03-92820905/019-2196613                                                                                                                               ","                                                                                                                                                      ","520217-08-5332","","KLCI",0,0,0,0,0,"",0,"N/A",0,0,"N/A","N/A","N/A","N/A","N/A",0,40647.698310185187,"mazuin",false,1,0,false,"MY",0,0,2,0,"DF"]
[null,null,null,null,null,null,null,null,null,null,null,null,null,null,null,null,null,null,null,null,null,null,null,null,null,null,365,0,0,0,0,0,0,3,0,0,"TA",337,0,"NOFEE","NOFEE",1,0,"","","YIP PUI KUAN","3-1-23, Randa Apartment, no. 3, Jalan Anggerik Tainia 31/112","SA","40460           ","SEL","MY","puikuanyi@yahoo.com","","03-51213345, 012-2110255                                                                                                                              ","                                                                                                                                                      ","741022-08-5518","","KLCI",0,0,0,0,0,"",0,"N/A",0,0,"N/A","N/A","N/A","N/A","N/A",0,40647.738877314812,"mazuin",false,1,0,false,"MY",0,0,2,0,"DF"]
[null,null,null,null,null,null,null,null,null,null,null,null,null,null,null,null,null,null,null,null,null,null,null,null,null,null,365,0,0,0,0,0,0,3,0,1,"TA",322,0,"NOFEE","NOFEE",1,0,"","","MR YAP PAK LIM","114, JLN BUKIT DESA UTAMA, TMN. DESA KEPONG,","KL","52100           ","WP","MY","","","03-62721423/0192141923                                                                                                                                ","                                                                                                                                                      ","640120-10-7319","","KLCI",0,0,0,0,0,"",0,"N/A",0,0,"N/A","N/A","N/A","N/A","N/A",0,40647.73914351852,"mazuin",false,1,0,false,"MY",0,0,2,0,"DF"]
[null,null,null,null,null,null,null,null,null,null,null,null,null,null,null,null,null,null,null,null,null,null,null,null,null,null,365,0,0,0,0,0,0,3,0,0,"TA",335,0,"NOFEE","NOFEE",1,0,"","","YEOH SENG CHONG","NO.16, JLN. 31/104A, KOTA KEMUNING","SA","40460           ","SEL","MY","","","012-2919096                                                                                                                                           ","                                                                                                                                                      ","690706-04-5317","","KLCI",0,0,0,0,0,"",0,"N/A",0,0,"N/A","N/A","N/A","N/A","N/A",0,40647.739351851851,"mazuin",false,1,0,false,"MY",0,0,2,0,"DF"]
[null,null,null,null,null,null,null,null,null,null,null,null,null,null,null,null,null,null,null,null,null,null,null,null,null,null,365,0,0,0,0,0,0,3,0,-1,"TA",257,0,"NOFEE","NOFEE",1,0,"","","YAP SIEW HONG","11, JALAN SERI BINTANG 5A, BAYU SRI BINTANG, 52100 KUALA LUMPUR."," KL","52100           ","","MY","","","012-2572511                                                                                                                                           ","                                                                                                                                                      ","631101-10-6578","","KLCI",0,0,0,0,0,"",0,"N/A",0,0,"N/A","N/A","N/A","N/A","N/A",0,40928.534122106481,"mazuin",false,1,0,false,"MY",0,0,2,0,"DF"]
[null,null,null,null,null,null,null,null,null,null,null,null,null,null,null,null,null,null,null,null,null,null,null,null,null,null,365,0,0,0,0,0,0,3,0,0,"TA",338,0,"NOFEE","NOFEE",1,0,"","","YOU SEO LIAN","6-13C, FABER RIA APARTMENT, JALAN DESA SENTOSA, TAMAN DESA","KL","58100           ","WP","MY","","","016-2925639                                                                                                                                           ","                                                                                                                                                      ","470731-04-5058","","KLCI",0,0,0,0,0,"",0,"N/A",0,0,"N/A","N/A","N/A","N/A","N/A",0,40647.739594907405,"mazuin",false,1,0,false,"MY",0,0,2,0,"DF"]
[null,null,null,null,null,null,null,null,null,null,null,null,null,null,null,null,null,null,null,null,null,null,null,null,null,null,365,0,0,0,0,0,0,3,0,0,"TA",368,0,"NOFEE","NOFEE",1,0,"","","YONG SIIU SIIU","APT BIK 525, JURONG WEST STREET 52, #07-265"," ","640525          ","SG","MY","","","016-2684697/02-82883319                                                                                                                               ","                                                                                                                                                      ","S1850737D","","KLCI",0,0,0,0,0,"",0,"N/A",0,0,"N/A","N/A","N/A","N/A","N/A",0,40855.648136574076,"ken",false,1,0,false,"MY",0,0,2,0,"DF"]
[null,null,null,null,null,null,null,null,null,null,null,null,null,null,null,null,null,null,null,null,null,null,null,null,null,null,365,0,0,0,0,0,0,3,0,0,"TA",390,0,"NOFEE","NOFEE",1,0,"","","YU YANG CHYN","3 JALAN ANGGERIK VANDA SATU, 31/168A KOTA KEMUNING HILLS, SEKSYEN 31, SHAH ALAM"," ","40460           ","SEL","MY","","","012-3839191                                                                                                                                           ","                                                                                                                                                      ","560822-08-5062","","KLCI",0,0,0,0,0,"",0,"N/A",0,0,"N/A","N/A","N/A","N/A","N/A",0,40732.430254629631,"hanina",false,1,0,false,"MY",0,0,2,0,"DF"]
[null,null,null,null,null,null,null,null,null,null,null,null,null,null,null,null,null,null,null,null,null,null,null,null,null,null,365,0,0,0,0,0,0,3,0,0,"TA",10,0,"NOFEE","NOFEE",1,0,"","","Tham Lai Lai","Wisma Rockwills, No. 62, Jalan 1/31A, off Jalan Klang Lama, 58200 KL","","                ","","","","","03-77811993                                                                                                                                           ","03-77831993                                                                                                                                           ","","","KLCI",0,0,0,0,0,"",0,"N/A",0,0,"N/A","N/A","N/A","N/A","N/A",0,40604.729837962965,"ken",false,1,0,false,"MY",0,0,2,0,"DF"]
[null,null,null,null,null,null,null,null,null,null,null,null,null,null,null,null,null,null,null,null,null,null,null,null,null,null,365,0,0,0,0,0,0,3,0,0,"TA",59,0,"NOFEE","NOFEE",1,0,"","","MS.CHEONG ","No.18-1, jalan PJS 8/12, Dataran Menteri, Petaling Jaya"," ","46150           ","SL","MY","","","03-56329999                                                                                                                                           ","03-56362723, 03-56367723                                                                                                                              ","","","KLCI",0,0,0,0,0,"",0,"N/A",0,0,"N/A","N/A","N/A","N/A","N/A",0,40876.715289351851,"hanina",false,1,0,false,"MY",0,0,2,0,"DF"]
[null,null,null,null,null,null,null,null,null,null,null,null,null,null,null,null,null,null,null,null,null,null,null,null,null,null,365,0,0,0,0,0,0,3,0,-1,"TA",60,0,"NOFEE","NOFEE",1,0,"","","DATO' RAZIF B. ABDULLAH","50-05-02, 5th Floor, Wisma UOA Damansara, 50 Jalan Dungun, Damansara Height,","WPKL","50490           ","WLP","MY","","","                                                                                                                                                      ","                                                                                                                                                      ","","","KLCI",0,0,0,0,0,"",0,"N/A",0,0,"N/A","N/A","N/A","N/A","N/A",0,40928.415452858797,"mazuin",false,1,0,false,"MY",0,0,2,0,"DF"]
[null,null,null,null,null,null,null,null,null,null,null,null,null,null,null,null,null,null,null,null,null,null,null,null,null,null,365,0,0,0,0,0,0,3,0,-1,"TA",61,0,"NOFEE","NOFEE",1,0,"","","MR TONY LIEW","Penerbangan Sabah Sdn Bhd, Sabah Air Building, Old Airport Road, Locked Bag 113,","SBKK","88999           ","SAB","MY","smkwan@sabahair.com.my","","088-484283                                                                                                                                            ","                                                                                                                                                      ","","","MBB",0,0,0,0,0,"",0,"N/A",0,0,"N/A","N/A","N/A","N/A","N/A",0,40928.412138576386,"mazuin",false,1,0,false,"MY",0,0,2,0,"DF"]
[null,null,null,null,null,null,null,null,null,null,null,null,null,null,null,null,null,null,null,null,null,null,null,null,null,null,365,0,0,0,0,0,0,3,0,1,"TA",102,0,"NOFEE","NOFEE",0,0,"","","","","","                ","","","","","                                                                                                                                                      ","                                                                                                                                                      ","","","KLCI",0,0,0,0,0,"",0,"N/A",0,0,"N/A","N/A","N/A","N/A","N/A",0,39624.459930555553,"pleng",false,1,0,false,"MY",0,0,2,0,"DF"]
[null,null,null,null,null,null,null,null,null,null,null,null,null,null,null,null,null,null,null,null,null,null,null,null,null,null,365,0,0,0,0,0,0,3,0,0,"TA",62,0,"NOFEE","NOFEE",1,0,"","","MR CHRISTOPHER NG","Finance Manager, Sabah Energy Corp 1st,2nd & 3rd Flr Wisma Boon Siew, 9 1/2 km, Tuaran Road,","SBKK","88990           ","SAB","MY","","","088-311391                                                                                                                                            ","088-311364                                                                                                                                            ","","","KLCI",0,0,0,0,0,"",0,"N/A",0,0,"N/A","N/A","N/A","N/A","N/A",0,41088.387132141201,"jessica",false,1,0,false,"MY",0,0,2,0,"DF"]
[null,null,null,null,null,null,null,null,null,null,null,null,null,null,null,null,null,null,null,null,null,null,null,null,null,null,365,0,0,0,0,0,0,3,0,0,"TA",63,0,"NOFEE","NOFEE",1,0,"","","MRS CHRISTOPHER NG","Finance Manager, Sabah Energy Corp 1st,2nd & 3rd Flr Wisma Boon Siew, 9 1/2 km, Tuaran Road,","SBKK","88990           ","SAB","MY","","","                                                                                                                                                      ","                                                                                                                                                      ","","","KLCI",0,0,0,0,0,"",0,"N/A",0,0,"N/A","N/A","N/A","N/A","N/A",0,40928.455997025463,"mazuin",false,1,0,false,"MY",0,0,2,0,"DF"]
[null,null,null,null,null,null,null,null,null,null,null,null,null,null,null,null,null,null,null,null,null,null,null,null,null,null,365,0,0,0,0,0,0,3,0,-1,"TA",64,0,"NOFEE","NOFEE",1,0,"","","MR. CHRISTOPHER NG","Finance Manager, Sabah Energy Corp 1st,2nd & 3rd Flr Wisma Boon Siew, 9 1/2 km, Tuaran Road,","SBKK","88990           ","SAB","MY","","","                                                                                                                                                      ","                                                                                                                                                      ","","","MBB",0,0,0,0,0,"",0,"N/A",0,0,"N/A","N/A","N/A","N/A","N/A",0,40928.412339351853,"mazuin",false,1,0,false,"MY",0,0,2,0,"DF"]
[null,null,null,null,null,null,null,null,null,null,null,null,null,null,null,null,null,null,null,null,null,null,null,null,null,null,365,0,0,0,0,0,0,3,0,0,"TA",65,0,"NOFEE","NOFEE",1,0,"","","","","","                ","","","","","                                                                                                                                                      ","                                                                                                                                                      ","","","KLCI",0,0,0,0,0,"",0,"N/A",0,0,"N/A","N/A","N/A","N/A","N/A",0,40928.456082094905,"mazuin",false,1,0,false,"MY",0,0,2,0,"DF"]
[null,null,null,null,null,null,null,null,null,null,null,null,null,null,null,null,null,null,null,null,null,null,null,null,null,null,365,0,0,0,0,0,0,3,0,0,"TA",66,0,"NOFEE","NOFEE",1,0,"","","MR SIA LIM TECK","MDM CHUA AH AH @ CHUA GEK PENG, 21, Jalan BU 11/4, Bandar Utama,","SEPJ","47800           ","SEL","MY","qt_advances@hotmail.com","","012-3021544                                                                                                                                           ","                                                                                                                                                      ","","","KLCI",0,0,0,0,0,"",0,"N/A",0,0,"N/A","N/A","N/A","N/A","N/A",0,40604.730173611111,"ken",false,1,0,false,"MY",0,0,2,0,"DF"]
[null,null,null,null,null,null,null,null,null,null,null,null,null,null,null,null,null,null,null,null,null,null,null,null,null,null,365,0,0,0,0,0,0,3,0,0,"TA",90,0,"NOFEE","NOFEE",1,0,"","","MR SIA LIM TECK","MDM CHUA AH AH @ CHUA GEK PENG, 21, Jalan BU 11/4, Bandar Utama,","SEPJ","47800           ","SEL","MY","qt_advances@hotmail.com","","012-3021544                                                                                                                                           ","                                                                                                                                                      ","501108-04-5127","","KLCI",0,0,0,0,0,"",0,"N/A",0,0,"N/A","N/A","N/A","N/A","N/A",0,40855.483020833337,"ken",false,1,0,false,"MY",0,0,2,0,"DF"]
[null,null,null,null,null,null,null,null,null,null,null,null,null,null,null,null,null,null,null,null,null,null,null,null,null,null,365,0,0,0,0,0,0,3,0,0,"TA",337,0,"NOFEE","NOFEE",1,0,"","","SEE KOK WAH","NO.29, LORONG BATU NILAM 13D, BANDAR BUKIT TINGGI, KLANG"," ","41200           ","SL","MY","","","03-31659868 (OFF)                                                                                                                                     ","03-31686650 (OFF)                                                                                                                                     ","710825-10-5509","","KLCI",0,0,0,0,0,"",0,"N/A",0,0,"N/A","N/A","N/A","N/A","N/A",0,40855.483217592591,"ken",false,1,0,false,"MY",0,0,2,0,"DF"]
[null,null,null,null,null,null,null,null,null,null,null,null,null,null,null,null,null,null,null,null,null,null,null,null,null,null,365,0,0,0,0,0,0,3,0,0,"TA",50,0,"NOFEE","NOFEE",1,0,"","","SIM OI LAI","261-4-8, CASARIA CONDO, JLN JEJAKA, TMN MALURI","CHERA","55100           ","KL","","cheanven@hyundaiwellness.com","","012-3900378                                                                                                                                           ","03-92823232                                                                                                                                           ","720217-10-5926","","KLCI",0,0,0,0,0,"",0,"N/A",0,0,"N/A","N/A","N/A","N/A","N/A",0,40855.483460648145,"ken",false,1,0,false,"MY",0,0,2,0,"DF"]
[null,null,null,null,null,null,null,null,null,null,null,null,null,null,null,null,null,null,null,null,null,null,null,null,null,null,365,0,0,2,0,0,0,3,0,0,"TA",516,0,"MF01","TR01",1,1,"","","","","","                ","","","","","                                                                                                                                                      ","                                                                                                                                                      ","","","KLCI",0,0,0,0,0,"",0,"N/A",0,0,"N/A","N/A","N/A","N/A","N/A",0,40980.704279432874,"jaya",true,1,1,false,"MY",0,0,2,0,"DF"]
[null,null,null,null,null,null,null,null,null,null,null,null,null,null,null,null,null,null,null,null,null,null,null,null,null,null,365,0,0,4,0,0,0,3,0,0,"TA",514,0,"MF01","TR07",1,1,"","","","","","                ","","","","","                                                                                                                                                      ","                                                                                                                                                      ","","","KLCI",0,0,0,0,0,"",0,"N/A",0,0,"N/A","N/A","N/A","N/A","N/A",0,41094.695297719911,"jaya",true,1,1,false,"MY",0,0,2,0,"DF"]
[null,null,null,null,null,null,null,null,null,null,null,null,null,null,null,null,null,null,null,null,null,null,null,null,null,null,365,0,0,1,0,0,0,3,0,0,"TA",521,0,"N/A","N/A",1,1,"","","","","","                ","","","","","                                                                                                                                                      ","                                                                                                                                                      ","","","KLCI",0,0,0,0,0,"",0,"N/A",0,0,"N/A","N/A","N/A","N/A","N/A",0,40980.704883599537,"jaya",true,1,1,false,"MY",0,0,2,0,"DF"]
[null,null,null,null,null,null,null,null,null,null,null,null,null,null,null,null,null,null,null,null,null,null,null,null,null,null,365,0,0,1,0,0,0,3,0,0,"TA",520,0,"N/A","N/A",1,1,"","","","","","                ","","","","","                                                                                                                                                      ","                                                                                                                                                      ","","","KLCI",0,0,0,0,0,"",0,"N/A",0,0,"N/A","N/A","N/A","N/A","N/A",0,40980.705131134258,"jaya",true,1,1,false,"MY",0,0,2,0,"DF"]
[null,null,null,null,null,null,null,null,null,null,null,null,null,null,null,null,null,null,null,null,null,null,null,null,null,null,365,0,0,1,0,0,0,3,0,0,"TA",518,0,"MF02","TR04",1,1,"","","","","","                ","","","","","                                                                                                                                                      ","                                                                                                                                                      ","","","KLCI",0,0,1,0,0,"",0,"N/A",0,0,"N/A","N/A","N/A","N/A","N/A",0,41177.693161574076,"admin",true,1,1,false,"MY",0,0,2,0,"ST"]
[null,null,null,null,null,null,null,null,null,null,null,null,null,null,null,null,null,null,null,null,null,null,null,null,null,null,365,0,0,1,0,0,0,3,0,-1,"TA",519,0,"MF02","TR04",1,1,"","","","","","                ","","","","","                                                                                                                                                      ","                                                                                                                                                      ","","","KLCI",0,0,1,0,0,"",0,"N/A",0,0,"N/A","N/A","N/A","N/A","N/A",0,40928.415078206017,"mazuin",true,1,0,false,"MY",0,0,2,0,"DF"]
[null,null,null,null,null,null,null,null,null,null,null,null,null,null,null,null,null,null,null,null,null,null,null,null,null,null,365,0,0,1,0,0,0,3,0,0,"TA",502,0,"MF02","TR03",1,1,"","","","","","                ","","","","","                                                                                                                                                      ","                                                                                                                                                      ","","","KLCI",0,0,0,0,0,"",0,"N/A",0,0,"N/A","N/A","N/A","N/A","N/A",0,40980.703606712967,"jaya",true,1,1,false,"MY",0,0,2,0,"DF"]
[null,null,null,null,null,null,null,null,null,null,null,null,null,null,null,null,null,null,null,null,null,null,null,null,null,null,365,0,0,1,0,0,0,3,0,0,"TA",508,0,"MF03","TR05",0,1,"","","","","","                ","","","","","                                                                                                                                                      ","                                                                                                                                                      ","","","KLCI",0,0,0,0,0,"",0,"N/A",0,0,"N/A","N/A","N/A","N/A","N/A",0,40980.703129317131,"jaya",true,1,1,false,"MY",0,0,2,0,"DF"]
[null,null,null,null,null,null,null,null,null,null,null,null,null,null,null,null,null,null,null,null,null,null,null,null,null,null,365,0,0,0,0,0,0,3,0,0,"TA",390,0,"NOFEE","NOFEE",1,0,"","","ROSNAH BINTI HUSSIN","12, JLN. MUTIARA SUBANG 4, TMN. MUTIARA SUBANG","SJ","47500           ","SL","MY","","rosnah.hussin@simedarby.com","019-3341300                                                                                                                                           ","                                                                                                                                                      ","600521-71-5036","","KLCI",0,0,0,0,0,"",0,"N/A",0,0,"N/A","N/A","N/A","N/A","N/A",0,40879.393796296295,"jessica",false,1,0,false,"MY",0,0,2,0,"DF"]
[null,null,null,null,null,null,null,null,null,null,null,null,null,null,null,null,null,null,null,null,null,null,null,null,null,null,365,0,0,3,0,0,0,3,0,0,"TA",515,0,"MF02","TR04",0,1,"","","","","","                ","","","","","                                                                                                                                                      ","                                                                                                                                                      ","","","KLCI",0,0,1,0,0,"",0,"N/A",0,0,"N/A","N/A","N/A","N/A","N/A",0,40980.700808449074,"jaya",true,1,1,false,"MY",0,0,2,0,"DF"]
[null,null,null,null,null,null,null,null,null,null,null,null,null,null,null,null,null,null,null,null,null,null,null,null,null,null,365,0,0,1,0,0,0,3,0,0,"TA",507,0,"MF02","TR05",1,1,"","","","","","                ","","","","","                                                                                                                                                      ","                                                                                                                                                      ","","","KLCI",0,0,1,0,0,"",0,"N/A",0,0,"N/A","N/A","N/A","N/A","N/A",0,40980.696959374996,"jaya",true,1,1,false,"MY",0,0,2,0,"DF"]
[null,null,null,null,null,null,null,null,null,null,null,null,null,null,null,null,null,null,null,null,null,null,null,null,null,null,365,0,0,2,0,0,0,3,0,0,"TA",513,0,"MF01","TR01",1,1,"","","","","","                ","","","","","                                                                                                                                                      ","                                                                                                                                                      ","","","KLCI",0,0,0,0,0,"",0,"N/A",0,0,"N/A","N/A","N/A","N/A","N/A",0,40980.702120173613,"jaya",true,1,1,false,"MY",0,0,2,0,"DF"]
[null,null,null,null,null,null,null,null,null,null,null,null,null,null,null,null,null,null,null,null,null,null,null,null,null,null,365,0,0,2,0,0,0,3,0,0,"TA",511,0,"MF01","TR01",1,1,"","","","","","                ","","","","","                                                                                                                                                      ","                                                                                                                                                      ","","","KLCI",0,0,0,0,0,"",0,"N/A",0,0,"N/A","N/A","N/A","N/A","N/A",0,40980.70289803241,"jaya",true,1,1,false,"MY",0,0,2,0,"DF"]
[null,null,null,null,null,null,null,null,null,null,null,null,null,null,null,null,null,null,null,null,null,null,null,null,null,null,365,0,0,1,0,0,0,3,0,0,"TA",501,0,"MF02","TR02",1,1,"","","","","","                ","","","","","                                                                                                                                                      ","                                                                                                                                                      ","","","KLCI",0,0,0,0,0,"",0,"N/A",0,0,"N/A","N/A","N/A","N/A","N/A",0,40980.701877893516,"jaya",true,1,1,false,"MY",0,0,2,0,"DF"]
[null,null,null,null,null,null,null,null,null,null,null,null,null,null,null,null,null,null,null,null,null,null,null,null,null,null,365,0,0,4,0,0,0,3,0,0,"TA",522,0,"N/A","N/A",1,1,"","","","","","                ","","","","","                                                                                                                                                      ","                                                                                                                                                      ","","","KLCI",0,0,0,0,0,"",0,"N/A",0,0,"N/A","N/A","N/A","N/A","N/A",0,40980.701604317132,"jaya",true,1,1,false,"MY",0,0,2,0,"DF"]
[null,null,null,null,null,null,null,null,null,null,null,null,null,null,null,null,null,null,null,null,null,null,null,null,null,null,365,0,0,3,0,0,0,3,0,0,"TA",506,0,"MF02","TR06",1,1,"","","","","","                ","","","","","                                                                                                                                                      ","                                                                                                                                                      ","","","KLCI",0,0,0,0,0,"",0,"N/A",0,0,"N/A","N/A","N/A","N/A","N/A",0,41177.695138506948,"admin",true,1,1,false,"MY",0,0,2,0,"ST"]
[null,null,null,null,null,null,null,null,null,null,null,null,null,null,null,null,null,null,null,null,null,null,null,null,null,null,365,0,0,1,0,0,0,3,0,0,"TA",512,0,"MF03","TR05",1,1,"","","","","","                ","","","","","                                                                                                                                                      ","                                                                                                                                                      ","","","KLCI",0,0,1,0,0,"",0,"N/A",0,0,"N/A","N/A","N/A","N/A","N/A",0,40980.703947071757,"jaya",true,1,1,false,"MY",0,0,2,0,"DF"]
[null,null,null,null,null,null,null,null,null,null,null,null,null,null,null,null,null,null,null,null,null,null,null,null,null,null,365,0,0,1,0,0,0,3,0,0,"TA",509,0,"MF03","TR05",0,1,"","","","","","                ","","","","","                                                                                                                                                      ","                                                                                                                                                      ","","","KLCI",0,0,1,0,0,"",0,"N/A",0,0,"N/A","N/A","N/A","N/A","N/A",0,40980.703332789351,"jaya",true,1,1,false,"MY",0,0,2,0,"DF"]
[null,null,null,null,null,null,null,null,null,null,null,null,null,null,null,null,null,null,null,null,null,null,null,null,null,null,365,0,0,3,0,0,0,3,0,0,"TA",503,0,"MF02","TR04",1,1,"","","","","","                ","","","","","                                                                                                                                                      ","                                                                                                                                                      ","","","KLCI",0,0,1,0,0,"",0,"N/A",0,0,"N/A","N/A","N/A","N/A","N/A",0,40980.701444178238,"jaya",true,1,1,false,"MY",0,0,2,0,"DF"]
[null,null,null,null,null,null,null,null,null,null,null,null,null,null,null,null,null,null,null,null,null,null,null,null,null,null,365,0,0,3,0,0,0,3,0,0,"TA",504,0,"MF02","TR04",1,1,"","","","","","                ","","","","","                                                                                                                                                      ","                                                                                                                                                      ","","","KLCI",0,0,0,0,0,"",0,"N/A",0,0,"N/A","N/A","N/A","N/A","N/A",0,40980.702643090277,"jaya",true,1,1,false,"MY",0,0,2,0,"DF"]
[null,null,null,null,null,null,null,null,null,null,null,null,null,null,null,null,null,null,null,null,null,null,null,null,null,null,365,0,0,2,0,0,0,3,0,0,"TA",94,0,"MF01","TR01",1,1,"","","","","","                ","","","","","                                                                                                                                                      ","                                                                                                                                                      ","","","KLCI",0,0,0,0,0,"",0,"N/A",0,0,"N/A","N/A","N/A","N/A","N/A",0,40928.452837118057,"mazuin",true,1,0,false,"MY",0,0,2,0,"DF"]
[null,null,null,null,null,null,null,null,null,null,null,null,null,null,null,null,null,null,null,null,null,null,null,null,null,null,365,0,0,1,0,0,0,3,0,0,"TA",505,0,"MF02","TR05",1,1,"","","","","","                ","","","","","                                                                                                                                                      ","                                                                                                                                                      ","","","KLCI",0,0,0,0,0,"",0,"N/A",0,0,"N/A","N/A","N/A","N/A","N/A",0,40980.700566666666,"jaya",true,1,1,false,"MY",0,0,2,0,"DF"]
[null,null,null,null,null,null,null,null,null,null,null,null,null,null,null,null,null,null,null,null,null,null,null,null,null,null,0,0,0,0,0,0,0,0,1,0,"TA",510,0,"MF01","TR01",1,1,"","","","","","                ","","","","","                                                                                                                                                      ","                                                                                                                                                      ","","","KLCI",0.01,0,0,0,0,"",0,"1",0,0,"","","","","",1,40914.690051655096,"admin",true,1,1,false,"MY",1,-1,40907,1,"DF"]
[null,null,null,null,null,null,null,null,null,null,null,null,null,null,null,null,null,null,null,null,null,null,null,null,null,null,365,0,0,4,0,0,0,3,0,0,"TA",517,0,"MF01","TR01",1,1,"","","","","","                ","","","","","                                                                                                                                                      ","                                                                                                                                                      ","","","KLCI",0,0,0,0,0,"",0,"N/A",0,0,"N/A","N/A","N/A","N/A","N/A",0,41065.711407835646,"JAYA",true,1,1,false,"MY",0,0,2,0,"DF"]
[null,null,null,null,null,null,null,null,null,null,null,null,null,null,null,null,null,null,null,null,null,null,null,null,null,null,365,0,0,4,0,0,0,3,0,-1,"TA",85,0,"MF01","TR07",1,1,"","","","","","                ","","","","","                                                                                                                                                      ","                                                                                                                                                      ","","","KLCI",0,0,0,0,0,"",0,"N/A",0,0,"N/A","N/A","N/A","N/A","N/A",0,41002.767058182872,"jaya",true,1,0,false,"MY",0,0,2,0,"DF"]
[null,null,null,null,null,null,null,null,null,null,null,null,null,null,null,null,null,null,null,null,null,null,null,null,null,null,365,0,0,0,0,0,0,3,0,0,"TA",67,0,"NOFEE","NOFEE",1,0,"","","MR ANDI FRANCIS KATHIL TOYONG","FINANCIAL CONTROLLER, Yayasan Sabah, 19th Floor, Bangunan Yayasan Sabah, Likas Bay, P.O.Box 11201,","SBKK","88813           ","SAB","MY","","","088-326300                                                                                                                                            ","088-326619                                                                                                                                            ","","","KLCI",0,0,0,0,0,"",0,"N/A",0,0,"N/A","N/A","N/A","N/A","N/A",0,40928.456712766201,"mazuin",false,1,0,false,"MY",0,0,2,0,"DF"]
[null,null,null,null,null,null,null,null,null,null,null,null,null,null,null,null,null,null,null,null,null,null,null,null,null,null,365,0,0,0,0,0,0,3,0,0,"TA",298,0,"NOFEE","NOFEE",1,0,"","","AH NGEE @ HONG LEE PEE & LIM MIAU YONG","45 JALAN PUNCAK DESA,TAMAN DESA,JALAN KLANG LAMA 58100 ","WPKL","58100           ","WLP","MY","","","012-2086695                                                                                                                                           ","                                                                                                                                                      ","460522-05-5103","","KLSER",0,0,0,0,0,"",0,"N/A",0,0,"","","","","",0,41102.397406793978,"jessica",false,1,1,false,"MY",0,0,40922,0,"DF"]
[null,null,null,null,null,null,null,null,null,null,null,null,null,null,null,null,null,null,null,null,null,null,null,null,null,null,365,0,0,0,0,0,0,3,0,0,"TA",348,0,"NOFEE","NOFEE",1,0,"","","CAROLE ANN GOON","26, JALAN SS 22/32, DAMANSARA JAYA, 47400 PETALING JAYA, SELANGOR"," ","47400           "," ","MY","","","014-2399427                                                                                                                                           ","                                                                                                                                                      ","510327-07-5398","","KLCI",0,0,0,0,0,"",0,"N/A",0,0,"N/A","N/A","N/A","N/A","N/A",0,41155.613914201385,"jessica",false,1,0,false,"MY",0,0,2,0,"DF"]
[null,null,null,null,null,null,null,null,null,null,null,null,null,null,null,null,null,null,null,null,null,null,null,null,null,null,365,0,0,0,0,0,0,3,0,0,"TA",328,0,"NOFEE","NOFEE",1,0,"","","CATHERINE SIEW SEEN WA","2 VAN PRAAGH ROAD, 11600 PENANG."," ","                "," ","MY","","","04-2819946 / 012-4762738                                                                                                                              ","                                                                                                                                                      ","660124-07-5500","","KLCI",0,0,0,0,0,"",0,"N/A",0,0,"N/A","N/A","N/A","N/A","N/A",0,41155.614043136571,"jessica",false,1,0,false,"MY",0,0,2,0,"DF"]
[null,null,null,null,null,null,null,null,null,null,null,null,null,null,null,null,null,null,null,null,null,null,null,null,null,null,365,0,0,0,0,0,0,3,0,0,"TA",329,0,"NOFEE","NOFEE",1,0,"","","CHEAH BENG GNOH","14, LENGKOK HALIA, TANJUNG TOKONG, 10470 PENANG"," ","10470           "," ","MY","","","04-8905209 , 012-4948209                                                                                                                              ","                                                                                                                                                      ","540201-07-5568","","KLCI",0,0,0,0,0,"",0,"N/A",0,0,"N/A","N/A","N/A","N/A","N/A",0,41155.61414297454,"jessica",false,1,0,false,"MY",0,0,2,0,"DF"]
[null,null,null,null,null,null,null,null,null,null,null,null,null,null,null,null,null,null,null,null,null,null,null,null,null,null,365,0,0,0,0,0,0,3,0,0,"TA",282,0,"NOFEE","NOFEE",1,0,"","","CHAN CHEE CHOY","34,JALAN WAWASAN 3/7,PUSAT BDR PUCHONG 47100 PUCHONG,SELANGOR","SEPC","47100           ","SEL","MY","","","012-2955488                                                                                                                                           ","                                                                                                                                                      ","621211-05-5071","","KLSER",0,0,0,0,0,"",0,"N/A",0,0,"LOW YOKE YING","","","","",0,41094.382211111108,"jessica",false,1,1,false,"MY",0,0,367,0,"DF"]
[null,null,null,null,null,null,null,null,null,null,null,null,null,null,null,null,null,null,null,null,null,null,null,null,null,null,365,0,0,0,0,0,0,3,0,0,"TA",344,0,"NOFEE","NOFEE",1,0,"","","CHAN GEK CHOO","NO.21, USJ 5/3F, SUBANG JAYA, SELANGOR"," ","47610           "," ","MY","","","012-2676262                                                                                                                                           ","                                                                                                                                                      ","620215-11-5196","","KLCI",0,0,0,0,0,"",0,"N/A",0,0,"N/A","N/A","N/A","N/A","N/A",0,40837.676562499997,"ken",false,1,0,false,"MY",0,0,2,0,"DF"]
[null,null,null,null,null,null,null,null,null,null,null,null,null,null,null,null,null,null,null,null,null,null,null,null,null,null,365,0,0,0,0,0,0,3,0,0,"TA",415,0,"NOFEE","NOFEE",1,0,"","","CHIA KOK LAI","NO.5  JALAN 16/9, SEKSYEN 16, 46350 PETALING JAYA, SELANGOR"," ","46350           ","SL","MY","","","                                                                                                                                                      ","                                                                                                                                                      ","621021-10-7029","","KLCI",0,0,0,0,0,"",0,"N/A",0,0,"N/A","N/A","N/A","N/A","N/A",0,41009.380526006942,"jessica",false,1,0,false,"MY",0,0,2,0,"DF"]
[null,null,null,null,null,null,null,null,null,null,null,null,null,null,null,null,null,null,null,null,null,null,null,null,null,null,365,0,0,0,0,0,0,3,0,0,"TA",500,0,"NOFEE","NOFEE",1,0,"","","CHEONG KEE SOON","No. 1, Jalan Penaga, Bukit Bandaraya, 59100 Kuala Lumpur","WPKL","59100           ","WLP","MY","","","0122822735                                                                                                                                            ","                                                                                                                                                      ","600329-10-6601","","KLCI",0,0,0,0,0,"",0,"N/A",0,0,"","","","","",0,41072.384259953702,"jessica",false,1,1,false,"MY",0,0,2,0,"DF"]
[null,null,null,null,null,null,null,null,null,null,null,null,null,null,null,null,null,null,null,null,null,null,null,null,null,null,365,0,0,0,0,0,0,3,0,0,"TA",349,0,"NOFEE","NOFEE",1,0,"","","CHEN KAM YEN","6, JALAN TAR 9/6, TROPICANA GOLF & COUNTRY RESORTS, PETALING JAYA"," ","                "," "," ","","","                                                                                                                                                      ","                                                                                                                                                      ","461020-06-5226","","KLCI",0,0,0,0,0,"",0,"N/A",0,0,"N/A","N/A","N/A","N/A","N/A",0,41094.382563576386,"jessica",false,1,0,false,"MY",0,0,2,0,"DF"]
[null,null,null,null,null,null,null,null,null,null,null,null,null,null,null,null,null,null,null,null,null,null,null,null,null,null,365,0,0,0,0,0,0,3,0,0,"TA",345,0,"NOFEE","NOFEE",1,0,"","","CHEONG SAU YING","20 JALAN CENDERAI 1, LUCKY GARDEN, BANGSAR, 59100 KUALA LUMPUR."," ","59100           "," ","MY","","","012-3351602                                                                                                                                           ","                                                                                                                                                      ","500911-10-6166","","KLCI",0,0,0,0,0,"",0,"N/A",0,0,"N/A","N/A","N/A","N/A","N/A",0,41046.385140081016,"mazuin",false,1,0,false,"MY",0,0,2,0,"DF"]
[null,null,null,null,null,null,null,null,null,null,null,null,null,null,null,null,null,null,null,null,null,null,null,null,null,null,365,0,0,0,0,0,0,3,0,0,"TA",345,0,"NOFEE","NOFEE",1,0,"","","CHEAM TOW YONG","NO.17, LORONG LEMBAH PERMAI 2, 11200 TANJONG BUNGAH, PENANG"," ","11200           "," ","MY","","","012-4337799                                                                                                                                           ","                                                                                                                                                      ","550530-07-5103","","KLCI",0,0,0,0,0,"",0,"N/A",0,0,"N/A","N/A","N/A","N/A","N/A",0,41037.369577812497,"mazuin",false,1,0,false,"MY",0,0,2,0,"DF"]
[null,null,null,null,null,null,null,null,null,null,null,null,null,null,null,null,null,null,null,null,null,null,null,null,null,null,365,0,0,0,0,0,0,3,0,-1,"TA",1,0,"NOFEE","NOFEE",1,0,"","","Ms Tan Chye Eng","No.4, Jalan SS 3/41A","PJ","47300           ","Sel.","My","cetan8@hotmail.com","","                                                                                                                                                      ","                                                                                                                                                      ","","","KLCI",0,0,0,0,0,"",0,"N/A",0,0,"N/A","N/A","N/A","N/A","N/A",0,40928.414242245373,"mazuin",false,1,0,false,"MY",0,0,2,0,"DF"]
[null,null,null,null,null,null,null,null,null,null,null,null,null,null,null,null,null,null,null,null,null,null,null,null,null,null,365,0,0,0,0,0,0,3,0,0,"TA",348,0,"NOFEE","NOFEE",1,0,"","","LOK MING KHOON","WISMA GIAP CHEW, 3RD & 4TH FLOOR , 28 LEBUH GEREJA, 10200 PENANG."," ","10200           "," ","MY","","","019-3852778                                                                                                                                           ","                                                                                                                                                      ","750429-07-5519","","KLCI",0,0,0,0,0,"",0,"N/A",0,0,"N/A","N/A","N/A","N/A","N/A",0,41094.382001851853,"jessica",false,1,0,false,"MY",0,0,2,0,"DF"]
[null,null,null,null,null,null,null,null,null,null,null,null,null,null,null,null,null,null,null,null,null,null,null,null,null,null,365,0,0,0,0,0,0,3,0,0,"TA",395,0,"NOFEE","NOFEE",1,0,"","","HOR CHAN WYE","54E-1 ST FLOOR, PERSIARAN BAYAN INDAH, BAYAN LEPAS, PENANG"," ","11900           ","PP","MY","wyecool@yahoo.com.my","","016-4211728                                                                                                                                           ","                                                                                                                                                      ","571006-07-5425","","KLCI",0,0,0,0,0,"",0,"N/A",0,0,"N/A","N/A","N/A","N/A","N/A",0,41080.389387581017,"mazuin",false,1,0,false,"MY",0,0,2,0,"DF"]
[null,null,null,null,null,null,null,null,null,null,null,null,null,null,null,null,null,null,null,null,null,null,null,null,null,null,365,0,0,0,0,0,0,3,0,0,"TA",283,0,"NOFEE","NOFEE",1,0,"","","HO HIN CHEN ","15,JALAN ABANG HAJI OPENG 1,TAMAN TUN DR.ISMAIL,60000 KUALA LUMPUR","WPKL","60000           ","WLP","MY","","","012-2086695                                                                                                                                           ","                                                                                                                                                      ","650714-05-5076","","KLSER",0,0,0,0,0,"",0,"N/A",0,0,"CHEE LAI YUET","","","","",0,41043.381901886576,"mazuin",false,1,1,false,"MY",0,0,380,0,"DF"]
[null,null,null,null,null,null,null,null,null,null,null,null,null,null,null,null,null,null,null,null,null,null,null,null,null,null,365,0,0,0,0,0,0,3,0,0,"TA",335,0,"NOFEE","NOFEE",1,0,"","","LOUIS KENNY & HOI TRADING","BLOCK B-24-3, SRI INTAN CONDO 1,  JALAN MATANG, OFF JALAN IPOH, 51200 KUALA LUMPUR"," ","51200           "," ","MY","","","016-3360011                                                                                                                                           ","                                                                                                                                                      ","791023-06-5629","","KLCI",0,0,0,0,0,"",0,"N/A",0,0,"N/A","N/A","N/A","N/A","N/A",0,41080.389492824077,"mazuin",false,1,0,false,"MY",0,0,2,0,"DF"]
[null,null,null,null,null,null,null,null,null,null,null,null,null,null,null,null,null,null,null,null,null,null,null,null,null,null,365,0,0,0,0,0,0,3,0,0,"TA",398,0,"NOFEE","NOFEE",1,0,"","","HOOI WENG YIN","NO.52, JALAN SS 22/27, PETALING JAYA, SELANGOR"," ","47400           ","SL","MY","","","                                                                                                                                                      ","                                                                                                                                                      ","451118-10-5143","","KLCI",0,0,0,0,0,"",0,"N/A",0,0,"N/A","N/A","N/A","N/A","N/A",0,41050.382068599538,"mazuin",false,1,0,false,"MY",0,0,2,0,"DF"]
[null,null,null,null,null,null,null,null,null,null,null,null,null,null,null,null,null,null,null,null,null,null,null,null,null,null,365,0,0,0,0,0,0,3,0,0,"TA",280,0,"NOFEE","NOFEE",1,0,"","","HOR YOKE CHEE","NO 13 JALAN SUNGAI ARA 5, BAYAN LEPAS","","11900           ","PIN","MY","","","012-4382873                                                                                                                                           ","                                                                                                                                                      ","561126-07-5690","","KLSER",0,0,0,0,0,"",0,"N/A",0,0,"","","","","",0,41155.614623611109,"jessica",false,1,1,false,"MY",0,0,367,0,"DF"]
[null,null,null,null,null,null,null,null,null,null,null,null,null,null,null,null,null,null,null,null,null,null,null,null,null,null,365,0,0,0,0,0,0,3,0,0,"TA",278,0,"NOFEE","NOFEE",1,0,"","","JAYANTHI KAREN A/P SOKALINGAM","22 LENGKOK KENARI 3, DESA RIA, 11900 PULAU PENANG","  ","11900           ","PP","MY","","","012-4288486                                                                                                                                           ","                                                                                                                                                      ","660607-08-6108","","KLCI",0,0,0,0,0,"",0,"N/A",0,0,"N/A","N/A","N/A","N/A","N/A",0,41155.614755243056,"jessica",false,1,0,false,"MY",0,0,2,0,"DF"]
[null,null,null,null,null,null,null,null,null,null,null,null,null,null,null,null,null,null,null,null,null,null,null,null,null,null,365,0,0,0,0,0,0,3,0,0,"TA",346,0,"NOFEE","NOFEE",1,0,"","","JOHN ANDREW LESLIE MORGAN","9-3-3A THE WATER FRONT PERSIARAN TANJONG BUNGAH, 11200 PENANG."," ","11200           "," ","MY","","","012-4926861                                                                                                                                           ","                                                                                                                                                      ","707725385","","KLCI",0,0,0,0,0,"",0,"N/A",0,0,"N/A","N/A","N/A","N/A","N/A",0,41080.389587812497,"mazuin",false,1,0,false,"MY",0,0,2,0,"DF"]
[null,null,null,null,null,null,null,null,null,null,null,null,null,null,null,null,null,null,null,null,null,null,null,null,null,null,365,0,0,0,0,0,0,3,0,0,"TA",13,0,"NOFEE","NOFEE",1,0,"","","TAN CHIN KIN","26, GROUND FLOOR, JALAN 12/42A, TAMAN SEJAHTERA","","51200           ","KUALA","","","","012-3206677                                                                                                                                           ","                                                                                                                                                      ","740823-14-5387","","KLCI",0,0,0,0,0,"",0,"N/A",0,0,"N/A","N/A","N/A","N/A","N/A",0,41079.37843827546,"jessica",false,1,0,false,"MY",0,0,2,0,"DF"]
[null,null,null,null,null,null,null,null,null,null,null,null,null,null,null,null,null,null,null,null,null,null,null,null,null,null,365,0,0,0,0,0,0,3,0,0,"TA",281,0,"NOFEE","NOFEE",1,0,"","","KHOR KOK JIN","K-6-4,DESA PERMAI INDAH,JALAN HELANG,11700 GELUGOR,PENANG","PIGG","11700           ","PIN","MY","","","012-4725025                                                                                                                                           ","                                                                                                                                                      ","620310-07-5209","","KLSER",0,0,0,0,0,"",0,"N/A",0,0,"","","","","",0,41165.418224733796,"jessica",false,1,1,false,"MY",0,0,367,0,"DF"]
[null,null,null,null,null,null,null,null,null,null,null,null,null,null,null,null,null,null,null,null,null,null,null,null,null,null,365,0,0,0,0,0,0,3,0,1,"TA",249,0,"NOFEE","NOFEE",1,0,"","","KAM SUAN PHENG","18, LARONG GEH CHONG KEAT, TANJUNG BUNGAH, 11200 PULAU PINANG"," ","11200           ","PP","MY","suankam@yahoo.com","","016-4104720, 04-8990840                                                                                                                               ","                                                                                                                                                      ","510825-07-5016","","KLCI",0,0,0,0,0,"",0,"N/A",0,0,"N/A","N/A","N/A","N/A","N/A",0,40686.713113425925,"ken",false,1,0,false,"MY",0,0,2,0,"DF"]
[null,null,null,null,null,null,null,null,null,null,null,null,null,null,null,null,null,null,null,null,null,null,null,null,null,null,365,0,0,0,0,0,0,3,0,0,"TA",250,0,"NOFEE","NOFEE",1,0,"","","KAM SUAN PHENG","18, LARONG GEH CHONG KEAT, TANJUNG BUNGAH, 11200 PULAU PINANG"," ","11200           ","PP","MY","suankam@yahoo.com","","016-4104720, 04-8990840                                                                                                                               ","                                                                                                                                                      ","510825-07-5016","","KLCI",0,0,0,0,0,"",0,"N/A",0,0,"N/A","N/A","N/A","N/A","N/A",0,40809.422349537039,"hanina",false,1,0,false,"MY",0,0,2,0,"DF"]
[null,null,null,null,null,null,null,null,null,null,null,null,null,null,null,null,null,null,null,null,null,null,null,null,null,null,365,0,0,0,0,0,0,3,0,0,"TA",396,0,"NOFEE","NOFEE",1,0,"","","KOAY TENG HIN @ YEOH TENG HIN","25, LINTANG DELIMA 13, GELUGOR, PULAU PINANG"," ","11700           ","PP","MY","","","017-5416598                                                                                                                                           ","                                                                                                                                                      ","520129-07-5425","","KLCI",0,0,0,0,0,"",0,"N/A",0,0,"N/A","N/A","N/A","N/A","N/A",0,40792.74324074074,"ken",false,1,0,false,"MY",0,0,2,0,"DF"]
[null,null,null,null,null,null,null,null,null,null,null,null,null,null,null,null,null,null,null,null,null,null,null,null,null,null,365,0,0,0,0,0,0,3,0,0,"TA",395,0,"NOFEE","NOFEE",1,0,"","","KUMARASINGAM A/L S.A. SINGAM","42 CHANGKAT MINDEN 12, GELUGAR, PULAU PINANG"," ","11700           "," ","MY","","","04-6584550                                                                                                                                            ","                                                                                                                                                      ","520420-10-5327","","KLCI",0,0,0,0,0,"",0,"N/A",0,0,"N/A","N/A","N/A","N/A","N/A",0,40837.677002314813,"ken",false,1,0,false,"MY",0,0,2,0,"DF"]
[null,null,null,null,null,null,null,null,null,null,null,null,null,null,null,null,null,null,null,null,null,null,null,null,null,null,365,0,0,0,0,0,0,3,0,0,"TA",412,0,"NOFEE","NOFEE",1,0,"","","LAU BOON KING","41-10-4, BANDAR PUTERI CONDO, JALAN MEDANG SERAI, BANGSAR, 59100 KUALA LUMPUR"," KL","59100           ","WP","MY","","","012-2012291                                                                                                                                           ","                                                                                                                                                      ","700828-10-5003","","KLCI",0,0,0,0,0,"",0,"N/A",0,0,"N/A","N/A","N/A","N/A","N/A",0,41037.369989699073,"mazuin",false,1,0,false,"MY",0,0,2,0,"DF"]
[null,null,null,null,null,null,null,null,null,null,null,null,null,null,null,null,null,null,null,null,null,null,null,null,null,null,365,0,0,0,0,0,0,3,0,0,"TA",252,0,"NOFEE","NOFEE",1,0,"","","LEE CHIN ARK","24, MEDAN TEMBA6 A, ISLAND PARK, 11600 PULAU PENANG"," ","11600           ","PP","MY","","","012-4887709, 04-6578809                                                                                                                               ","                                                                                                                                                      ","590708-07-5765","","KLCI",0,0,0,0,0,"",0,"N/A",0,0,"N/A","N/A","N/A","N/A","N/A",0,40809.412488425929,"hanina",false,1,0,false,"MY",0,0,2,0,"DF"]
[null,null,null,null,null,null,null,null,null,null,null,null,null,null,null,null,null,null,null,null,null,null,null,null,null,null,365,0,0,0,0,0,0,3,0,0,"TA",340,0,"NOFEE","NOFEE",1,0,"","","LIAO CHUNG HUI","3F, LORONG DELIMA 9, ISLAND GLADES, PENANG"," ","11700           "," ","MY","","","04-6572071                                                                                                                                            ","                                                                                                                                                      ","560704-08-5870","","KLCI",0,0,0,0,0,"",0,"N/A",0,0,"N/A","N/A","N/A","N/A","N/A",0,41003.394995173614,"mazuin",false,1,0,false,"MY",0,0,2,0,"DF"]
[null,null,null,null,null,null,null,null,null,null,null,null,null,null,null,null,null,null,null,null,null,null,null,null,null,null,365,0,0,0,0,0,0,3,0,0,"TA",394,0,"NOFEE","NOFEE",1,0,"","","LEE CHEE KEONG","5, JALAN 8/91, TAMAN SHAMELIN PERKASA, CHERAS"," ","56100           ","KL","MY","","","                                                                                                                                                      ","                                                                                                                                                      ","580820-10-6315","","KLCI",0,0,0,0,0,"",0,"N/A",0,0,"N/A","N/A","N/A","N/A","N/A",0,40837.677384259259,"ken",false,1,0,false,"MY",0,0,2,0,"DF"]
[null,null,null,null,null,null,null,null,null,null,null,null,null,null,null,null,null,null,null,null,null,null,null,null,null,null,365,0,0,0,0,0,0,3,0,0,"TA",413,0,"NOFEE","NOFEE",1,0,"","","LIM HAI GUAN","NO.23, JALAN BS 9/5B, TAMAN BUKIT SERDANG, 43300 SERI KEMBANGAN, SELANGOR"," ","43300           ","SL","MY","","","                                                                                                                                                      ","                                                                                                                                                      ","670704-10-5875","","KLCI",0,0,0,0,0,"",0,"N/A",0,0,"N/A","N/A","N/A","N/A","N/A",0,40792.746863425928,"ken",false,1,0,false,"MY",0,0,2,0,"DF"]
[null,null,null,null,null,null,null,null,null,null,null,null,null,null,null,null,null,null,null,null,null,null,null,null,null,null,365,0,0,0,0,0,0,3,0,0,"TA",68,0,"NOFEE","NOFEE",1,0,"","","MR TAN CHING LING","3-0-7 Villa Aman, No.3, Jalan Ritchie, Off Jalan Ampang 55000 Kuala Lumpur","","55000           ","Kuala","MY","tanchingling@yahoo.com","","03-23003390                                                                                                                                           ","03-23003390                                                                                                                                           ","8173899","","KLCI",0,0,0,0,0,"",0,"N/A",0,0,"N/A","N/A","N/A","N/A","N/A",0,40604.731296296297,"ken",false,1,0,false,"MY",0,0,2,0,"DF"]
[null,null,null,null,null,null,null,null,null,null,null,null,null,null,null,null,null,null,null,null,null,null,null,null,null,null,365,0,0,0,0,0,0,3,0,0,"TA",341,0,"NOFEE","NOFEE",1,0,"","","LIM JOO CHONG","NO.24, PERSIARAN SG. ARA SATU, SUNGAI ARA, BAYAN LEPAS, PENANG"," ","11900           "," ","MY","","","                                                                                                                                                      ","                                                                                                                                                      ","541016-08-5275","","KLCI",0,0,0,0,0,"",0,"N/A",0,0,"N/A","N/A","N/A","N/A","N/A",0,41050.38178059028,"mazuin",false,1,0,false,"MY",0,0,2,0,"DF"]
[null,null,null,null,null,null,null,null,null,null,null,null,null,null,null,null,null,null,null,null,null,null,null,null,null,null,365,0,0,0,0,0,0,3,0,0,"TA",340,0,"NOFEE","NOFEE",1,0,"","","LIM KANG BENG","42, CANGKAT KENARI 2, DESARIA, SG. ARA, 11900, BAYAN LEPAS, PENANG"," ","11900           "," ","MY","","","04-6448133                                                                                                                                            ","                                                                                                                                                      ","600714-04-5227","","KLCI",0,0,0,0,0,"",0,"N/A",0,0,"N/A","N/A","N/A","N/A","N/A",0,41024.379313159719,"jessica",false,1,0,false,"MY",0,0,2,0,"DF"]
[null,null,null,null,null,null,null,null,null,null,null,null,null,null,null,null,null,null,null,null,null,null,null,null,null,null,365,0,0,0,0,0,0,3,0,0,"TA",251,0,"NOFEE","NOFEE",1,0,"","","LEE KHEK MUI","1-B, LENGKOK BUKIT JAMBUL, BAYAN BARU, 11900 BAYAN LEPAS, PULAU PINANG"," ","11900           ","PP","MY","","","012-4709861                                                                                                                                           ","                                                                                                                                                      ","560224-07-5323","","KLCI",0,0,0,0,0,"",0,"N/A",0,0,"N/A","N/A","N/A","N/A","N/A",0,41155.615164201387,"jessica",false,1,0,false,"MY",0,0,2,0,"DF"]
[null,null,null,null,null,null,null,null,null,null,null,null,null,null,null,null,null,null,null,null,null,null,null,null,null,null,365,0,0,0,0,0,0,3,0,1,"TA",347,0,"NOFEE","NOFEE",1,0,"","","LOK MING KHOON","WISMA GIAP CHEW, 3RD & 4TH FLOOR , 28 LEBUH GEREJA, 10200 PENANG."," ","10200           "," ","MY","","","019-3852778                                                                                                                                           ","                                                                                                                                                      ","750429-07-5519","","KLCI",0,0,0,0,0,"",0,"N/A",0,0,"N/A","N/A","N/A","N/A","N/A",0,40792.747129629628,"ken",false,1,0,false,"MY",0,0,2,0,"DF"]
[null,null,null,null,null,null,null,null,null,null,null,null,null,null,null,null,null,null,null,null,null,null,null,null,null,null,365,0,0,0,0,0,0,3,0,0,"TA",286,0,"NOFEE","NOFEE",1,0,"","","LIEW SOOK CHING","37 PSRN DESA JAYA 2,TAMAN DESA JAYA,31250 TG.RAMBUTAN.PERAK","PEIP","31250           ","PER","MY","","","                                                                                                                                                      ","                                                                                                                                                      ","","","KLSER",0,0,0,0,0,"",0,"N/A",0,0,"","","","","",0,41067.388127662038,"mazuin",false,1,1,false,"MY",0,0,15,0,"DF"]
[null,null,null,null,null,null,null,null,null,null,null,null,null,null,null,null,null,null,null,null,null,null,null,null,null,null,365,0,0,0,0,0,0,3,0,0,"TA",501,0,"NOFEE","NOFEE",1,0,"","","LIM THAM CHENG","No. 17, Solok Batu Uban 4, 11700 Gelugor, Pulau Pinang","PIGG","11700           ","PIN","MY","tclimalpha@po.jarong.my","","04-4891891                                                                                                                                            ","Ext. 212                                                                                                                                              ","510414-07-5345","","KLCI",0,0,0,0,0,"",0,"N/A",0,0,"","","","","",0,41072.384699618058,"jessica",false,1,1,false,"MY",0,0,2,0,"DF"]
[null,null,null,null,null,null,null,null,null,null,null,null,null,null,null,null,null,null,null,null,null,null,null,null,null,null,365,0,0,0,0,0,0,3,0,0,"TA",414,0,"NOFEE","NOFEE",1,0,"","","LIM YONG HEW","NO. 54, JALAN PUTERI 8/4, BANDAR PUTERI, 47100 PUCHONG, SELANGOR"," ","47100           ","SL","MY","","","                                                                                                                                                      ","                                                                                                                                                      ","591115-10-6225","","KLCI",0,0,0,0,0,"",0,"N/A",0,0,"N/A","N/A","N/A","N/A","N/A",0,40792.747361111113,"ken",false,1,0,false,"MY",0,0,2,0,"DF"]
[null,null,null,null,null,null,null,null,null,null,null,null,null,null,null,null,null,null,null,null,null,null,null,null,null,null,365,0,0,0,0,0,0,3,0,0,"TA",396,0,"NOFEE","NOFEE",1,0,"","","LYNN LIM KIM LUI","6, JALAN DAUN INAI 15, SUNWAY SPK DAMANSARA"," ","52200           "," ","MY","LYNNKI8@YAHOO.COM","","012-2822735                                                                                                                                           ","                                                                                                                                                      ","760814-14-5770","","KLCI",0,0,0,0,0,"",0,"N/A",0,0,"N/A","N/A","N/A","N/A","N/A",0,41100.407087384257,"mazuin",false,1,0,false,"MY",0,0,2,0,"DF"]
[null,null,null,null,null,null,null,null,null,null,null,null,null,null,null,null,null,null,null,null,null,null,null,null,null,null,365,0,0,0,0,0,0,3,0,0,"TA",330,0,"NOFEE","NOFEE",1,0,"","","MARILYN KHOO MEI LING","NO. 14, JALAN ANGGERIK ARANDA 31/7, SEKSYEN 31, KOTA KEMUNING, 40460 SHAH ALAM, SELANGOR"," ","40460           "," ","MY","","","                                                                                                                                                      ","                                                                                                                                                      ","681216-01-5188","","KLCI",0,0,0,0,0,"",0,"N/A",0,0,"N/A","N/A","N/A","N/A","N/A",0,40837.681400462963,"ken",false,1,0,false,"MY",0,0,2,0,"DF"]
[null,null,null,null,null,null,null,null,null,null,null,null,null,null,null,null,null,null,null,null,null,null,null,null,null,null,365,0,0,0,0,0,0,3,0,0,"TA",340,0,"NOFEE","NOFEE",1,0,"","","MOLLIE ONG SIEW CHOO","B26-1, SOUTH TOWER, HAMPSHIRE PARK 6-8, PERSIARAN HAMPSHIRE OFF JALAN AMPANG, KUALA LUMPUR"," ","50450           "," KL","MY","","","019-2330013                                                                                                                                           ","                                                                                                                                                      ","290822-07-5094","","KLCI",0,0,0,0,0,"",0,"N/A",0,0,"N/A","N/A","N/A","N/A","N/A",0,40792.748159722221,"ken",false,1,0,false,"MY",0,0,2,0,"DF"]
[null,null,null,null,null,null,null,null,null,null,null,null,null,null,null,null,null,null,null,null,null,null,null,null,null,null,365,0,0,0,0,0,0,3,0,0,"TA",278,0,"NOFEE","NOFEE",1,0,"","","MOHAMMED ZAHEER PATEL","28-26-A, Gurney Beach Resorts, Persiaran Gurney, 10250 Penang","","10250           ","PIN","MY","","","                                                                                                                                                      ","                                                                                                                                                      ","474030471","","KLCI",0,0,0,0,0,"",0,"N/A",0,0,"N/A","N/A","N/A","N/A","N/A",0,41156.383766701387,"mazuin",false,1,0,false,"MY",0,0,2,0,"DF"]
[null,null,null,null,null,null,null,null,null,null,null,null,null,null,null,null,null,null,null,null,null,null,null,null,null,null,365,0,0,0,0,0,0,3,0,0,"TA",279,0,"NOFEE","NOFEE",1,0,"","","NG AH BAH","1-D, JALAN BERIKSA SATU, BANDAR BARU, AIR ITAM, 11500 PULAU PINANG","  ","11500           ","PP","MY","","","016-4157528                                                                                                                                           ","                                                                                                                                                      ","551026-02-5489","","KLCI",0,0,0,0,0,"",0,"N/A",0,0,"N/A","N/A","N/A","N/A","N/A",0,41155.616893368053,"jessica",false,1,0,false,"MY",0,0,2,0,"DF"]
[null,null,null,null,null,null,null,null,null,null,null,null,null,null,null,null,null,null,null,null,null,null,null,null,null,null,365,0,0,0,0,0,0,3,0,0,"TA",280,0,"NOFEE","NOFEE",1,0,"","","NG GIEW POH","3346 KG. CROSS STREET, PERMATANG RAWA, 14000 BUKIT MERTAJAM, PENANG","  ","14000           ","PP","MY","","","017-9852505                                                                                                                                           ","                                                                                                                                                      ","591012-02-5174","","KLCI",0,0,0,0,0,"",0,"N/A",0,0,"N/A","N/A","N/A","N/A","N/A",0,41155.616998993057,"jessica",false,1,0,false,"MY",0,0,2,0,"DF"]
[null,null,null,null,null,null,null,null,null,null,null,null,null,null,null,null,null,null,null,null,null,null,null,null,null,null,365,0,0,0,0,0,0,3,0,0,"TA",305,0,"NOFEE","NOFEE",1,0,"","","NG HUANG LEAN & OOI YINN SHAUNG","23,JALAN 6/155A,BKT JALIL","WPKL","                ","WLP","MY","","","012-2086695                                                                                                                                           ","                                                                                                                                                      ","541015-07-5120","","KLSER",0,0,0,0,0,"",0,"N/A",0,0,"","","","","",0,41103.3734315162,"hanina",false,1,1,false,"MY",0,0,40922,0,"DF"]
[null,null,null,null,null,null,null,null,null,null,null,null,null,null,null,null,null,null,null,null,null,null,null,null,null,null,365,0,0,0,0,0,0,3,0,0,"TA",285,0,"NOFEE","NOFEE",1,0,"","","NG KIAN HENG","27F,BATU 1,JALAN BULOH KASAP,85000 SEGAMAT,JOHOR","JOSG","85000           ","JOH","MY","wilson_ng75@hotmail.com","","012-5381118                                                                                                                                           ","                                                                                                                                                      ","750517-04-5037","","KLSER",0,0,0,0,0,"",0,"N/A",0,0,"","","","","",0,41145.447052974538,"jessica",false,1,1,false,"MY",0,0,380,0,"DF"]
[null,null,null,null,null,null,null,null,null,null,null,null,null,null,null,null,null,null,null,null,null,null,null,null,null,null,365,0,0,0,0,0,0,3,0,0,"TA",395,0,"NOFEE","NOFEE",1,0,"","","NGAN SIEW LOON","22 JALAN BS 10/1, TAMAN BKT SERDANG, SEC 10, SRI KEMBANGAN, SELANGOR"," ","43300           ","SL","MY","","","                                                                                                                                                      ","                                                                                                                                                      ","711122-05-5140","","KLCI",0,0,0,0,0,"",0,"N/A",0,0,"N/A","N/A","N/A","N/A","N/A",0,41011.400927465278,"jessica",false,1,0,false,"MY",0,0,2,0,"DF"]
[null,null,null,null,null,null,null,null,null,null,null,null,null,null,null,null,null,null,null,null,null,null,null,null,null,null,365,0,0,0,0,0,0,3,0,0,"TA",398,0,"NOFEE","NOFEE",1,0,"","","NG SOON OI","NO.89, JALAN SS2/72, 47300 PETALING JAYA, SELANGOR, MALAYSIA"," ","47300           ","SL","MY","","","                                                                                                                                                      ","                                                                                                                                                      ","641226-10-6538","","KLCI",0,0,0,0,0,"",0,"N/A",0,0,"N/A","N/A","N/A","N/A","N/A",0,41050.382289780093,"mazuin",false,1,0,false,"MY",0,0,2,0,"DF"]
[null,null,null,null,null,null,null,null,null,null,null,null,null,null,null,null,null,null,null,null,null,null,null,null,null,null,365,0,0,0,0,0,0,3,0,0,"TA",245,0,"NOFEE","NOFEE",1,0,"","","NG TEIK HIN","49, JALN KENYALANG 11/8, PJU 5, KOTA DAMANSARA, 47810 PETALING JAYA, SELANGOR.","","47810           ","SEL","MY","","","                                                                                                                                                      ","                                                                                                                                                      ","560220-07-5481","","KLCI",0,0,0,0,0,"",0,"N/A",0,0,"N/A","N/A","N/A","N/A","N/A",0,41050.382414548614,"mazuin",false,1,0,false,"MY",0,0,2,0,"DF"]
[null,null,null,null,null,null,null,null,null,null,null,null,null,null,null,null,null,null,null,null,null,null,null,null,null,null,365,0,0,0,0,0,0,3,0,0,"TA",397,0,"NOFEE","NOFEE",1,0,"","","OOI KIM KHOON","40, LORONG AIR TERJUN, PENANG"," ","10350           ","PP","MY","","","012-4189996                                                                                                                                           ","                                                                                                                                                      ","830228-07-5141","","KLCI",0,0,0,0,0,"",0,"N/A",0,0,"N/A","N/A","N/A","N/A","N/A",0,40792.750381944446,"ken",false,1,0,false,"MY",0,0,2,0,"DF"]
[null,null,null,null,null,null,null,null,null,null,null,null,null,null,null,null,null,null,null,null,null,null,null,null,null,null,365,0,0,0,0,0,0,3,0,0,"TA",339,0,"NOFEE","NOFEE",1,0,"","","ONG SWEE LEE","23 LRG KENARI 13, DESARIA, BAYAN LEPAS, PENANG"," ","11900           "," ","MY","","","016-2218679                                                                                                                                           ","                                                                                                                                                      ","561020-07-5510","","KLCI",0,0,0,0,0,"",0,"N/A",0,0,"N/A","N/A","N/A","N/A","N/A",0,41155.617280127313,"jessica",false,1,0,false,"MY",0,0,2,0,"DF"]
[null,null,null,null,null,null,null,null,null,null,null,null,null,null,null,null,null,null,null,null,null,null,null,null,null,null,365,0,0,0,0,0,0,3,0,0,"TA",392,0,"NOFEE","NOFEE",1,0,"","","PETER YEW CHEONG ENG","C-06-08, PLAZA MON'T KIARA, NO.2 JALAN KIARA, MON'T KIARA, KUALA LUMPUR"," ","50480           ","KL","MY","","","                                                                                                                                                      ","                                                                                                                                                      ","680509-10-5537","","KLCI",0,0,0,0,0,"",0,"N/A",0,0,"N/A","N/A","N/A","N/A","N/A",0,41011.401092476852,"jessica",false,1,0,false,"MY",0,0,2,0,"DF"]
[null,null,null,null,null,null,null,null,null,null,null,null,null,null,null,null,null,null,null,null,null,null,null,null,null,null,365,0,0,0,0,0,0,3,0,0,"TA",330,0,"NOFEE","NOFEE",1,0,"","","SIEW KA KHEONG","B-11-2, BINJAI RESIDENCY, NO. 1 LORONG BINJAI 50450 KUALA LUMPUR"," ","                "," ","MY","","","019-3107539                                                                                                                                           ","                                                                                                                                                      ","600525-10-6617","","KLCI",0,0,0,0,0,"",0,"N/A",0,0,"N/A","N/A","N/A","N/A","N/A",0,41037.370217557873,"mazuin",false,1,0,false,"MY",0,0,2,0,"DF"]
[null,null,null,null,null,null,null,null,null,null,null,null,null,null,null,null,null,null,null,null,null,null,null,null,null,null,365,0,0,0,0,0,0,3,0,0,"TA",247,0,"NOFEE","NOFEE",1,0,"","","SUM TUCK CHEE","11-17-03, JALAN GANGSA, GREENLANE HEIGHTS, 11600 PENANG","","11600           ","PP","MY"," ","","04-6565039 / 012-4778542                                                                                                                              ","                                                                                                                                                      ","630413-07-5307","","KLCI",0,0,0,0,0,"",0,"N/A",0,0,"N/A","N/A","N/A","N/A","N/A",0,40837.673564814817,"ken",false,1,0,false,"MY",0,0,2,0,"DF"]
[null,null,null,null,null,null,null,null,null,null,null,null,null,null,null,null,null,null,null,null,null,null,null,null,null,null,365,0,0,0,0,0,0,3,0,0,"TA",246,0,"NOFEE","NOFEE",1,0,"","","SUM TUCK HOONG","138, JALAN PINTAL TALI, 10100 GEORGETOWN, PENANG","","10100           ","PP","MY"," ","","012-4813392                                                                                                                                           ","                                                                                                                                                      ","580529-07-5453","","KLCI",0,0,0,0,0,"",0,"N/A",0,0,"N/A","N/A","N/A","N/A","N/A",0,40837.675057870372,"ken",false,1,0,false,"MY",0,0,2,0,"DF"]
[null,null,null,null,null,null,null,null,null,null,null,null,null,null,null,null,null,null,null,null,null,null,null,null,null,null,365,0,0,0,0,0,0,3,0,0,"TA",306,0,"NOFEE","NOFEE",1,0,"","","SIK YEW WAI","3A,ELITIS PALMA,VALENCIA ","SEBH","47000           ","SEL","MY","","","012-2086695                                                                                                                                           ","                                                                                                                                                      ","610926-08-5473","","KLSER",0,0,0,0,0,"",0,"N/A",0,0,"","","","","",0,41102.397199305553,"jessica",false,1,1,false,"MY",0,0,40922,0,"DF"]
[null,null,null,null,null,null,null,null,null,null,null,null,null,null,null,null,null,null,null,null,null,null,null,null,null,null,365,0,0,0,0,0,0,3,0,0,"TA",271,0,"NOFEE","NOFEE",1,0,"","","TEE AH ENG","A19-8, 39 JALAN 1/76 DESA PANDAN  MUTIARA UPPER EAST , AMPANG KUALA LUPMUR","","55100           ","","MY","atee13@yahoo.com","","                                                                                                                                                      ","                                                                                                                                                      ","590516-10-5958","","KLCI",0,0,0,0,0,"",0,"N/A",0,0,"N/A","N/A","N/A","N/A","N/A",0,41050.382562962965,"mazuin",false,1,0,false,"MY",0,0,2,0,"DF"]
[null,null,null,null,null,null,null,null,null,null,null,null,null,null,null,null,null,null,null,null,null,null,null,null,null,null,365,0,0,0,0,0,0,3,0,0,"TA",291,0,"NOFEE","NOFEE",1,0,"","","MR TAN BAN BEN & MDM ONG SUAN POH","1 JALAN BESI.ASLAND PARK 11600 GEORGETOWN PULAU PINANG","PIGT","11600           ","PIN","MY","","","0134004916                                                                                                                                            ","                                                                                                                                                      ","490316-07-5549","","KLSER",0,0,0,0,0,"",0,"N/A",0,0,"","","","","",0,41155.617538310187,"jessica",false,1,1,false,"MY",0,0,40922,0,"DF"]
[null,null,null,null,null,null,null,null,null,null,null,null,null,null,null,null,null,null,null,null,null,null,null,null,null,null,365,0,0,0,0,0,0,3,0,0,"TA",392,0,"NOFEE","NOFEE",1,0,"","","TEH HOOI LENG","3, JALAN PERDANA RESIDENCE 2, TAMAN PERDANA RESIDENCE, BANDAR SELAYANG, BATU CAVES, SELANGOR."," ","68100           ","SL","MY","","","                                                                                                                                                      ","                                                                                                                                                      ","640322-08-5154","","KLCI",0,0,0,0,0,"",0,"N/A",0,0,"N/A","N/A","N/A","N/A","N/A",0,41011.401235300924,"jessica",false,1,0,false,"MY",0,0,2,0,"DF"]
[null,null,null,null,null,null,null,null,null,null,null,null,null,null,null,null,null,null,null,null,null,null,null,null,null,null,365,0,0,0,0,0,0,3,0,0,"TA",397,0,"NOFEE","NOFEE",1,0,"","","TAN PENG CHEONG","218, JALAN HUJAN EMAS, OUG, KUALA LUMPUR"," KL","58200           ","WP","MY","","","                                                                                                                                                      ","                                                                                                                                                      ","560823-04-5273","","KLCI",0,0,0,0,0,"",0,"N/A",0,0,"N/A","N/A","N/A","N/A","N/A",0,41011.401389664352,"jessica",false,1,0,false,"MY",0,0,2,0,"DF"]
[null,null,null,null,null,null,null,null,null,null,null,null,null,null,null,null,null,null,null,null,null,null,null,null,null,null,365,0,0,0,0,0,0,3,0,0,"TA",329,0,"NOFEE","NOFEE",1,0,"","","TENGKU ROBERT BIN TENGKU MOHD HAMZAH","5 SIMPANGAN TUNKU,  BUKIT TUNKU, 50480 KUALA LUMPUR"," ","50480           "," ","MY","","","                                                                                                                                                      ","                                                                                                                                                      ","390613-03-5027","","KLCI",0,0,0,0,0,"",0,"N/A",0,0,"N/A","N/A","N/A","N/A","N/A",0,41051.383538541668,"mazuin",false,1,0,false,"MY",0,0,2,0,"DF"]
[null,null,null,null,null,null,null,null,null,null,null,null,null,null,null,null,null,null,null,null,null,null,null,null,null,null,365,0,0,0,0,0,0,3,0,0,"TA",393,0,"NOFEE","NOFEE",1,0,"","","THAM WAI KEONG","18, JALAN TERATAI JINGGA, LOTUS OF THE MINES, KUALA LUMPUR"," ","57000           ","KL","MY","","","                                                                                                                                                      ","                                                                                                                                                      ","551119-10-6031","","KLCI",0,0,0,0,0,"",0,"N/A",0,0,"N/A","N/A","N/A","N/A","N/A",0,41011.40154421296,"jessica",false,1,0,false,"MY",0,0,2,0,"DF"]
[null,null,null,null,null,null,null,null,null,null,null,null,null,null,null,null,null,null,null,null,null,null,null,null,null,null,365,0,0,0,0,0,0,3,0,0,"TA",349,0,"NOFEE","NOFEE",1,0,"","","TYE CHWEE HOON","11 JALAN SERVICE, 10050 GEORGETOWN, PULAU PINANG"," ","10050           "," PP","MY","","","014-9429332                                                                                                                                           ","                                                                                                                                                      ","311227-07-5188","","KLCI",0,0,0,0,0,"",0,"N/A",0,0,"N/A","N/A","N/A","N/A","N/A",0,41155.617960104166,"jessica",false,1,0,false,"MY",0,0,2,0,"DF"]
[null,null,null,null,null,null,null,null,null,null,null,null,null,null,null,null,null,null,null,null,null,null,null,null,null,null,365,0,0,0,0,0,0,3,0,0,"TA",397,0,"NOFEE","NOFEE",1,0,"","","THONG YOKE TONG & YAP KOK LEONG@ YIP KOK LEONG","NO.23, JALAN BUKIT SEPUTEH 1, SEPUTEH HEIGHTS, KUALA LUMPUR"," ","58000           ","WP","MY","","","                                                                                                                                                      ","                                                                                                                                                      ","511227-10-5312","","KLCI",0,0,0,0,0,"",0,"N/A",0,0,"N/A","N/A","N/A","N/A","N/A",0,41003.399586921296,"mazuin",false,1,0,false,"MY",0,0,2,0,"DF"]
[null,null,null,null,null,null,null,null,null,null,null,null,null,null,null,null,null,null,null,null,null,null,null,null,null,null,365,0,0,0,0,0,0,3,0,0,"TA",349,0,"NOFEE","NOFEE",1,0,"","","WONG CHEW HAR","25, LINTANG DELIMA 13, ISLANO GLADES, 11700 GELUGOR, PENANG"," ","11700           "," PP","MY","","","                                                                                                                                                      ","                                                                                                                                                      ","520831-08-5412","","KLCI",0,0,0,0,0,"",0,"N/A",0,0,"N/A","N/A","N/A","N/A","N/A",0,41155.618118252314,"jessica",false,1,0,false,"MY",0,0,2,0,"DF"]
[null,null,null,null,null,null,null,null,null,null,null,null,null,null,null,null,null,null,null,null,null,null,null,null,null,null,365,0,0,0,0,0,0,3,0,0,"TA",416,0,"NOFEE","NOFEE",1,0,"","","WONG KANG WAI","NO. 10, JALAN BPP 6/4, PUSAT BANDAR PUTRA PERMAI, 43300 SERI KEMBANGAN, SELANGOR."," ","43300           ","SL","MY","","","019-2285082                                                                                                                                           ","                                                                                                                                                      ","630802-10-7595","","KLCI",0,0,0,0,0,"",0,"N/A",0,0,"N/A","N/A","N/A","N/A","N/A",0,41148.386914618059,"jessica",false,1,0,false,"MY",0,0,2,0,"DF"]
[null,null,null,null,null,null,null,null,null,null,null,null,null,null,null,null,null,null,null,null,null,null,null,null,null,null,365,0,0,0,0,0,0,3,0,0,"TA",346,0,"NOFEE","NOFEE",1,0,"","","WONG TUCK WAI","13, JALAN 31/79A, KOTA KEMUNING, 40460 SHAH ALAM, SELANGOR","SESA","40460           ","SEL","MY","","","                                                                                                                                                      ","                                                                                                                                                      ","550427-08-5637","","KLCI",0,0,0,0,0,"",0,"N/A",0,0,"N/A","N/A","N/A","N/A","N/A",0,41165.418016354168,"jessica",false,1,0,false,"MY",0,0,2,0,"DF"]
[null,null,null,null,null,null,null,null,null,null,null,null,null,null,null,null,null,null,null,null,null,null,null,null,null,null,365,0,0,0,0,0,0,3,0,0,"TA",292,0,"NOFEE","NOFEE",1,0,"","","MR YONG HON KONG & MDM LEONG KIM HONG","62 PERSIARAN JANGGUS,TAMAN PADANG LALLANG 14000 BUKIT MERTAJAM,PULAU PINANG","PIBM","14000           ","PIN","MY","","","016-4180424                                                                                                                                           ","                                                                                                                                                      ","610825-07-5783","","KLSER",0,0,0,0,0,"",0,"N/A",0,0,"","","","","",0,41155.618275891204,"jessica",false,1,1,false,"MY",0,0,40922,0,"DF"]
[null,null,null,null,null,null,null,null,null,null,null,null,null,null,null,null,null,null,null,null,null,null,null,null,null,null,365,0,0,0,0,0,0,3,0,0,"TA",398,0,"NOFEE","NOFEE",1,0,"","","YAP KIM FAH","NO.2 JALAN 10, TAMAN BARU, SUBANG,40000 SHAH ALAM"," ","40000           ","SL","MY","","","012-2992969                                                                                                                                           ","                                                                                                                                                      ","700831-10-5389","","KLCI",0,0,0,0,0,"",0,"N/A",0,0,"N/A","N/A","N/A","N/A","N/A",0,41155.395180173611,"jessica",false,1,0,false,"MY",0,0,2,0,"DF"]
[null,null,null,null,null,null,null,null,null,null,null,null,null,null,null,null,null,null,null,null,null,null,null,null,null,null,365,0,0,0,0,0,0,3,0,1,"TA",396,0,"NOFEE","NOFEE",1,0,"","","YAP KOK LEONG@ YIP KOK LEONG &THONG YOKE TONG","NO.23, JALAN BUKIT SEPUTEH 1, SEPUTEH HEIGHTS, KUALA LUMPUR"," ","58000           ","WP","MY","","","                                                                                                                                                      ","                                                                                                                                                      ","460417-10-5199","","KLCI",0,0,0,0,0,"",0,"N/A",1,1,"N/A","N/A","N/A","N/A","N/A",0,40792.763148148151,"ken",false,1,1,false,"MY",0,0,2,0,"DF"]
[null,null,null,null,null,null,null,null,null,null,null,null,null,null,null,null,null,null,null,null,null,null,null,null,null,null,365,0,0,0,0,0,0,3,0,0,"TA",244,0,"NOFEE","NOFEE",1,0,"","","YEAP PIH CHU","11-17-03, JALAN GANGSA, GREENLANE HEIGHTS, 11600 PENANG","","11600           ","PP","MY","cheryyeap65@yahoo.com","","04-6565039 / 012-4778542                                                                                                                              ","                                                                                                                                                      ","650621-07-5596","","KLCI",0,0,0,0,0,"",0,"N/A",0,0,"N/A","N/A","N/A","N/A","N/A",0,40837.678379629629,"ken",false,1,0,false,"MY",0,0,2,0,"DF"]
[null,null,null,null,null,null,null,null,null,null,null,null,null,null,null,null,null,null,null,null,null,null,null,null,null,null,365,0,0,0,0,0,0,3,0,0,"TA",245,0,"NOFEE","NOFEE",1,0,"","","YEOH PHAIK SEOK","35, CANGKAT RIA, BATU FERINGHI, 11100 PENANG","","11100           ","PP","MY","lisatang@gamil.com","","016-4015168 / 04-8998317                                                                                                                              ","                                                                                                                                                      ","620625-07-5270","","KLCI",0,0,0,0,0,"",0,"N/A",0,0,"N/A","N/A","N/A","N/A","N/A",0,40809.414780092593,"hanina",false,1,0,false,"MY",0,0,2,0,"DF"]
[null,null,null,null,null,null,null,null,null,null,null,null,null,null,null,null,null,null,null,null,null,null,null,null,null,null,365,0,0,0,0,0,0,3,0,0,"TA",69,0,"NOFEE","NOFEE",1,0,"","","MS  KIMMY KHOO","Director, Taejas Holdings Sdn Bhd 34th Floor, Menara TA One, 22 Jalan P.Ramlee,","WPKL","50250           ","WLP","MY","","","03-20721277(1118)                                                                                                                                     ","03-20316608                                                                                                                                           ","","","KLCI",0,0,0,0,0,"",0,"N/A",0,0,"N/A","N/A","N/A","N/A","N/A",0,40928.457028900462,"mazuin",false,1,0,false,"MY",0,0,2,0,"DF"]
[null,null,null,null,null,null,null,null,null,null,null,null,null,null,null,null,null,null,null,null,null,null,null,null,null,null,365,0,0,0,0,0,0,3,0,1,"TA",372,0,"NOFEE","NOFEE",1,0,"","","TAN KUAY GEOK","C/O TAE. 35TH FLR, MENARA TA ONE, 22 JLN. P. RAMLEE","KL","50250           ","WP","MY","","","012-6482827                                                                                                                                           ","                                                                                                                                                      ","540331-07-5216","","KLCI",0,0,0,0,0,"",0,"N/A",0,0,"N/A","N/A","N/A","N/A","N/A",0,40294.688784722224,"mazuin",false,1,0,false,"MY",0,0,2,0,"DF"]
[null,null,null,null,null,null,null,null,null,null,null,null,null,null,null,null,null,null,null,null,null,null,null,null,null,null,365,0,0,0,0,0,0,3,0,0,"TA",10,0,"NOFEE","NOFEE",1,0,"","","TAN KUAN LEONG","NO.81, JALAN WAWASAN 3/13, PUSAT BANDAR PUCHONG","SEL.","47100           ","","MA","","","016-2172888                                                                                                                                           ","03-80619027                                                                                                                                           ","730410-14-5291","","KLCI",0,0,0,0,0,"",0,"N/A",0,0,"N/A","N/A","N/A","N/A","N/A",0,40855.483888888892,"ken",false,1,0,false,"MY",0,0,2,0,"DF"]
[null,null,null,null,null,null,null,null,null,null,null,null,null,null,null,null,null,null,null,null,null,null,null,null,null,null,365,0,0,0,0,0,0,3,0,1,"TA",70,0,"NOFEE","NOFEE",1,0,"","","MS TIAH LIEW KHAIM","NO.113, JALAN ATHINAHAPAN DUA, TAMAN TUN DR ISMAIL,","WPKL","60000           ","WLP","MY","","","                                                                                                                                                      ","                                                                                                                                                      ","","","KLCI",0,0,0,0,0,"",0,"N/A",0,0,"N/A","N/A","N/A","N/A","N/A",0,39919.685057870367,"mazuin",false,1,0,false,"MY",0,0,2,0,"DF"]
[null,null,null,null,null,null,null,null,null,null,null,null,null,null,null,null,null,null,null,null,null,null,null,null,null,null,365,0,0,0,0,0,0,3,0,0,"TA",50,0,"NOFEE","NOFEE",1,0,"","","TAN SU HUN","NO.81, JALAN WAWASAN 3/13, PUSAT BANDAR PUCHONG","SEL.","47100           ","","MA","","","016-6688221                                                                                                                                           ","                                                                                                                                                      ","730719-10-5626","","KLCI",0,0,0,0,0,"",0,"N/A",0,0,"N/A","N/A","N/A","N/A","N/A",0,40855.484074074076,"ken",false,1,0,false,"MY",0,0,2,0,"DF"]
[null,null,null,null,null,null,null,null,null,null,null,null,null,null,null,null,null,null,null,null,null,null,null,null,null,null,365,0,0,0,0,0,0,3,0,1,"TA",71,0,"NOFEE","NOFEE",1,0,"","","","","","                ","","","","","                                                                                                                                                      ","                                                                                                                                                      ","","","KLCI",0,0,0,0,0,"",0,"N/A",0,0,"N/A","N/A","N/A","N/A","N/A",0,39919.68513888889,"mazuin",false,1,0,false,"MY",0,0,2,0,"DF"]
[null,null,null,null,null,null,null,null,null,null,null,null,null,null,null,null,null,null,null,null,null,null,null,null,null,null,365,0,0,0,0,0,0,3,0,0,"TA",72,0,"NOFEE","NOFEE",1,0,"","","MS EE YEW LING ","Block SO-04, Jalan Pinggiran 2/7, Taman Pinggiran,","SEBC","68100           ","SEL","MY","","","017-6209997                                                                                                                                           ","                                                                                                                                                      ","","","KLCI",0,0,0,0,0,"",0,"N/A",0,0,"N/A","N/A","N/A","N/A","N/A",0,41151.406375381943,"mazuin",false,1,0,false,"MY",0,0,2,0,"DF"]
[null,null,null,null,null,null,null,null,null,null,null,null,null,null,null,null,null,null,null,null,null,null,null,null,null,null,365,0,0,0,0,0,0,3,0,-1,"TA",73,0,"NOFEE","NOFEE",1,0,"","","","","","                ","","","","","                                                                                                                                                      ","                                                                                                                                                      ","","","KLCI",0,0,0,0,0,"",0,"N/A",0,0,"N/A","N/A","N/A","N/A","N/A",0,40928.412574803238,"mazuin",false,1,0,false,"MY",0,0,2,0,"DF"]
[null,null,null,null,null,null,null,null,null,null,null,null,null,null,null,null,null,null,null,null,null,null,null,null,null,null,365,0,0,0,0,0,0,3,0,-1,"TA",74,0,"NOFEE","NOFEE",1,0,"","","DR WAN CHAN BUN","No.3 Jalan SS2/54,","SEPJ","47300           ","SEL","MY","","","                                                                                                                                                      ","                                                                                                                                                      ","","","KLCI",0,0,0,0,0,"",0,"N/A",0,0,"N/A","N/A","N/A","N/A","N/A",0,40928.413620949075,"mazuin",false,1,0,false,"MY",0,0,2,0,"DF"]
[null,null,null,null,null,null,null,null,null,null,null,null,null,null,null,null,null,null,null,null,null,null,null,null,null,null,365,0,0,0,0,0,0,3,0,0,"TA",300,0,"NOFEE","NOFEE",1,0,"","","WONG CHIN YUEN","10, JALAN PJU 1A/26A, ARA DAMANSARA","PJ","47301           ","SEL","MY","wongchinyuen@hotmail.com","","012-3778013/03-22459908                                                                                                                               ","                                                                                                                                                      ","750908-08-5271","","KLCI",0,0,0,0,0,"",0,"N/A",0,0,"N/A","N/A","N/A","N/A","N/A",0,41040.391587881946,"mazuin",false,1,0,false,"MY",0,0,2,0,"DF"]
[null,null,null,null,null,null,null,null,null,null,null,null,null,null,null,null,null,null,null,null,null,null,null,null,null,null,365,0,0,0,0,0,0,3,0,0,"TA",206,0,"NOFEE","NOFEE",1,0,"","","LIM WEI FOOK","25, PERSIARAN INDUSTRI, BANDAR SRI DAMANSARA","KL","52200           ","WP","MY","CATHAYGP@TM.NET.MY","","019-2205818                                                                                                                                           ","03-62723300                                                                                                                                           ","560423-10-5521","","KLCI",0,0,0,0,0,"",0,"N/A",0,0,"N/A","N/A","N/A","N/A","N/A",0,41122.380893287038,"jessica",false,1,0,false,"MY",0,0,2,0,"DF"]
[null,null,null,null,null,null,null,null,null,null,null,null,null,null,null,null,null,null,null,null,null,null,null,null,null,null,365,0,0,0,0,0,0,3,0,0,"TA",55,0,"NOFEE","NOFEE",1,0,"","","WONG HOO KOI","288, JALAN USJ 3/4, SUBANG JAYA","SJ","47600           ","SEL.","","jimmyw@sunway.com.my","","019-2662132                                                                                                                                           ","03-56399293                                                                                                                                           ","640811-10-6729","","KLCI",0,0,0,0,0,"",0,"N/A",0,0,"N/A","N/A","N/A","N/A","N/A",0,40855.484930555554,"ken",false,1,0,false,"MY",0,0,2,0,"DF"]
[null,null,null,null,null,null,null,null,null,null,null,null,null,null,null,null,null,null,null,null,null,null,null,null,null,null,365,0,0,0,0,0,0,3,0,-1,"TA",75,0,"NOFEE","NOFEE",1,0,"","","MR WILLIAM A/L C D GNANA ARUL","B-1-3 Vista Kiara, Sri Hartamas,","WPKL","50480           ","WLP","MY","","","                                                                                                                                                      ","                                                                                                                                                      ","","","KLCI",0,0,0,0,0,"",0,"N/A",0,0,"N/A","N/A","N/A","N/A","N/A",0,40928.413458796298,"mazuin",false,1,0,false,"MY",0,0,2,0,"DF"]
[null,null,null,null,null,null,null,null,null,null,null,null,null,null,null,null,null,null,null,null,null,null,null,null,null,null,365,0,0,0,0,0,0,3,0,0,"TA",76,0,"NOFEE","NOFEE",1,0,"","","MR WILLIAM A/L C D GNANA ARUL","B-1-3 Vista Kiara, Sri Hartamas,","WPKL","50480           ","WLP","MY","","","03-62316206                                                                                                                                           ","012-2269422                                                                                                                                           ","551202-10-5953","","KLCI",0,0,0,0,0,"",0,"N/A",0,0,"N/A","N/A","N/A","N/A","N/A",0,40928.458459456022,"mazuin",false,1,0,false,"MY",0,0,2,0,"DF"]
[null,null,null,null,null,null,null,null,null,null,null,null,null,null,null,null,null,null,null,null,null,null,null,null,null,null,365,0,0,0,0,0,0,3,0,0,"TA",78,0,"NOFEE","NOFEE",1,0,"","","MR WILLIAM A/L C D GNANA ARUL","B-1-3 Vista Kiara, Sri Hartamas,","WPKL","50480           ","WLP","MY","","","03-62316206                                                                                                                                           ","012-2269422                                                                                                                                           ","","","KLCI",0,0,0,0,0,"",0,"N/A",0,0,"N/A","N/A","N/A","N/A","N/A",0,40855.485127314816,"ken",false,1,0,false,"MY",0,0,2,0,"DF"]
[null,null,null,null,null,null,null,null,null,null,null,null,null,null,null,null,null,null,null,null,null,null,null,null,null,null,365,0,0,0,0,0,0,3,0,0,"TA",100,0,"NOFEE","NOFEE",1,0,"","","MR. WONG JOON NAM","NO 6887 VISION HEIGHTS, JALAN TOK UNGKU","NGSB","70100           ","NEG","MY","wjnmonostgy3@yahoo.com","","012-2103327                                                                                                                                           ","                                                                                                                                                      ","660225-01-5187","","KLCI",0,0,0,0,0,"",0,"N/A",0,0,"N/A","N/A","N/A","N/A","N/A",0,41166.39396238426,"mazuin",false,1,1,false,"MY",0,0,2,0,"DF"]
[null,null,null,null,null,null,null,null,null,null,null,null,null,null,null,null,null,null,null,null,null,null,null,null,null,null,365,0,0,0,0,0,0,3,0,-1,"TA",77,0,"NOFEE","NOFEE",1,0,"","","MR PHILIP TAN POH OON","CHARTERED ACCOUNTANTS, NO.16-2A, SECOND FLOOR, JALAN 1/76D, DESA PANDAN,","WPKL","55100           ","WLP","MY","","","                                                                                                                                                      ","                                                                                                                                                      ","","","KLCI",0,0,0,0,0,"",0,"N/A",0,0,"N/A","N/A","N/A","N/A","N/A",0,40928.412862418983,"mazuin",false,1,0,false,"MY",0,0,2,0,"DF"]
[null,null,null,null,null,null,null,null,null,null,null,null,null,null,null,null,null,null,null,null,null,null,null,null,null,null,365,0,0,0,0,0,0,3,0,0,"TA",90,0,"NOFEE","NOFEE",1,0,"","","MR WONG WING KEEN","286, Lorong Maarof, Bangsar","KL","59000           ","KL","MY","wkeenw@yahoo.com.uk","","0                                                                                                                                                     ","019-3388882                                                                                                                                           ","501017-10-5235","","KLCI",0,0,0,0,0,"",0,"N/A",0,0,"N/A","N/A","N/A","N/A","N/A",0,40949.646465474536,"mazuin",false,1,0,false,"MY",0,0,2,0,"DF"]
[null,null,null,null,null,null,null,null,null,null,null,null,null,null,null,null,null,null,null,null,null,null,null,null,null,null,365,0,0,0,0,0,0,3,0,0,"TA",392,0,"NOFEE","NOFEE",1,0,"","","YEONG FOONG YING","7 JALAN PERDANA 2/24, PANDAN PERDANA"," KL","55300           ","WP","MY","","","016-6960781                                                                                                                                           ","                                                                                                                                                      ","620102-08-6798","","KLCI",0,0,0,0,0,"",0,"N/A",0,0,"N/A","N/A","N/A","N/A","N/A",0,40855.485509259262,"ken",false,1,0,false,"MY",0,0,2,0,"DF"]
[null,null,null,null,null,null,null,null,null,null,null,null,null,null,null,null,null,null,null,null,null,null,null,null,null,null,365,0,0,0,0,0,0,3,0,-1,"TA",78,0,"NOFEE","NOFEE",1,0,"","","MADAM YAP MOOI","18 Jalan SS22/20B, Damansara Jaya,","SEPJ","47400           ","SEL","MY","at new york","","00-17188714556                                                                                                                                        ","00-13472917484                                                                                                                                        ","","","KLCI",0,0,0,0,0,"",0,"N/A",0,0,"N/A","N/A","N/A","N/A","N/A",0,40928.457941631947,"mazuin",false,1,0,false,"MY",0,0,2,0,"DF"]
[null,null,null,null,null,null,null,null,null,null,null,null,null,null,null,null,null,null,null,null,null,null,null,null,null,null,365,0,0,0,0,0,0,3,0,0,"TA",79,0,"NOFEE","NOFEE",1,0,"","","MR ANDI FRANCIS KATHIL TOYONG","FINANCIAL CONTROLLER, Yayasan Sabah, 19th Floor, Bangunan Yayasan Sabah, Likas Bay, P.O.Box 11201,","SBKK","88813           ","SAB","MY","","","                                                                                                                                                      ","                                                                                                                                                      ","","","KLCI",0,0,0,0,0,"",0,"N/A",0,0,"N/A","N/A","N/A","N/A","N/A",0,40928.457651851852,"mazuin",false,1,0,false,"MY",0,0,2,0,"DF"]
[null,null,null,null,null,null,null,null,null,null,null,null,null,null,null,null,null,null,null,null,null,null,null,null,null,null,365,0,0,0,0,0,0,3,0,0,"TA",80,0,"NOFEE","NOFEE",1,0,"","","MR ANDI FRANCIS KATHIL TOYONG","FINANCIAL CONTROLLER, Yayasan Sabah, 19th Floor, Bangunan Yayasan Sabah, Likas Bay, P.O.Box 11201,","SBKK","88813           ","SAB","MY","","","                                                                                                                                                      ","                                                                                                                                                      ","","","KLCI",0,0,0,0,0,"",0,"N/A",0,0,"N/A","N/A","N/A","N/A","N/A",0,40928.457529050924,"mazuin",false,1,0,false,"MY",0,0,2,0,"DF"]
[null,null,null,null,null,null,null,null,null,null,null,null,null,null,null,null,null,null,null,null,null,null,null,null,null,null,365,0,0,0,0,0,0,3,0,1,"TA",81,0,"NOFEE","NOFEE",1,0,"","","MR ANDI FRANCIS KATHIL TOYONG","FINANCIAL CONTROLLER, Yayasan Sabah, 19th Floor, Bangunan Yayasan Sabah, Likas Bay, P.O.Box 11201,","SBKK","88813           ","SAB","MY","","","                                                                                                                                                      ","                                                                                                                                                      ","","","KLCI",0,0,0,0,0,"",0,"N/A",0,0,"N/A","N/A","N/A","N/A","N/A",0,39919.693518518521,"mazuin",false,1,0,false,"MY",0,0,2,0,"DF"]
[null,null,null,null,null,null,null,null,null,null,null,null,null,null,null,null,null,null,null,null,null,null,null,null,null,null,365,0,0,0,0,0,0,3,0,0,"TA",340,0,"NOFEE","NOFEE",1,0,"","","YAP SEE TAI","LOT NO. 10740, JALAN 5 HAPPY GARDEN (DESA POS), KAJANG"," ","43000           ","SL","MY","","","012-2539993                                                                                                                                           ","                                                                                                                                                      ","490901-10-5366","","KLCI",0,0,0,0,0,"",0,"N/A",0,0,"N/A","N/A","N/A","N/A","N/A",0,40855.485775462963,"ken",false,1,0,false,"MY",0,0,2,0,"DF"]
[null,null,null,null,null,null,null,null,null,null,null,null,null,null,null,null,null,null,null,null,null,null,null,null,null,null,365,0,0,0,0,0,0,0,0,1,"TA",0,0,"NOFEE","NOFEE",0,0,"","","","","","                ","","","","","                                                                                                                                                      ","                                                                                                                                                      ","","","KLCI",0,0,0,0,0,"",0,"N/A",0,0,"N/A","N/A","N/A","N/A","N/A",0,39192.47252314815,"mazuin",false,0,0,false,"MY",0,0,2,0,"DF"]

{"sheet":"InAccByFundHst","index":14,"n_rows":30,"n_cols":38,"rows_kept":30,"cut":false,"hidden":true,"merged":[]}
[]
["number","AccountCAT","unit","amt","category","qFundCode",null,null,null,null,null,null,null,null,null,null,null,null,null,null,null,null,null,null,null,null,"SettlementLag","LaunchDate","MinFundSize","MinInvestment","MinAccBalance","InitialOfferPeriod","MaturityDate","FinancialYearEnd","DistributionPolicy","InvestmentPolicy","LastKeyInBy","LastKeyInDate"]
[1,"CUTAInst","00:00:00","00:00:00","CUTAInst","KFHICASH",null,null,null,null,null,null,null,null,null,null,null,null,null,null,null,null,null,null,null,null,1,"2010-01-01",1000,10,10,"2010-01-01","2010-01-01","2010-01-01","A","A","mich",40179]
[1,"IntNRP","1908-03-18","1908-03-18T15:02:52.800","IntNRP","KFHICASH",null,null,null,null,null,null,null,null,null,null,null,null,null,null,null,null,null,null,null,null,1,"2010-01-01",1000,10,10,"2010-01-01","2010-01-01","2010-01-01","A","A","admin",41380.760338969907]
[null,null,null,null,null,null,null,null,null,null,null,null,null,null,null,null,null,null,null,null,null,null,null,null,null,null,1,"2010-01-01",1000,10,10,"2010-01-01","2010-01-01","2010-01-01","A","A","mich",40179]
[null,null,null,null,null,null,null,null,null,null,null,null,null,null,null,null,null,null,null,null,null,null,null,null,null,null,1,"2010-01-01",1000,10,10,"2010-01-01","2010-01-01","2010-01-01","A","A","mich",40179]
[null,null,null,null,null,null,null,null,null,null,null,null,null,null,null,null,null,null,null,null,null,null,null,null,null,null,1,"2010-01-01",1000,10,10,"2010-01-01","2010-01-01","2010-01-01","A","A","leann",41368.662719907406]
[null,null,null,null,null,null,null,null,null,null,null,null,null,null,null,null,null,null,null,null,null,null,null,null,null,null,1,"2010-01-01",1000,10,10,"2010-01-01","2010-01-01","2010-01-01","A","A","leann",41358.635162037041]
[null,null,null,null,null,null,null,null,null,null,null,null,null,null,null,null,null,null,null,null,null,null,null,null,null,null,1,"2010-01-01",1000,10,10,"2010-01-01","2010-01-01","2010-01-01","A","A","leann",41351.46429398148]
[null,null,null,null,null,null,null,null,null,null,null,null,null,null,null,null,null,null,null,null,null,null,null,null,null,null,1,"2010-01-01",1000,10,10,"2010-01-01","2010-01-01","2010-01-01","A","A","mich",40179]
[null,null,null,null,null,null,null,null,null,null,null,null,null,null,null,null,null,null,null,null,null,null,null,null,null,null,1,"2010-01-01",1000,10,10,"2010-01-01","2010-01-01","2010-01-01","A","A","mich",40179]
[null,null,null,null,null,null,null,null,null,null,null,null,null,null,null,null,null,null,null,null,null,null,null,null,null,null,1,"2010-01-01",1000,10,10,"2010-01-01","2010-01-01","2010-01-01","A","A","mich",40179]
[null,null,null,null,null,null,null,null,null,null,null,null,null,null,null,null,null,null,null,null,null,null,null,null,null,null,1,"2010-01-01",1000,10,10,"2010-01-01","2010-01-01","2010-01-01","A","A","leann",41368.662835648145]
[null,null,null,null,null,null,null,null,null,null,null,null,null,null,null,null,null,null,null,null,null,null,null,null,null,null,1,"2010-01-01",1000,10,10,"2010-01-01","2010-01-01","2010-01-01","A","A","mich",40179]
[null,null,null,null,null,null,null,null,null,null,null,null,null,null,null,null,null,null,null,null,null,null,null,null,null,null,1,"2010-01-01",1000,10,10,"2010-01-01","2010-01-01","2010-01-01","A","A","mich",40179]
[null,null,null,null,null,null,null,null,null,null,null,null,null,null,null,null,null,null,null,null,null,null,null,null,null,null,1,"2010-01-01",1000,10,10,"2010-01-01","2010-01-01","2010-01-01","A","A","mich",40179]
[null,null,null,null,null,null,null,null,null,null,null,null,null,null,null,null,null,null,null,null,null,null,null,null,null,null,1,"2010-01-01",1000,10,10,"2010-01-01","2010-01-01","2010-01-01","A","A","admin",41043.510740740741]
[null,null,null,null,null,null,null,null,null,null,null,null,null,null,null,null,null,null,null,null,null,null,null,null,null,null,1,"2010-01-01",1000,10,10,"2010-01-01","2010-01-01","2010-01-01","A","A","mich",40179]
[null,null,null,null,null,null,null,null,null,null,null,null,null,null,null,null,null,null,null,null,null,null,null,null,null,null,1,"3000-01-01",1,100,1,"3000-01-01","3000-01-01","3000-01-01","1","1","leann",41366.758275462962]
[null,null,null,null,null,null,null,null,null,null,null,null,null,null,null,null,null,null,null,null,null,null,null,null,null,null,1,"0001-01-01",1,2,0,"0001-01-01","0001-01-01","0001-01-01","B","B","mich",40983]
[null,null,null,null,null,null,null,null,null,null,null,null,null,null,null,null,null,null,null,null,null,null,null,null,null,null,2,"3000-01-01",10000000,10000,10000,"3000-01-01","3000-01-01","3000-01-01","1234","1234","jess",41081.777129629627]
[null,null,null,null,null,null,null,null,null,null,null,null,null,null,null,null,null,null,null,null,null,null,null,null,null,null,1,"2011-05-15",10000000000000,1000,10000,"2011-07-15","3000-01-01","2012-06-15","123456789123456789123456789123456789123456789","123","jess",41082.528252314813]
[null,null,null,null,null,null,null,null,null,null,null,null,null,null,null,null,null,null,null,null,null,null,null,null,null,null,3,"2003-01-01",10000000000,1000,1000,"2003-03-01","2023-01-01","2013-01-01","1234","123","jess",41082.526643518519]
[null,null,null,null,null,null,null,null,null,null,null,null,null,null,null,null,null,null,null,null,null,null,null,null,null,null,3,"2002-01-01",10000000000,1000,1000,"2002-03-01","2022-01-01","2012-01-01","1234","123","jess",41082.51871527778]
[null,null,null,null,null,null,null,null,null,null,null,null,null,null,null,null,null,null,null,null,null,null,null,null,null,null,1,"2011-06-15",10000000000000,1000,10000,"2011-07-15","3000-01-01","2012-06-15","123456789123456789123456789123456789123456789","123","jess",41075.733020833337]
[null,null,null,null,null,null,null,null,null,null,null,null,null,null,null,null,null,null,null,null,null,null,null,null,null,null,1,"2010-03-15",10000000000000,1000,10000,"2011-07-15","3000-01-01","2012-03-15","123456789123456789123456789123456789123456789","123","jess",41082.530300925922]
[null,null,null,null,null,null,null,null,null,null,null,null,null,null,null,null,null,null,null,null,null,null,null,null,null,null,1,"2010-06-15",10000000000000,1000,10000,"2010-07-15","3000-01-01","2012-06-15","123456789123456789123456789123456789123456789","123","jess",41082.527349537035]
[null,null,null,null,null,null,null,null,null,null,null,null,null,null,null,null,null,null,null,null,null,null,null,null,null,null,3,"2002-06-01",10000000000,1000,1000,"2002-03-01","2022-06-01","2012-06-01","1234","123","jess",41082.521817129629]
[null,null,null,null,null,null,null,null,null,null,null,null,null,null,null,null,null,null,null,null,null,null,null,null,null,null,3,"2003-03-01",10000000000,1000,1000,"2003-04-01","2022-01-01","2012-03-01","1234","123","jess",41082.53261574074]
[null,null,null,null,null,null,null,null,null,null,null,null,null,null,null,null,null,null,null,null,null,null,null,null,null,null,3,"2002-01-01",10000000000,1000,1000,"2002-03-01","2022-01-01","2012-01-01","1234","123","jess",41082.51871527778]